2022-10-21 05:51:16.924 INFO  (main) [   ] o.e.j.u.log Logging initialized @981ms to org.eclipse.jetty.util.log.Slf4jLog
2022-10-21 05:51:17.169 INFO  (main) [   ] o.e.j.s.Server jetty-9.4.44.v20210927; built: 2021-09-27T23:02:44.612Z; git: 8da83308eeca865e495e53ef315a249d63ba9332; jvm 11.0.17+8-LTS-sapmachine
2022-10-21 05:51:17.179 INFO  (main) [   ] o.e.j.d.p.ScanningAppProvider Deployment monitor [file:///home/trails/IdeaProjects/sap_commerce_2105/hybris/bin/modules/search-and-navigation/solrserver/resources/solr/8.11/server/server/contexts/] at interval 0
2022-10-21 05:51:17.340 INFO  (main) [   ] o.e.j.w.StandardDescriptorProcessor NO JSP Support for /solr, did not find org.apache.jasper.servlet.JspServlet
2022-10-21 05:51:17.350 INFO  (main) [   ] o.e.j.s.session DefaultSessionIdManager workerName=node0
2022-10-21 05:51:17.350 INFO  (main) [   ] o.e.j.s.session No SessionScavenger set, using defaults
2022-10-21 05:51:17.352 INFO  (main) [   ] o.e.j.s.session node0 Scavenging every 660000ms
2022-10-21 05:51:17.391 INFO  (main) [   ] o.a.s.u.c.SSLConfigurations Setting javax.net.ssl.keyStorePassword
2022-10-21 05:51:17.391 INFO  (main) [   ] o.a.s.u.c.SSLConfigurations Setting javax.net.ssl.trustStorePassword
2022-10-21 05:51:17.397 INFO  (main) [   ] o.a.s.s.SolrDispatchFilter Using logger factory org.apache.logging.slf4j.Log4jLoggerFactory
2022-10-21 05:51:17.400 INFO  (main) [   ] o.a.s.s.SolrDispatchFilter  ___      _       Welcome to Apache Solr™ version 8.11.1
2022-10-21 05:51:17.400 INFO  (main) [   ] o.a.s.s.SolrDispatchFilter / __| ___| |_ _   Starting in standalone mode on port 8983
2022-10-21 05:51:17.400 INFO  (main) [   ] o.a.s.s.SolrDispatchFilter \__ \/ _ \ | '_|  Install dir: /home/trails/IdeaProjects/sap_commerce_2105/hybris/bin/modules/search-and-navigation/solrserver/resources/solr/8.11/server
2022-10-21 05:51:17.401 INFO  (main) [   ] o.a.s.s.SolrDispatchFilter |___/\___/_|_|    Start time: 2022-10-21T05:51:17.401069Z
2022-10-21 05:51:17.422 INFO  (main) [   ] o.a.s.c.SolrPaths Using system property solr.solr.home: /home/trails/IdeaProjects/sap_commerce_2105/hybris/config/solr/instances/default
2022-10-21 05:51:17.423 INFO  (main) [   ] o.a.s.c.SolrXmlConfig Loading container configuration from /home/trails/IdeaProjects/sap_commerce_2105/hybris/config/solr/instances/default/solr.xml
2022-10-21 05:51:17.484 INFO  (main) [   ] o.a.s.c.SolrXmlConfig MBean server found: com.sun.jmx.mbeanserver.JmxMBeanServer@3549bca9, but no JMX reporters were configured - adding default JMX reporter.
2022-10-21 05:51:17.876 INFO  (main) [   ] o.a.s.h.c.HttpShardHandlerFactory Host whitelist initialized: WhitelistHostChecker [whitelistHosts=null, whitelistHostCheckingEnabled=true]
2022-10-21 05:51:18.041 INFO  (main) [   ] o.e.j.u.s.SslContextFactory x509=X509@68f0f72c(1,h=[localhost, hybris],a=[/127.0.0.1],w=[]) for Client@26586b74[provider=null,keyStore=file:///home/trails/IdeaProjects/sap_commerce_2105/hybris/config/solr/instances/default/solr_client.p12,trustStore=file:///home/trails/IdeaProjects/sap_commerce_2105/hybris/config/solr/instances/default/solr.p12]
2022-10-21 05:51:18.114 WARN  (main) [   ] o.e.j.u.s.S.config No Client EndPointIdentificationAlgorithm configured for Client@26586b74[provider=null,keyStore=file:///home/trails/IdeaProjects/sap_commerce_2105/hybris/config/solr/instances/default/solr_client.p12,trustStore=file:///home/trails/IdeaProjects/sap_commerce_2105/hybris/config/solr/instances/default/solr.p12]
2022-10-21 05:51:18.239 INFO  (main) [   ] o.e.j.u.s.SslContextFactory x509=X509@1e236278(1,h=[localhost, hybris],a=[/127.0.0.1],w=[]) for Client@44fff386[provider=null,keyStore=file:///home/trails/IdeaProjects/sap_commerce_2105/hybris/config/solr/instances/default/solr_client.p12,trustStore=file:///home/trails/IdeaProjects/sap_commerce_2105/hybris/config/solr/instances/default/solr.p12]
2022-10-21 05:51:18.245 WARN  (main) [   ] o.e.j.u.s.S.config No Client EndPointIdentificationAlgorithm configured for Client@44fff386[provider=null,keyStore=file:///home/trails/IdeaProjects/sap_commerce_2105/hybris/config/solr/instances/default/solr_client.p12,trustStore=file:///home/trails/IdeaProjects/sap_commerce_2105/hybris/config/solr/instances/default/solr.p12]
2022-10-21 05:51:18.291 INFO  (main) [   ] o.a.s.c.CoreContainer Initializing authorization plugin: solr.RuleBasedAuthorizationPlugin
2022-10-21 05:51:18.299 INFO  (main) [   ] o.a.s.c.CoreContainer Initializing authentication plugin: solr.BasicAuthPlugin
2022-10-21 05:51:18.413 INFO  (main) [   ] o.a.s.c.TransientSolrCoreCacheDefault Allocating transient core cache for max 2147483647 cores with initial capacity of 1024
2022-10-21 05:51:18.427 INFO  (main) [   ] o.a.s.h.a.MetricsHistoryHandler No .system collection, keeping metrics history in memory.
2022-10-21 05:51:18.483 INFO  (main) [   ] o.a.s.m.r.SolrJmxReporter JMX monitoring for 'solr.node' (registry 'solr.node') enabled at server: com.sun.jmx.mbeanserver.JmxMBeanServer@3549bca9
2022-10-21 05:51:18.483 INFO  (main) [   ] o.a.s.m.r.SolrJmxReporter JMX monitoring for 'solr.jvm' (registry 'solr.jvm') enabled at server: com.sun.jmx.mbeanserver.JmxMBeanServer@3549bca9
2022-10-21 05:51:18.484 INFO  (main) [   ] o.a.s.m.r.SolrJmxReporter JMX monitoring for 'solr.jetty' (registry 'solr.jetty') enabled at server: com.sun.jmx.mbeanserver.JmxMBeanServer@3549bca9
2022-10-21 05:51:18.515 INFO  (main) [   ] o.a.s.c.CorePropertiesLocator Found 0 core definitions underneath /home/trails/IdeaProjects/sap_commerce_2105/hybris/data/solr/instances/default
2022-10-21 05:51:18.557 INFO  (main) [   ] o.e.j.s.h.ContextHandler Started o.e.j.w.WebAppContext@2424686b{/solr,file:///home/trails/IdeaProjects/sap_commerce_2105/hybris/bin/modules/search-and-navigation/solrserver/resources/solr/8.11/server/server/solr-webapp/webapp/,AVAILABLE}{/home/trails/IdeaProjects/sap_commerce_2105/hybris/bin/modules/search-and-navigation/solrserver/resources/solr/8.11/server/server/solr-webapp/webapp}
2022-10-21 05:51:18.568 INFO  (main) [   ] o.e.j.u.s.SslContextFactory x509=X509@4a1a256d(1,h=[solr, solr.local, localhost, 127.0.0.1.xip.io, hybris],a=[/127.0.0.1],w=[127.0.0.1.xip.io]) for Server@7364eed1[provider=null,keyStore=file:///home/trails/IdeaProjects/sap_commerce_2105/hybris/config/solr/instances/default/solr.p12,trustStore=file:///home/trails/IdeaProjects/sap_commerce_2105/hybris/config/solr/instances/default/solr.p12]
2022-10-21 05:51:18.578 INFO  (main) [   ] o.e.j.s.AbstractConnector Started ServerConnector@3f3c966c{SSL, (ssl, alpn, h2, http/1.1)}{0.0.0.0:8983}
2022-10-21 05:51:18.578 INFO  (main) [   ] o.e.j.s.Server Started @2637ms
2022-10-21 05:52:06.400 INFO  (ShutdownMonitor) [   ] o.e.j.s.AbstractConnector Stopped ServerConnector@3f3c966c{SSL, (ssl, alpn, h2, http/1.1)}{0.0.0.0:8983}
2022-10-21 05:52:06.400 INFO  (ShutdownMonitor) [   ] o.e.j.s.session node0 Stopped scavenging
2022-10-21 05:52:06.403 INFO  (ShutdownMonitor) [   ] o.a.s.c.CoreContainer Shutting down CoreContainer instance=562345204
2022-10-21 05:52:06.415 INFO  (ShutdownMonitor) [   ] o.a.s.m.SolrMetricManager Closing metric reporters for registry=solr.node tag=null
2022-10-21 05:52:06.415 INFO  (ShutdownMonitor) [   ] o.a.s.m.r.SolrJmxReporter Closing reporter [org.apache.solr.metrics.reporters.SolrJmxReporter@6f825516: rootName = null, domain = solr.node, service url = null, agent id = null] for registry solr.node/com.codahale.metrics.MetricRegistry@3534a913
2022-10-21 05:52:06.423 INFO  (ShutdownMonitor) [   ] o.a.s.m.SolrMetricManager Closing metric reporters for registry=solr.jvm tag=null
2022-10-21 05:52:06.423 INFO  (ShutdownMonitor) [   ] o.a.s.m.r.SolrJmxReporter Closing reporter [org.apache.solr.metrics.reporters.SolrJmxReporter@7c369270: rootName = null, domain = solr.jvm, service url = null, agent id = null] for registry solr.jvm/com.codahale.metrics.MetricRegistry@4689ef06
2022-10-21 05:52:06.427 INFO  (ShutdownMonitor) [   ] o.a.s.m.SolrMetricManager Closing metric reporters for registry=solr.jetty tag=null
2022-10-21 05:52:06.427 INFO  (ShutdownMonitor) [   ] o.a.s.m.r.SolrJmxReporter Closing reporter [org.apache.solr.metrics.reporters.SolrJmxReporter@9f86dc3: rootName = null, domain = solr.jetty, service url = null, agent id = null] for registry solr.jetty/com.codahale.metrics.MetricRegistry@d886184
2022-10-21 05:52:06.442 INFO  (ShutdownMonitor) [   ] o.e.j.s.h.ContextHandler Stopped o.e.j.w.WebAppContext@2424686b{/solr,null,STOPPED}{/home/trails/IdeaProjects/sap_commerce_2105/hybris/bin/modules/search-and-navigation/solrserver/resources/solr/8.11/server/server/solr-webapp/webapp}
