{
  "@aduh95/viz.js@3.5.0": "sha512-ahLdpRAoGsdgEfy2SGV2wnnHrBSLDHuwA32v+BoNGnz1gqajr8VMzF8y6mIQt28hHi4LQ272wqSi78DK4YdT2g==",
  "@ampproject/remapping@2.1.2": "sha512-hoyByceqwKirw7w3Z7gnIIZC3Wx3J484Y3L/cMpXFbr7d9ZQj2mODrirNzcJa+SM3UlpWXYvKV4RlRpFXlWgXg==",
  "@angular-devkit/core@13.3.0_chokidar@3.5.3": "sha512-8YrreVbWlJVZnk5zs4vfkRItrPEtWhUcxWOBfYT/Kwu4FwJVAnNuhJAxxXOAQ2Ckd7cv30Idh/RFVLbTZ5Gs9w==",
  "@angular-devkit/schematics@13.3.0_chokidar@3.5.3": "sha512-hq7tqnB3uVT/iDgqWWZ4kvnijeAcgd4cfLzZiCPaYn1nuhZf0tWsho6exhJ/odMZHvVp7w8OibqWiUKxNY9zHA==",
  "@angular/animations@8.2.14_@angular+core@8.2.14": "sha512-3Vc9TnNpKdtvKIXcWDFINSsnwgEMiDmLzjceWg1iYKwpeZGQahUXPoesLwQazBMmxJzQiA4HOMj0TTXKZ+Jzkg==",
  "@angular/cdk@8.2.3_ecb0ad61817e3ede6ce462931a5e5041": "sha512-ZwO5Sn720RA2YvBqud0JAHkZXjmjxM0yNzCO8RVtRE9i8Gl26Wk0j0nQeJkVm4zwv2QO8MwbKUKGTMt8evsokA==",
  "@angular/common@8.2.14_@angular+core@8.2.14+rxjs@6.5.4": "sha512-Qmt+aX2quUW54kaNT7QH7WGXnFxr/cC2C6sf5SW5SdkZfDQSiz8IaItvieZfXVQUbBOQKFRJ7TlSkt0jI/yjvw==",
  "@angular/compiler@8.2.14": "sha512-ABZO4E7eeFA1QyJ2trDezxeQM5ZFa1dXw1Mpl/+1vuXDKNjJgNyWYwKp/NwRkLmrsuV0yv4UDCDe4kJOGbPKnw==",
  "@angular/core@8.2.14_rxjs@6.5.4+zone.js@0.9.1": "sha512-zeePkigi+hPh3rN7yoNENG/YUBUsIvUXdxx+AZq+QPaFeKEA2FBSrKn36ojHFrdJUjKzl0lPMEiGC2b6a6bo6g==",
  "@angular/elements@8.2.14_1aef5024cf23ac83cf007252fbe55f5a": "sha512-0h0WYIwgVEDvq664jV3EJd21fdQyRxPJt9gBFtoA3JK8X1B93swQGoOwx5lBRNLyOHTl0p/kqXRWUzmmDq2VEA==",
  "@angular/forms@8.2.14_e9fbe5720e9434eb9ae0f6720f1ca3f4": "sha512-zhyKL3CFIqcyHJ/TQF/h1OZztK611a6rxuPHCrt/5Sn1SuBTJJQ1pPTkOYIDy6IrCrtyANc8qB6P17Mao71DNQ==",
  "@angular/platform-browser-dynamic@8.2.14_4c5c48e73106d2e9b7131da2a9d6eb8e": "sha512-mO2JPR5kLU/A3AQngy9+R/Q5gaF9csMStBQjwsCRI0wNtlItOIGL6+wTYpiTuh/ux+WVN1F2sLcEYU4Zf1ud9A==",
  "@angular/platform-browser@8.2.14_ecb0ad61817e3ede6ce462931a5e5041": "sha512-MtJptptyKzsE37JZ2VB/tI4cvMrdAH+cT9pMBYZd66YSZfKjIj5s+AZo7z8ncoskQSB1o3HMfDjSK7QXGx1mLQ==",
  "@angular/router@8.2.14_e9fbe5720e9434eb9ae0f6720f1ca3f4": "sha512-DHA2BhODqV7F0g6ZKgFaZgbsqzHHWRcfWchCOrOVKu2rYiKUTwwHVLBgZAhrpNeinq2pWanVYSIhMr7wy+LfEA==",
  "@angular/upgrade@8.2.14_d2ff5303d1bb22207cb4aaa9bb380a83": "sha512-ggPFonnVg3LtPHxw/q/LIfzjCCwdZmmDaEzU+CO5lfzCB6FJRVdmxzMQ7/ZFMqid41GsDP7TvX4UxbKHS5+W/Q==",
  "@babel/code-frame@7.16.0": "sha512-IF4EOMEV+bfYwOmNxGzSnjR2EmQod7f1UXOpZM3l4i4o4QNwzjtJAu/HxdjHq0aYBvdqMuQEY1eg0nqW9ZPORA==",
  "@babel/code-frame@7.16.7": "sha512-iAXqUn8IIeBTNd72xsFlgaXHkMBMt6y4HJp1tIaK465CWLT/fG1aqB7ykr95gHHmlBdGbFeWWfyB4NJJ0nmeIg==",
  "@babel/compat-data@7.17.7": "sha512-p8pdE6j0a29TNGebNm7NzYZWB3xVZJBZ7XGs42uAKzQo8VQ3F0By/cQCtUEABwIqw5zo6WA4NbmxsfzADzMKnQ==",
  "@babel/core@7.17.8": "sha512-OdQDV/7cRBtJHLSOBqqbYNkOcydOgnX59TZx4puf41fzcVtN3e/4yqY8lMQsK+5X2lJtAdmA+6OHqsj1hBJ4IQ==",
  "@babel/generator@7.17.7": "sha512-oLcVCTeIFadUoArDTwpluncplrYBmTCCZZgXCbgNGvOBBiSDDK3eWO4b/+eOTli5tKv1lg+a5/NAXg+nTcei1w==",
  "@babel/helper-annotate-as-pure@7.16.7": "sha512-s6t2w/IPQVTAET1HitoowRGXooX8mCgtuP5195wD/QJPV6wYjpujCGF7JuMODVX2ZAJOf1GT6DT9MHEZvLOFSw==",
  "@babel/helper-builder-binary-assignment-operator-visitor@7.16.7": "sha512-C6FdbRaxYjwVu/geKW4ZeQ0Q31AftgRcdSnZ5/jsH6BzCJbtvXvhpfkbkThYSuutZA7nCXpPR6AD9zd1dprMkA==",
  "@babel/helper-compilation-targets@7.17.7_@babel+core@7.17.8": "sha512-UFzlz2jjd8kroj0hmCFV5zr+tQPi1dpC2cRsDV/3IEW8bJfCPrPpmcSN6ZS8RqIq4LXcmpipCQFPddyFA5Yc7w==",
  "@babel/helper-create-class-features-plugin@7.17.6_@babel+core@7.17.8": "sha512-SogLLSxXm2OkBbSsHZMM4tUi8fUzjs63AT/d0YQIzr6GSd8Hxsbk2KYDX0k0DweAzGMj/YWeiCsorIdtdcW8Eg==",
  "@babel/helper-create-regexp-features-plugin@7.17.0_@babel+core@7.17.8": "sha512-awO2So99wG6KnlE+TPs6rn83gCz5WlEePJDTnLEqbchMVrBeAujURVphRdigsk094VhvZehFoNOihSlcBjwsXA==",
  "@babel/helper-define-polyfill-provider@0.3.1_@babel+core@7.17.8": "sha512-J9hGMpJQmtWmj46B3kBHmL38UhJGhYX7eqkcq+2gsstyYt341HmPeWspihX43yVRA0mS+8GGk2Gckc7bY/HCmA==",
  "@babel/helper-environment-visitor@7.16.7": "sha512-SLLb0AAn6PkUeAfKJCCOl9e1R53pQlGAfc4y4XuMRZfqeMYLE0dM1LMhqbGAlGQY0lfw5/ohoYWAe9V1yibRag==",
  "@babel/helper-explode-assignable-expression@7.16.7": "sha512-KyUenhWMC8VrxzkGP0Jizjo4/Zx+1nNZhgocs+gLzyZyB8SHidhoq9KK/8Ato4anhwsivfkBLftky7gvzbZMtQ==",
  "@babel/helper-function-name@7.16.7": "sha512-QfDfEnIUyyBSR3HtrtGECuZ6DAyCkYFp7GHl75vFtTnn6pjKeK0T1DB5lLkFvBea8MdaiUABx3osbgLyInoejA==",
  "@babel/helper-get-function-arity@7.16.7": "sha512-flc+RLSOBXzNzVhcLu6ujeHUrD6tANAOU5ojrRx/as+tbzf8+stUCj7+IfRRoAbEZqj/ahXEMsjhOhgeZsrnTw==",
  "@babel/helper-hoist-variables@7.16.7": "sha512-m04d/0Op34H5v7pbZw6pSKP7weA6lsMvfiIAMeIvkY/R4xQtBSMFEigu9QTZ2qB/9l22vsxtM8a+Q8CzD255fg==",
  "@babel/helper-member-expression-to-functions@7.17.7": "sha512-thxXgnQ8qQ11W2wVUObIqDL4p148VMxkt5T/qpN5k2fboRyzFGFmKsTGViquyM5QHKUy48OZoca8kw4ajaDPyw==",
  "@babel/helper-module-imports@7.16.7": "sha512-LVtS6TqjJHFc+nYeITRo6VLXve70xmq7wPhWTqDJusJEgGmkAACWwMiTNrvfoQo6hEhFwAIixNkvB0jPXDL8Wg==",
  "@babel/helper-module-transforms@7.17.7": "sha512-VmZD99F3gNTYB7fJRDTi+u6l/zxY0BE6OIxPSU7a50s6ZUQkHwSDmV92FfM+oCG0pZRVojGYhkR8I0OGeCVREw==",
  "@babel/helper-optimise-call-expression@7.16.7": "sha512-EtgBhg7rd/JcnpZFXpBy0ze1YRfdm7BnBX4uKMBd3ixa3RGAE002JZB66FJyNH7g0F38U05pXmA5P8cBh7z+1w==",
  "@babel/helper-plugin-utils@7.16.7": "sha512-Qg3Nk7ZxpgMrsox6HreY1ZNKdBq7K72tDSliA6dCl5f007jR4ne8iD5UzuNnCJH2xBf2BEEVGr+/OL6Gdp7RxA==",
  "@babel/helper-remap-async-to-generator@7.16.8": "sha512-fm0gH7Flb8H51LqJHy3HJ3wnE1+qtYR2A99K06ahwrawLdOFsCEWjZOrYricXJHoPSudNKxrMBUPEIPxiIIvBw==",
  "@babel/helper-replace-supers@7.16.7": "sha512-y9vsWilTNaVnVh6xiJfABzsNpgDPKev9HnAgz6Gb1p6UUwf9NepdlsV7VXGCftJM+jqD5f7JIEubcpLjZj5dBw==",
  "@babel/helper-simple-access@7.17.7": "sha512-txyMCGroZ96i+Pxr3Je3lzEJjqwaRC9buMUgtomcrLe5Nd0+fk1h0LLA+ixUF5OW7AhHuQ7Es1WcQJZmZsz2XA==",
  "@babel/helper-skip-transparent-expression-wrappers@7.16.0": "sha512-+il1gTy0oHwUsBQZyJvukbB4vPMdcYBrFHa0Uc4AizLxbq6BOYC51Rv4tWocX9BLBDLZ4kc6qUFpQ6HRgL+3zw==",
  "@babel/helper-split-export-declaration@7.16.7": "sha512-xbWoy/PFoxSWazIToT9Sif+jJTlrMcndIsaOKvTA6u7QEo7ilkRZpjew18/W3c7nm8fXdUDXh02VXTbZ0pGDNw==",
  "@babel/helper-validator-identifier@7.15.7": "sha512-K4JvCtQqad9OY2+yTU8w+E82ywk/fe+ELNlt1G8z3bVGlZfn/hOcQQsUhGhW/N+tb3fxK800wLtKOE/aM0m72w==",
  "@babel/helper-validator-identifier@7.16.7": "sha512-hsEnFemeiW4D08A5gUAZxLBTXpZ39P+a+DGDsHw1yxqyQ/jzFEnxf5uTEGp+3bzAbNOxU1paTgYS4ECU/IgfDw==",
  "@babel/helper-validator-option@7.16.7": "sha512-TRtenOuRUVo9oIQGPC5G9DgK4743cdxvtOw0weQNpZXaS16SCBi5MNjZF8vba3ETURjZpTbVn7Vvcf2eAwFozQ==",
  "@babel/helper-wrap-function@7.16.8": "sha512-8RpyRVIAW1RcDDGTA+GpPAwV22wXCfKOoM9bet6TLkGIFTkRQSkH1nMQ5Yet4MpoXe1ZwHPVtNasc2w0uZMqnw==",
  "@babel/helpers@7.17.8": "sha512-QcL86FGxpfSJwGtAvv4iG93UL6bmqBdmoVY0CMCU2g+oD2ezQse3PT5Pa+jiD6LJndBQi0EDlpzOWNlLuhz5gw==",
  "@babel/highlight@7.16.0": "sha512-t8MH41kUQylBtu2+4IQA3atqevA2lRgqA2wyVB/YiWmsDSuylZZuXOUy9ric30hfzauEFfdsuk/eXTRrGrfd0g==",
  "@babel/highlight@7.16.10": "sha512-5FnTQLSLswEj6IkgVw5KusNUUFY9ZGqe/TRFnP/BKYHYgfh7tc+C7mwiy95/yNP7Dh9x580Vv8r7u7ZfTBFxdw==",
  "@babel/parser@7.17.8": "sha512-BoHhDJrJXqcg+ZL16Xv39H9n+AqJ4pcDrQBGZN+wHxIysrLZ3/ECwCBUch/1zUNhnsXULcONU3Ei5Hmkfk6kiQ==",
  "@babel/plugin-bugfix-safari-id-destructuring-collision-in-function-expression@7.16.7_@babel+core@7.17.8": "sha512-anv/DObl7waiGEnC24O9zqL0pSuI9hljihqiDuFHC8d7/bjr/4RLGPWuc8rYOff/QPzbEPSkzG8wGG9aDuhHRg==",
  "@babel/plugin-bugfix-v8-spread-parameters-in-optional-chaining@7.16.7_@babel+core@7.17.8": "sha512-di8vUHRdf+4aJ7ltXhaDbPoszdkh59AQtJM5soLsuHpQJdFQZOA4uGj0V2u/CZ8bJ/u8ULDL5yq6FO/bCXnKHw==",
  "@babel/plugin-proposal-async-generator-functions@7.16.8_@babel+core@7.17.8": "sha512-71YHIvMuiuqWJQkebWJtdhQTfd4Q4mF76q2IX37uZPkG9+olBxsX+rH1vkhFto4UeJZ9dPY2s+mDvhDm1u2BGQ==",
  "@babel/plugin-proposal-class-properties@7.16.7_@babel+core@7.17.8": "sha512-IobU0Xme31ewjYOShSIqd/ZGM/r/cuOz2z0MDbNrhF5FW+ZVgi0f2lyeoj9KFPDOAqsYxmLWZte1WOwlvY9aww==",
  "@babel/plugin-proposal-class-static-block@7.17.6_@babel+core@7.17.8": "sha512-X/tididvL2zbs7jZCeeRJ8167U/+Ac135AM6jCAx6gYXDUviZV5Ku9UDvWS2NCuWlFjIRXklYhwo6HhAC7ETnA==",
  "@babel/plugin-proposal-dynamic-import@7.16.7_@babel+core@7.17.8": "sha512-I8SW9Ho3/8DRSdmDdH3gORdyUuYnk1m4cMxUAdu5oy4n3OfN8flDEH+d60iG7dUfi0KkYwSvoalHzzdRzpWHTg==",
  "@babel/plugin-proposal-export-namespace-from@7.16.7_@babel+core@7.17.8": "sha512-ZxdtqDXLRGBL64ocZcs7ovt71L3jhC1RGSyR996svrCi3PYqHNkb3SwPJCs8RIzD86s+WPpt2S73+EHCGO+NUA==",
  "@babel/plugin-proposal-json-strings@7.16.7_@babel+core@7.17.8": "sha512-lNZ3EEggsGY78JavgbHsK9u5P3pQaW7k4axlgFLYkMd7UBsiNahCITShLjNQschPyjtO6dADrL24757IdhBrsQ==",
  "@babel/plugin-proposal-logical-assignment-operators@7.16.7_@babel+core@7.17.8": "sha512-K3XzyZJGQCr00+EtYtrDjmwX7o7PLK6U9bi1nCwkQioRFVUv6dJoxbQjtWVtP+bCPy82bONBKG8NPyQ4+i6yjg==",
  "@babel/plugin-proposal-nullish-coalescing-operator@7.16.7_@babel+core@7.17.8": "sha512-aUOrYU3EVtjf62jQrCj63pYZ7k6vns2h/DQvHPWGmsJRYzWXZ6/AsfgpiRy6XiuIDADhJzP2Q9MwSMKauBQ+UQ==",
  "@babel/plugin-proposal-numeric-separator@7.16.7_@babel+core@7.17.8": "sha512-vQgPMknOIgiuVqbokToyXbkY/OmmjAzr/0lhSIbG/KmnzXPGwW/AdhdKpi+O4X/VkWiWjnkKOBiqJrTaC98VKw==",
  "@babel/plugin-proposal-object-rest-spread@7.17.3_@babel+core@7.17.8": "sha512-yuL5iQA/TbZn+RGAfxQXfi7CNLmKi1f8zInn4IgobuCWcAb7i+zj4TYzQ9l8cEzVyJ89PDGuqxK1xZpUDISesw==",
  "@babel/plugin-proposal-optional-catch-binding@7.16.7_@babel+core@7.17.8": "sha512-eMOH/L4OvWSZAE1VkHbr1vckLG1WUcHGJSLqqQwl2GaUqG6QjddvrOaTUMNYiv77H5IKPMZ9U9P7EaHwvAShfA==",
  "@babel/plugin-proposal-optional-chaining@7.16.7_@babel+core@7.17.8": "sha512-eC3xy+ZrUcBtP7x+sq62Q/HYd674pPTb/77XZMb5wbDPGWIdUbSr4Agr052+zaUPSb+gGRnjxXfKFvx5iMJ+DA==",
  "@babel/plugin-proposal-private-methods@7.16.11_@babel+core@7.17.8": "sha512-F/2uAkPlXDr8+BHpZvo19w3hLFKge+k75XUprE6jaqKxjGkSYcK+4c+bup5PdW/7W/Rpjwql7FTVEDW+fRAQsw==",
  "@babel/plugin-proposal-private-property-in-object@7.16.7_@babel+core@7.17.8": "sha512-rMQkjcOFbm+ufe3bTZLyOfsOUOxyvLXZJCTARhJr+8UMSoZmqTe1K1BgkFcrW37rAchWg57yI69ORxiWvUINuQ==",
  "@babel/plugin-proposal-unicode-property-regex@7.16.7_@babel+core@7.17.8": "sha512-QRK0YI/40VLhNVGIjRNAAQkEHws0cswSdFFjpFyt943YmJIU1da9uW63Iu6NFV6CxTZW5eTDCrwZUstBWgp/Rg==",
  "@babel/plugin-syntax-async-generators@7.8.4_@babel+core@7.17.8": "sha512-tycmZxkGfZaxhMRbXlPXuVFpdWlXpir2W4AMhSJgRKzk/eDlIXOhb2LHWoLpDF7TEHylV5zNhykX6KAgHJmTNw==",
  "@babel/plugin-syntax-class-properties@7.12.13_@babel+core@7.17.8": "sha512-fm4idjKla0YahUNgFNLCB0qySdsoPiZP3iQE3rky0mBUtMZ23yDJ9SJdg6dXTSDnulOVqiF3Hgr9nbXvXTQZYA==",
  "@babel/plugin-syntax-class-static-block@7.14.5_@babel+core@7.17.8": "sha512-b+YyPmr6ldyNnM6sqYeMWE+bgJcJpO6yS4QD7ymxgH34GBPNDM/THBh8iunyvKIZztiwLH4CJZ0RxTk9emgpjw==",
  "@babel/plugin-syntax-dynamic-import@7.8.3_@babel+core@7.17.8": "sha512-5gdGbFon+PszYzqs83S3E5mpi7/y/8M9eC90MRTZfduQOYW76ig6SOSPNe41IG5LoP3FGBn2N0RjVDSQiS94kQ==",
  "@babel/plugin-syntax-export-namespace-from@7.8.3_@babel+core@7.17.8": "sha512-MXf5laXo6c1IbEbegDmzGPwGNTsHZmEy6QGznu5Sh2UCWvueywb2ee+CCE4zQiZstxU9BMoQO9i6zUFSY0Kj0Q==",
  "@babel/plugin-syntax-json-strings@7.8.3_@babel+core@7.17.8": "sha512-lY6kdGpWHvjoe2vk4WrAapEuBR69EMxZl+RoGRhrFGNYVK8mOPAW8VfbT/ZgrFbXlDNiiaxQnAtgVCZ6jv30EA==",
  "@babel/plugin-syntax-logical-assignment-operators@7.10.4_@babel+core@7.17.8": "sha512-d8waShlpFDinQ5MtvGU9xDAOzKH47+FFoney2baFIoMr952hKOLp1HR7VszoZvOsV/4+RRszNY7D17ba0te0ig==",
  "@babel/plugin-syntax-nullish-coalescing-operator@7.8.3_@babel+core@7.17.8": "sha512-aSff4zPII1u2QD7y+F8oDsz19ew4IGEJg9SVW+bqwpwtfFleiQDMdzA/R+UlWDzfnHFCxxleFT0PMIrR36XLNQ==",
  "@babel/plugin-syntax-numeric-separator@7.10.4_@babel+core@7.17.8": "sha512-9H6YdfkcK/uOnY/K7/aA2xpzaAgkQn37yzWUMRK7OaPOqOpGS1+n0H5hxT9AUw9EsSjPW8SVyMJwYRtWs3X3ug==",
  "@babel/plugin-syntax-object-rest-spread@7.8.3_@babel+core@7.17.8": "sha512-XoqMijGZb9y3y2XskN+P1wUGiVwWZ5JmoDRwx5+3GmEplNyVM2s2Dg8ILFQm8rWM48orGy5YpI5Bl8U1y7ydlA==",
  "@babel/plugin-syntax-optional-catch-binding@7.8.3_@babel+core@7.17.8": "sha512-6VPD0Pc1lpTqw0aKoeRTMiB+kWhAoT24PA+ksWSBrFtl5SIRVpZlwN3NNPQjehA2E/91FV3RjLWoVTglWcSV3Q==",
  "@babel/plugin-syntax-optional-chaining@7.8.3_@babel+core@7.17.8": "sha512-KoK9ErH1MBlCPxV0VANkXW2/dw4vlbGDrFgz8bmUsBGYkFRcbRwMh6cIJubdPrkxRwuGdtCk0v/wPTKbQgBjkg==",
  "@babel/plugin-syntax-private-property-in-object@7.14.5_@babel+core@7.17.8": "sha512-0wVnp9dxJ72ZUJDV27ZfbSj6iHLoytYZmh3rFcxNnvsJF3ktkzLDZPy/mA17HGsaQT3/DQsWYX1f1QGWkCoVUg==",
  "@babel/plugin-syntax-top-level-await@7.14.5_@babel+core@7.17.8": "sha512-hx++upLv5U1rgYfwe1xBQUhRmU41NEvpUvrp8jkrSCdvGSnM5/qdRMtylJ6PG5OFkBaHkbTAKTnd3/YyESRHFw==",
  "@babel/plugin-transform-arrow-functions@7.16.7_@babel+core@7.17.8": "sha512-9ffkFFMbvzTvv+7dTp/66xvZAWASuPD5Tl9LK3Z9vhOmANo6j94rik+5YMBt4CwHVMWLWpMsriIc2zsa3WW3xQ==",
  "@babel/plugin-transform-async-to-generator@7.16.8_@babel+core@7.17.8": "sha512-MtmUmTJQHCnyJVrScNzNlofQJ3dLFuobYn3mwOTKHnSCMtbNsqvF71GQmJfFjdrXSsAA7iysFmYWw4bXZ20hOg==",
  "@babel/plugin-transform-block-scoped-functions@7.16.7_@babel+core@7.17.8": "sha512-JUuzlzmF40Z9cXyytcbZEZKckgrQzChbQJw/5PuEHYeqzCsvebDx0K0jWnIIVcmmDOAVctCgnYs0pMcrYj2zJg==",
  "@babel/plugin-transform-block-scoping@7.16.7_@babel+core@7.17.8": "sha512-ObZev2nxVAYA4bhyusELdo9hb3H+A56bxH3FZMbEImZFiEDYVHXQSJ1hQKFlDnlt8G9bBrCZ5ZpURZUrV4G5qQ==",
  "@babel/plugin-transform-classes@7.16.7_@babel+core@7.17.8": "sha512-WY7og38SFAGYRe64BrjKf8OrE6ulEHtr5jEYaZMwox9KebgqPi67Zqz8K53EKk1fFEJgm96r32rkKZ3qA2nCWQ==",
  "@babel/plugin-transform-computed-properties@7.16.7_@babel+core@7.17.8": "sha512-gN72G9bcmenVILj//sv1zLNaPyYcOzUho2lIJBMh/iakJ9ygCo/hEF9cpGb61SCMEDxbbyBoVQxrt+bWKu5KGw==",
  "@babel/plugin-transform-destructuring@7.17.7_@babel+core@7.17.8": "sha512-XVh0r5yq9sLR4vZ6eVZe8FKfIcSgaTBxVBRSYokRj2qksf6QerYnTxz9/GTuKTH/n/HwLP7t6gtlybHetJ/6hQ==",
  "@babel/plugin-transform-dotall-regex@7.16.7_@babel+core@7.17.8": "sha512-Lyttaao2SjZF6Pf4vk1dVKv8YypMpomAbygW+mU5cYP3S5cWTfCJjG8xV6CFdzGFlfWK81IjL9viiTvpb6G7gQ==",
  "@babel/plugin-transform-duplicate-keys@7.16.7_@babel+core@7.17.8": "sha512-03DvpbRfvWIXyK0/6QiR1KMTWeT6OcQ7tbhjrXyFS02kjuX/mu5Bvnh5SDSWHxyawit2g5aWhKwI86EE7GUnTw==",
  "@babel/plugin-transform-exponentiation-operator@7.16.7_@babel+core@7.17.8": "sha512-8UYLSlyLgRixQvlYH3J2ekXFHDFLQutdy7FfFAMm3CPZ6q9wHCwnUyiXpQCe3gVVnQlHc5nsuiEVziteRNTXEA==",
  "@babel/plugin-transform-for-of@7.16.7_@babel+core@7.17.8": "sha512-/QZm9W92Ptpw7sjI9Nx1mbcsWz33+l8kuMIQnDwgQBG5s3fAfQvkRjQ7NqXhtNcKOnPkdICmUHyCaWW06HCsqg==",
  "@babel/plugin-transform-function-name@7.16.7_@babel+core@7.17.8": "sha512-SU/C68YVwTRxqWj5kgsbKINakGag0KTgq9f2iZEXdStoAbOzLHEBRYzImmA6yFo8YZhJVflvXmIHUO7GWHmxxA==",
  "@babel/plugin-transform-literals@7.16.7_@babel+core@7.17.8": "sha512-6tH8RTpTWI0s2sV6uq3e/C9wPo4PTqqZps4uF0kzQ9/xPLFQtipynvmT1g/dOfEJ+0EQsHhkQ/zyRId8J2b8zQ==",
  "@babel/plugin-transform-member-expression-literals@7.16.7_@babel+core@7.17.8": "sha512-mBruRMbktKQwbxaJof32LT9KLy2f3gH+27a5XSuXo6h7R3vqltl0PgZ80C8ZMKw98Bf8bqt6BEVi3svOh2PzMw==",
  "@babel/plugin-transform-modules-amd@7.16.7_@babel+core@7.17.8": "sha512-KaaEtgBL7FKYwjJ/teH63oAmE3lP34N3kshz8mm4VMAw7U3PxjVwwUmxEFksbgsNUaO3wId9R2AVQYSEGRa2+g==",
  "@babel/plugin-transform-modules-commonjs@7.17.7_@babel+core@7.17.8": "sha512-ITPmR2V7MqioMJyrxUo2onHNC3e+MvfFiFIR0RP21d3PtlVb6sfzoxNKiphSZUOM9hEIdzCcZe83ieX3yoqjUA==",
  "@babel/plugin-transform-modules-systemjs@7.17.8_@babel+core@7.17.8": "sha512-39reIkMTUVagzgA5x88zDYXPCMT6lcaRKs1+S9K6NKBPErbgO/w/kP8GlNQTC87b412ZTlmNgr3k2JrWgHH+Bw==",
  "@babel/plugin-transform-modules-umd@7.16.7_@babel+core@7.17.8": "sha512-EMh7uolsC8O4xhudF2F6wedbSHm1HHZ0C6aJ7K67zcDNidMzVcxWdGr+htW9n21klm+bOn+Rx4CBsAntZd3rEQ==",
  "@babel/plugin-transform-named-capturing-groups-regex@7.16.8_@babel+core@7.17.8": "sha512-j3Jw+n5PvpmhRR+mrgIh04puSANCk/T/UA3m3P1MjJkhlK906+ApHhDIqBQDdOgL/r1UYpz4GNclTXxyZrYGSw==",
  "@babel/plugin-transform-new-target@7.16.7_@babel+core@7.17.8": "sha512-xiLDzWNMfKoGOpc6t3U+etCE2yRnn3SM09BXqWPIZOBpL2gvVrBWUKnsJx0K/ADi5F5YC5f8APFfWrz25TdlGg==",
  "@babel/plugin-transform-object-super@7.16.7_@babel+core@7.17.8": "sha512-14J1feiQVWaGvRxj2WjyMuXS2jsBkgB3MdSN5HuC2G5nRspa5RK9COcs82Pwy5BuGcjb+fYaUj94mYcOj7rCvw==",
  "@babel/plugin-transform-parameters@7.16.7_@babel+core@7.17.8": "sha512-AT3MufQ7zZEhU2hwOA11axBnExW0Lszu4RL/tAlUJBuNoRak+wehQW8h6KcXOcgjY42fHtDxswuMhMjFEuv/aw==",
  "@babel/plugin-transform-property-literals@7.16.7_@babel+core@7.17.8": "sha512-z4FGr9NMGdoIl1RqavCqGG+ZuYjfZ/hkCIeuH6Do7tXmSm0ls11nYVSJqFEUOSJbDab5wC6lRE/w6YjVcr6Hqw==",
  "@babel/plugin-transform-regenerator@7.16.7_@babel+core@7.17.8": "sha512-mF7jOgGYCkSJagJ6XCujSQg+6xC1M77/03K2oBmVJWoFGNUtnVJO4WHKJk3dnPC8HCcj4xBQP1Egm8DWh3Pb3Q==",
  "@babel/plugin-transform-reserved-words@7.16.7_@babel+core@7.17.8": "sha512-KQzzDnZ9hWQBjwi5lpY5v9shmm6IVG0U9pB18zvMu2i4H90xpT4gmqwPYsn8rObiadYe2M0gmgsiOIF5A/2rtg==",
  "@babel/plugin-transform-shorthand-properties@7.16.7_@babel+core@7.17.8": "sha512-hah2+FEnoRoATdIb05IOXf+4GzXYTq75TVhIn1PewihbpyrNWUt2JbudKQOETWw6QpLe+AIUpJ5MVLYTQbeeUg==",
  "@babel/plugin-transform-spread@7.16.7_@babel+core@7.17.8": "sha512-+pjJpgAngb53L0iaA5gU/1MLXJIfXcYepLgXB3esVRf4fqmj8f2cxM3/FKaHsZms08hFQJkFccEWuIpm429TXg==",
  "@babel/plugin-transform-sticky-regex@7.16.7_@babel+core@7.17.8": "sha512-NJa0Bd/87QV5NZZzTuZG5BPJjLYadeSZ9fO6oOUoL4iQx+9EEuw/eEM92SrsT19Yc2jgB1u1hsjqDtH02c3Drw==",
  "@babel/plugin-transform-template-literals@7.16.7_@babel+core@7.17.8": "sha512-VwbkDDUeenlIjmfNeDX/V0aWrQH2QiVyJtwymVQSzItFDTpxfyJh3EVaQiS0rIN/CqbLGr0VcGmuwyTdZtdIsA==",
  "@babel/plugin-transform-typeof-symbol@7.16.7_@babel+core@7.17.8": "sha512-p2rOixCKRJzpg9JB4gjnG4gjWkWa89ZoYUnl9snJ1cWIcTH/hvxZqfO+WjG6T8DRBpctEol5jw1O5rA8gkCokQ==",
  "@babel/plugin-transform-unicode-escapes@7.16.7_@babel+core@7.17.8": "sha512-TAV5IGahIz3yZ9/Hfv35TV2xEm+kaBDaZQCn2S/hG9/CZ0DktxJv9eKfPc7yYCvOYR4JGx1h8C+jcSOvgaaI/Q==",
  "@babel/plugin-transform-unicode-regex@7.16.7_@babel+core@7.17.8": "sha512-oC5tYYKw56HO75KZVLQ+R/Nl3Hro9kf8iG0hXoaHP7tjAyCpvqBiSNe6vGrZni1Z6MggmUOC6A7VP7AVmw225Q==",
  "@babel/preset-env@7.16.11_@babel+core@7.17.8": "sha512-qcmWG8R7ZW6WBRPZK//y+E3Cli151B20W1Rv7ln27vuPaXU/8TKms6jFdiJtF7UDTxcrb7mZd88tAeK9LjdT8g==",
  "@babel/preset-modules@0.1.5_@babel+core@7.17.8": "sha512-A57th6YRG7oR3cq/yt/Y84MvGgE0eJG2F1JLhKuyG+jFxEgrd/HAMJatiFtmOiZurz+0DkrvbheCLaV5f2JfjA==",
  "@babel/runtime@7.17.8": "sha512-dQpEpK0O9o6lj6oPu0gRDbbnk+4LeHlNcBpspf6Olzt3GIX4P1lWF1gS+pHLDFlaJvbR6q7jCfQ08zA4QJBnmA==",
  "@babel/template@7.16.7": "sha512-I8j/x8kHUrbYRTUxXrrMbfCa7jxkE7tZre39x3kjr9hvI82cK1FfqLygotcWN5kdPGWcLdWMHpSBavse5tWw3w==",
  "@babel/traverse@7.17.3": "sha512-5irClVky7TxRWIRtxlh2WPUUOLhcPN06AGgaQSB8AEwuyEBgJVuJ5imdHm5zxk8w0QS5T+tDfnDxAlhWjpb7cw==",
  "@babel/types@7.17.0": "sha512-TmKSNO4D5rzhL5bjWFcVHHLETzfQ/AmbKpKPOSjlP0WoHZ6L911fgoOKY4Alp/emzG4cHJdyN49zpgkbXFEHHw==",
  "@compodoc/compodoc@1.1.19": "sha512-09vdSIgoAXWD1MiLZNhiljLNQ1XzHw/w5shw5IPcUImr/I+1Y52srUL46mEXN8AXo0hbHb5LZcgs70mmrOvY7Q==",
  "@compodoc/live-server@1.2.3": "sha512-hDmntVCyjjaxuJzPzBx68orNZ7TW4BtHWMnXlIVn5dqhK7vuFF/11hspO1cMmc+2QTYgqde1TBcb3127S7Zrow==",
  "@compodoc/ngd-core@2.1.0": "sha512-nyBH7J7SJJ2AV6OeZhJ02kRtVB7ALnZJKgShjoL9CNmOFEj8AkdhP9qTBIgjaDrbsW5pF4nx32KQL2fT7RFnqw==",
  "@compodoc/ngd-transformer@2.1.0": "sha512-Jo4VCMzIUtgIAdRmhHhOoRRE01gCjc5CyrUERRx0VgEzkkCm1Wmu/XHSsQP6tSpCYHBjERghqaDqH5DabkR2oQ==",
  "@eslint/eslintrc@0.1.3": "sha512-4YVwPkANLeNtRjMekzux1ci8hIaH5eGKktGqR0d3LWsKNn5B2X/1Z6Trxy7jQXl9EBGE6Yj02O+t09FMeRllaA==",
  "@foliojs-fork/fontkit@1.9.1": "sha512-U589voc2/ROnvx1CyH9aNzOQWJp127JGU1QAylXGQ7LoEAF6hMmahZLQ4eqAcgHUw+uyW4PjtCItq9qudPkK3A==",
  "@foliojs-fork/linebreak@1.1.1": "sha512-pgY/+53GqGQI+mvDiyprvPWgkTlVBS8cxqee03ejm6gKAQNsR1tCYCIvN9FHy7otZajzMqCgPOgC4cHdt4JPig==",
  "@foliojs-fork/pdfkit@0.13.0": "sha512-YXeG1fml9k97YNC9K8e292Pj2JzGt9uOIiBFuQFxHsdQ45BlxW+JU3RQK6JAvXU7kjhjP8rCcYvpk36JLD33sQ==",
  "@foliojs-fork/restructure@2.0.2": "sha512-59SgoZ3EXbkfSX7b63tsou/SDGzwUEK6MuB5sKqgVK1/XE0fxmpsOb9DQI8LXW3KfGnAjImCGhhEb7uPPAUVNA==",
  "@fundamental-ngx/core@0.13.2_9a9a80bb6ff375d99f90188f858ebbd5": "sha512-SwmY4D1hx8YI9tZisfpqIASXNXB1v+dzP6YqFRSBw/R5vOMDp7LPEOA0imJh4YtX+DkEIyRgMqakTrZcynhg7w==",
  "@jridgewell/resolve-uri@3.0.5": "sha512-VPeQ7+wH0itvQxnG+lIzWgkysKIr3L9sslimFW55rHMdGu/qCQ5z5h9zq4gI8uBtqkpHhsF4Z/OwExufUCThew==",
  "@jridgewell/sourcemap-codec@1.4.11": "sha512-Fg32GrJo61m+VqYSdRSjRXMjQ06j8YIYfcTqndLYVAaHmroZHLJZCydsWBOTDqXS2v+mjxohBWEMfg97GXmYQg==",
  "@jridgewell/trace-mapping@0.3.4": "sha512-vFv9ttIedivx0ux3QSjhgtCVjPZd5l46ZOMDSCwnH1yUO2e964gO8LZGyv2QkqcgR6TnBU1v+1IFqmeoG+0UJQ==",
  "@ngx-translate/core@11.0.1_@angular+core@8.2.14+rxjs@6.5.4": "sha512-nBCa1ZD9fAUY/3eskP3Lql2fNg8OMrYIej1/5GRsfcutx9tG/5fZLCv9m6UCw1aS+u4uK/vXjv1ctG/FdMvaWg==",
  "@ngx-translate/http-loader@4.0.0_eec6af2e781609672c84ad3faac91607": "sha512-x8LumqydWD7eX9yQTAVeoCM9gFUIGVTUjZqbxdAUavAA3qVnk9wCQux7iHLPXpydl8vyQmLoPQR+fFU+DUDOMA==",
  "@nodelib/fs.scandir@2.1.5": "sha512-vq24Bq3ym5HEQm2NKCr3yXDwjc7vTsEThRDnkp2DK9p1uqLR+DHurm/NOTo0KG7HYHU7eppKZj3MyqYuMBf62g==",
  "@nodelib/fs.stat@2.0.5": "sha512-RkhPPp2zrqDAQA/2jNhnztcPAlv64XdhIp7a7454A5ovI7Bukxgt7MX7udwAu3zg1DcpPU0rz3VV1SeaqvY4+A==",
  "@nodelib/fs.walk@1.2.8": "sha512-oGB+UxlgWcgQkgwo8GcEGwemoTFt3FIO9ababBmaGwXIoBKZ+GTy0pP185beGg7Llih/NSHSV2XAs1lnznocSg==",
  "@sap-theming/theming-base-content@11.1.19": "sha512-0RIoniX0XgQDMfMsySvNDeXVGtH3UQRQMkJYFIkaq/nrTGSyfXT9k+B4CbTf4546dyrlLM0YoaHIOtxmMsh1ZA==",
  "@ts-morph/common@0.12.3": "sha512-4tUmeLyXJnJWvTFOKtcNJ1yh0a3SsTLi2MUoyj8iUNznFRN1ZquaNe7Oukqrnki2FzZkm0J9adCNLDZxUzvj+w==",
  "@types/angular-animate@1.5.10": "sha512-MnYYvTHAPUbtT6gqwrnl6k3a03A5BlNz1nVlwVGxyS+MeWCX4DC14SJ/pgJUa8wj+J04wZ2prMxFsOfp6cyjjQ==",
  "@types/angular-cookies@1.8.0": "sha512-SIwYsFcEkkH8sFkqr1ZyGYnu80vp6nPfQGmGoyQTgeATxfl2pEy4bAoaqJB5CQ7w+Nr0FqnXsjFpSrvif/W6hQ==",
  "@types/angular-mocks@1.7.0": "sha512-MeT5vxWBx4Ny5/sNZJjpZdv4K2KGwqQYiRQQZctan1TTaNyiVlFRYbcmheolhM4KKbTWmoxTVeuvGzniTDg1kw==",
  "@types/angular-route@1.7.1": "sha512-5N5nfUYTEf5InmrhGU5qtvBOHOq6uvv1olJR5fd6Eq5YFT+cdjrr0nklBaFfulAsF0Cd8y7IQipgaUSwWsATYQ==",
  "@types/angular-sanitize@1.7.0": "sha512-UvVhD91++MEaYrRb+fJ6kWFaRhnAZn8yj6XN5bP4p6KuShuYPr3s2zT29yNltkVW4WMGh7UWDW753wWlQmKyQA==",
  "@types/angular-translate@2.16.2": "sha512-gZhpVXeZxiZgzVy27cqrB5mUxLVuh3bqJNA/yVK0D6JZs9fcjxzmAPKvq9NUIct28bq9eVOeAT/fvQXpTBw3mA==",
  "@types/angular-ui-bootstrap@0.13.47": "sha512-8HMw2MR9lPZt8+A4Kf6BFT2JK+0/ERcpM88k/kewPBOXdXVzkQmcJ08tNPhFIPLF89diKfA6X3HZKTBJr6PMoQ==",
  "@types/angular@1.7.3": "sha512-rr40P9yHTlLuY6y+PUfwHeoBWO8uEJTazcs89o83fheyH/b9OZW7p7EsvFMriCPam3p6VSD57zkgn+nAQCvfUw==",
  "@types/ckeditor4@4.16.1": "sha512-2v3yiFsZVmCestsIamjYJM65KP9IDh6tpvb3chqMPEgN3q+N0NWwcv2TSJG/1jRGRsbo3dZRtDvfrNO3HT6eWg==",
  "@types/crypto-js@3.1.43": "sha512-EHe/YKctU3IYNBsDmSOPX/7jLHPRlx8WaiDKSY9JCTnJ8XJeM4c0ZJvx+9Gxmr2s2ihI92R+3U/gNL1sq5oRuQ==",
  "@types/eonasdan-bootstrap-datetimepicker@4.17.26": "sha512-5kxvfdwAx8esJTC/N6vxESBAjKprGTdLiTBx4776krLwQicANzkTmMeunnBHZqPx6EdUIkWs/+GSJbmsHrEHjg==",
  "@types/fetch-mock@7.3.2": "sha512-NCEfv49jmDsBAixjMjEHKVgmVQlJ+uK56FOc+2roYPExnXCZDpi6mJOHQ3v23BiO84hBDStND9R2itJr7PNoow==",
  "@types/jasmine@3.3.0": "sha512-0VU8WsYEOYmoxVtUuafB66/+9G8gMdGAC3dhCE/CMpjXgNIz9fwC6g41kRlNxFgpQI/uX/aWNLArNg7KmeFYvw==",
  "@types/jquery@3.3.38": "sha512-nkDvmx7x/6kDM5guu/YpXkGZ/Xj/IwGiLDdKM99YA5Vag7pjGyTJ8BNUh/6hxEn/sEu5DKtyRgnONJ7EmOoKrA==",
  "@types/json-schema@7.0.9": "sha512-qcUXuemtEu+E5wZSJHNxUXeCZhAfXKQ41D+duX+VYPde7xyEVZci+/oXKJL13tnRs9lR2pr4fod59GT6/X1/yQ==",
  "@types/json5@0.0.29": "sha1-7ihweulOEdK4J7y+UnC86n8+ce4=",
  "@types/lodash@4.14.159": "sha512-gF7A72f7WQN33DpqOWw9geApQPh4M3PxluMtaHxWHXEGSN12/WbcEk/eNSqWNQcQhF66VSZ06vCF94CrHwXJDg==",
  "@types/node@14.11.2": "sha512-jiE3QIxJ8JLNcb1Ps6rDbysDhN4xa8DJJvuC9prr6w+1tIh+QAbYyNF3tyiZNLDBIuBCf4KEcV2UvQm/V60xfA==",
  "@types/parse-json@4.0.0": "sha512-//oorEZjL6sbPcKUaCdIGlIUeH26mgzimjBB77G6XRgnDl/L5wOnpyBGRe/Mmf5CVW3PwEBE1NjiMZ/ssFh4wA==",
  "@types/scriptjs@0.0.2": "sha1-CaIociGno0H8a5WwBeS/sqVANTg=",
  "@types/sizzle@2.3.3": "sha512-JYM8x9EGF163bEyhdJBpR2QX1R5naCJHC8ucJylJ3w9/CVBaskdQ8WqBf8MmQrd1kRvp/a4TS8HJ+bxzR7ZJYQ==",
  "@types/webpack-env@1.15.2": "sha512-67ZgZpAlhIICIdfQrB5fnDvaKFcDxpKibxznfYRVAT4mQE41Dido/3Ty+E3xGBmTogc5+0Qb8tWhna+5B8z1iQ==",
  "@typescript-eslint/eslint-plugin@4.1.1_a22e7e22e60e15ab8bd1c819ed528b95": "sha512-Hoxyt99EA9LMmqo/5PuWWPeWeB3mKyvibfJ1Hy5SfiUpjE8Nqp+5QNd9fOkzL66+fqvIWSIE+Ett16LGMzCGnQ==",
  "@typescript-eslint/experimental-utils@3.10.1_eslint@7.9.0+typescript@3.9.3": "sha512-DewqIgscDzmAfd5nOGe4zm6Bl7PKtMG2Ad0KG8CUZAHlXfAKTF9Ol5PXhiMh39yRL2ChRH1cuuUGOcVyyrhQIw==",
  "@typescript-eslint/experimental-utils@4.1.1_eslint@7.9.0+typescript@3.9.3": "sha512-jzYsNciHoa4Z3c1URtmeT/bamYm8Dwfw6vuN3WHIE/BXb1iC4KveAnXDErTAZtPVxTYBaYn3n2gbt6F6D2rm1A==",
  "@typescript-eslint/parser@4.1.1_eslint@7.9.0+typescript@3.9.3": "sha512-NLIhmicpKGfJbdXyQBz9j48PA6hq6e+SDOoXy7Ak6bq1ebGqbgG+fR1UIDAuay6OjQdot69c/URu2uLlsP8GQQ==",
  "@typescript-eslint/scope-manager@4.1.1": "sha512-0W8TTobCvIIQ2FsrYTffyZGAAFUyIbEHq5EYJb1m7Rpd005jrnOvKOo8ywCLhs/Bm17C+KsrUboBvBAARQVvyA==",
  "@typescript-eslint/types@3.10.1": "sha512-+3+FCUJIahE9q0lDi1WleYzjCwJs5hIsbugIgnbB+dSCYUxl8L6PwmsyOPFZde2hc1DlTo/xnkOgiTLSyAbHiQ==",
  "@typescript-eslint/types@4.1.1": "sha512-zrBiqOKYerMTllKcn+BP+i1b7LW/EbMMYytroXMxUTvFPn1smkCu0D7lSAx29fTUO4jnwV0ljSvYQtn2vNrNxA==",
  "@typescript-eslint/typescript-estree@3.10.1_typescript@3.9.3": "sha512-QbcXOuq6WYvnB3XPsZpIwztBoquEYLXh2MtwVU+kO8jgYCiv4G5xrSP/1wg4tkvrEE+esZVquIPX/dxPlePk1w==",
  "@typescript-eslint/typescript-estree@4.1.1_typescript@3.9.3": "sha512-2AUg5v0liVBsqbGxBphbJ0QbGqSRVaF5qPoTPWcxop+66vMdU1h4CCvHxTC47+Qb+Pr4l2RhXDd41JNpwcQEKw==",
  "@typescript-eslint/visitor-keys@3.10.1": "sha512-9JgC82AaQeglebjZMgYR5wgmfUdUc+EitGUUMW8u2nDckaeimzW+VsoLV6FoimPv2id3VQzfjwBxEMVz08ameQ==",
  "@typescript-eslint/visitor-keys@4.1.1": "sha512-/EOOXbA2ferGLG6RmCHEQ0lTTLkOlXYDgblCmQk3tIU7mTPLm4gKhFMeeUSe+bcchTUsKeCk8xcpbop5Zr/8Rw==",
  "@webcomponents/webcomponentsjs@2.4.3": "sha512-cV4+sAmshf8ysU2USutrSRYQkJzEYKHsRCGa0CkMElGpG5747VHtkfsW3NdVIBV/m2MDKXTDydT4lkrysH7IFA==",
  "accepts@1.3.7": "sha512-Il80Qs2WjYlJIBNzNkK6KYqlVMTbZLXgHx2oT0pU/fjRHyEp+PEfEPY0R3WCwAGVOtauxh1hOxNgIf5bv7dQpA==",
  "acorn-jsx@5.3.2_acorn@7.4.1": "sha512-rq9s+JNhf0IChjtDXxllJ7g41oZk5SlXtp0LHwyA5cejwn7vKmKp4pPri6YEePv2PU65sAsegbXtIinmDFDXgQ==",
  "acorn-node@1.8.2": "sha512-8mt+fslDufLYntIoPAaIMUe/lrbrehIiwmR3t2k9LljIzoigEPF27eLk2hy8zSGzmR/ogr7zbRKINMo1u0yh5A==",
  "acorn-walk@7.2.0": "sha512-OPdCF6GsMIP+Az+aWfAAOEt2/+iVDKE7oy6lJ098aoe59oAmK76qV6Gw60SbZ8jHuG2wH058GF4pLFbYamYrVA==",
  "acorn@7.4.1": "sha512-nQyp0o1/mNdbTO1PO6kHkwSrmgZ0MT/jCCpNiwbUjGoRN4dlBhqJtoQuCnEOKzgTVwg0ZWiCoQy6SxMebQVh8A==",
  "ajv-formats@2.1.1": "sha512-Wx0Kx52hxE7C18hkMEggYlEifqWZtYaRgouJor+WMdPnQyEK13vgEWyVNup7SoeeoLMsr4kf5h6dOW11I15MUA==",
  "ajv@6.12.6": "sha512-j3fVLgvTo527anyYyJOGTYJbG+vnnQYvE0m5mmkc1TK+nxAppkCLMIL0aZ4dblVCNoGShhm+kzE4ZUykBoMg4g==",
  "ajv@8.9.0": "sha512-qOKJyNj/h+OWx7s5DePL6Zu1KeM9jPZhwBqs+7DzP6bGOvqzVCSf0xueYmVuaC/oQ/VtS2zLMLHdQFbkka+XDQ==",
  "amdefine@1.0.1": "sha1-SlKCrBZHKek2Gbz9OtFR+BfOkfU=",
  "angular-animate@1.8.0": "sha512-ROFK3UIn1MSVpqAlay15ZxjPmVbvwaO3Zn/2vhmQdYeqxSbUVuOckcvtDLBpHPGPtOAreu35qfV7NQ7u2EgDcA==",
  "angular-cookies@1.8.0": "sha512-gWO3RKF0WMmXhseiN3Aw9aEmQ3mB53wSdAxpeKKHbiDwU7vmK+MBuebyOX9qbwZYubn5nM8LByZVmg7T6jOV1w==",
  "angular-mocks@1.8.0": "sha512-oFKJIqR6zcsW6V9UQMuUYCXIcTy+n7oYExXxZkvU57hwJQdU1nuNZcSMQA9URiEAPyo7v3bqm0eOP3Ezi7Bigg==",
  "angular-route@1.8.0": "sha512-ORvXAdVfCCA6XFwyjSkVQFFGufj0mNGiCvBR93Qsii8+7t/6Ioy6wheUoCj1x4NWUv7hAq3nYYGCVO6QEKb1BQ==",
  "angular-sanitize@1.8.0": "sha512-j5GiOPCvfcDWK5svEOVoPb11X3UDVy/mdHPRWuy14Iyw86xaq+Bb+x/em2sAOa5MQQeY5ciLXbF3RRp8iCKcNg==",
  "angular-translate@2.18.3": "sha512-ziEi1nTaNIsdn3iKpcALaSFjM9CjwvoIWE/EKepajB/6qT5oB3K1IU5VcaH7Bd0scNRfaJpW+qUD6nsHWDEZ6A==",
  "angular-ui-bootstrap@2.5.6": "sha512-yzcHpPMLQl0232nDzm5P4iAFTFQ9dMw0QgFLuKYbDj9M0xJ62z0oudYD/Lvh1pWfRsukiytP4Xj6BHOSrSXP8A==",
  "angular-ui-tree@2.22.6": "sha512-VzuXM6NdYeQD0Y1RF5oTYc3o8yoW9mtxhnJs5Fvwu40V1Alzq7ybJj+kvApXZ69M0mvRd8LLM+3Q4pI26md+fA==",
  "angular@1.8.0": "sha512-VdaMx+Qk0Skla7B5gw77a8hzlcOakwF8mjlW13DpIWIDlfqwAbSSLfd8N/qZnzEmQF4jC4iofInd3gE7vL8ZZg==",
  "ansi-colors@4.1.1": "sha512-JoX0apGbHaUJBNl6yF+p6JAFYZ666/hhCGKN5t9QFjbJQKUU/g8MNbFDbvfrgKXvI1QpZplPOnwIo99lX/AAmA==",
  "ansi-gray@0.1.1": "sha1-KWLPVOyXksSFEKPetSRDaGHvclE=",
  "ansi-regex@4.1.0": "sha512-1apePfXM1UOSqw0o9IiFAovVz9M5S1Dg+4TrDwfMewQ6p/rmMueb7tWZjQ1rx4Loy1ArBggoqGpfqqdI4rondg==",
  "ansi-regex@5.0.1": "sha512-quJQXlTSUGL2LH9SUXo8VwsY4soanhgo6LNSm84E1LBcE8s3O0wpdiRzyR9z/ZZJMlMWv37qOOb9pdJlMUEKFQ==",
  "ansi-styles@3.2.1": "sha512-VT0ZI6kZRdTh8YyJw3SMbYm/u+NqfsAxEpWO0Pf9sq8/e94WxxOpPKx9FR1FlyCtOVDNOQ+8ntlqFxiRc+r5qA==",
  "ansi-styles@4.3.0": "sha512-zbB9rCJAT1rbjiVDb2hqKFHNYLxgtk8NURxZ3IZwD3F6NtxbXZQCnnSi1Lkx+IDohdPlFp222wVALIheZJQSEg==",
  "ansi-wrap@0.1.0": "sha1-qCJQ3bABXponyoLoLqYDu/pF768=",
  "anymatch@3.1.2": "sha512-P43ePfOAIupkguHUycrc4qJ9kz8ZiuOUijaETwX7THt0Y/GNK7v0aa8rY816xWjZ7rJdA5XdMcpVFTKMq+RvWg==",
  "apache-crypt@1.2.5": "sha512-ICnYQH+DFVmw+S4Q0QY2XRXD8Ne8ewh8HgbuFH4K7022zCxgHM0Hz1xkRnUlEfAXNbwp1Cnhbedu60USIfDxvg==",
  "apache-md5@1.1.7": "sha512-JtHjzZmJxtzfTSjsCyHgPR155HBe5WGyUyHTaEkfy46qhwCFKx1Epm6nAxgUG3WfUZP1dWhGqj9Z2NOBeZ+uBw==",
  "argparse@1.0.10": "sha512-o5Roy6tNG4SL/FOkCAN6RzjiakZS25RLYFrcMttJqbdd8BWrnA+fGz57iN5Pb06pvBGvl5gQ0B48dJlslXvoTg==",
  "array-from@2.1.1": "sha1-z+nYwmYoudxa7MYqn12PHzUsEZU=",
  "array-includes@3.1.4": "sha512-ZTNSQkmWumEbiHO2GF4GmWxYVTiQyJy2XOTa15sdQSrvKn7l+180egQMqlrMOUMCyLMD7pmyQe4mMDUT6Behrw==",
  "array-union@2.1.0": "sha512-HGyxoOTYUyCM6stUe6EJgnd4EoewAI7zMdfqO+kGjnlZmBDz/cR5pf8r/cR4Wq60sL/p0IkcjUEEPwS3GFrIyw==",
  "array.prototype.flat@1.2.5": "sha512-KaYU+S+ndVqyUnignHftkwc58o3uVU1jzczILJ1tN2YaIZpFIKBiP/x/j97E5MVPsaCloPbqWLB/8qCTVvT2qg==",
  "asn1@0.2.6": "sha512-ix/FxPn0MDjeyJ7i/yoHGFt/EX6LyNbxSEhPPXODPL+KB0VPk86UYfL0lMdy+KCnv+fmvIzySwaK5COwqVbWTQ==",
  "assert-plus@1.0.0": "sha1-8S4PPF13sLHN2RRpQuTpbB5N1SU=",
  "ast-transform@0.0.0": "sha1-dJRAWIh9goPhidlUYAlHvJj+AGI=",
  "ast-types@0.7.8": "sha1-kC0uDWDQcb3NRtwRXhgJ7RHBOKk=",
  "astral-regex@1.0.0": "sha512-+Ryf6g3BKoRc7jfp7ad8tM4TtMiaWvbF/1/sQcZPkkS7ag3D5nMBCe2UfOTONtAkaG0tO0ij3C5Lwmf1EiyjHg==",
  "asynckit@0.4.0": "sha1-x57Zf380y48robyXkLzDZkdLS3k=",
  "at-least-node@1.0.0": "sha512-+q/t7Ekv1EDY2l6Gda6LLiX14rU9TV20Wa3ofeQmwPFZbOMo9DXrLbOjFaaclkXKWidIaopwAObQDqwWtGUjqg==",
  "aws-sign2@0.7.0": "sha1-tG6JCTSpWR8tL2+G1+ap8bP+dqg=",
  "aws4@1.11.0": "sha512-xh1Rl34h6Fi1DC2WWKfxUTVqRsNnr6LsKz2+hfwDxQJWmrx8+c7ylaqBMcHfl1U1r2dsifOvKX3LQuLNZ+XSvA==",
  "babel-plugin-dynamic-import-node@2.3.3": "sha512-jZVI+s9Zg3IqA/kdi0i6UDCybUI3aSBLnglhYbSSjKlV7yF1F/5LWv8MakQmvYpnbJDS6fcBL2KzHSxNCMtWSQ==",
  "babel-plugin-polyfill-corejs2@0.3.1_@babel+core@7.17.8": "sha512-v7/T6EQcNfVLfcN2X8Lulb7DjprieyLWJK/zOWH5DUYcAgex9sP3h25Q+DLsX9TloXe3y1O8l2q2Jv9q8UVB9w==",
  "babel-plugin-polyfill-corejs3@0.5.2_@babel+core@7.17.8": "sha512-G3uJih0XWiID451fpeFaYGVuxHEjzKTHtc9uGFEjR6hHrvNzeS/PX+LLLcetJcytsB5m4j+K3o/EpXJNb/5IEQ==",
  "babel-plugin-polyfill-regenerator@0.3.1_@babel+core@7.17.8": "sha512-Y2B06tvgHYt1x0yz17jGkGeeMr5FeKUu+ASJ+N6nB5lQ8Dapfg42i0OVrf8PNGJ3zKL4A23snMi1IRwrqqND7A==",
  "balanced-match@1.0.2": "sha512-3oSeUO0TMV67hN1AmbXsK4yaqU7tjiHlbxRDZOpH0KW9+CeX4bRAaX0Anxt0tx2MrpRpWwQaPwIlISEJhYU5Pw==",
  "base64-js@1.3.1": "sha512-mLQ4i2QO1ytvGWFWmcngKO//JXAQueZvwEKtjgQFM4jIK0kU+ytMfplL8j+n5mspOfjHwoAg+9yhb7BwAHm36g==",
  "base64-js@1.5.1": "sha512-AKpaYlHn8t4SVbOHCy+b5+KKgvR4vrsD8vbvrbiQJps7fKDTkjkDry6ji0rUJjC0kzbNePLwzxq8iypo41qeWA==",
  "basic-auth@2.0.1": "sha512-NF+epuEdnUYVlGuhaxbbq+dvJttwLnGY+YixlXlME5KpQ5W3CnXA5cVTneY3SPbPDRkcjMbifrwmFYcClgOZeg==",
  "batch@0.6.1": "sha1-3DQxT05nkxgJP8dgJyUl+UvyXBY=",
  "bcrypt-pbkdf@1.0.2": "sha1-pDAdOJtqQ/m2f/PKEaP2Y342Dp4=",
  "bcryptjs@2.4.3": "sha1-mrVie5PmBiH/fNrF2pczAn3x0Ms=",
  "binary-extensions@2.2.0": "sha512-jDctJ/IVQbZoJykoeHbhXpOlNBqGNcwXJKJog42E5HDPUwQTSdjCHdihjj0DlnheQ7blbT6dHOafNAiS8ooQKA==",
  "bl@4.1.0": "sha512-1W07cM9gS6DcLperZfFSj+bWLtaPGSOHWhPiGzXmvVJbRLdG82sH/Kn8EtW1VqWVA54AKf2h5k5BbnIbwF3h6w==",
  "boolbase@1.0.0": "sha1-aN/1++YMUes3cl6p4+0xDcwed24=",
  "bootstrap@3.4.1": "sha512-yN5oZVmRCwe5aKwzRj6736nSmKDX7pLYwsXiCj/EYmo16hODaBiT4En5btW/jhBF/seV+XMx3aYwukYC3A49DA==",
  "brace-expansion@1.1.11": "sha512-iCuPHDFgrHX7H2vEI/5xpz07zSHB00TpugqhmYtVmMO6518mCuRMoOYFldEBl0g187ufozdaHgWKcYFb61qGiA==",
  "braces@3.0.2": "sha512-b8um+L1RzM3WDSzvhm6gIz1yfTbBt6YTlcEKAvsmqCZZFw46z626lVj9j1yEPW33H5H+lBQpZMP1k8l+78Ha0A==",
  "brfs@2.0.2": "sha512-IrFjVtwu4eTJZyu8w/V2gxU7iLTtcHih67sgEdzrhjLBMHp2uYefUBfdM4k2UvcuWMgV7PQDZHSLeNWnLFKWVQ==",
  "brotli@1.3.2": "sha1-UlqcrU/LqWR119OI9q7LE+7VL0Y=",
  "browser-resolve@1.11.3": "sha512-exDi1BYWB/6raKHmDTCicQfTkqwN5fioMFV4j8BsfMU4R2DK/QfZfK7kOVkmWCNANf0snkBzqGqAJBao9gZMdQ==",
  "browserify-optional@1.0.1": "sha1-HhNyLP3g2F8SFnbCpyztUzoBiGk=",
  "browserslist@4.20.2": "sha512-CQOBCqp/9pDvDbx3xfMi+86pr4KXIf2FDkTTdeuYw8OxS9t898LA1Khq57gtufFILXpfgsSx5woNgsBgvGjpsA==",
  "buffer-equal@0.0.1": "sha1-kbx0sR6kBbyRa8aqkI+q+ltKrEs=",
  "buffer-from@1.1.2": "sha512-E+XQCRwSbaaiChtv6k6Dwgc+bx+Bs6vuKJHHl5kox/BaKbhiXzqQOwK4cO22yElGp2OCmjwVhT3HmxgyPGnJfQ==",
  "buffer@5.7.1": "sha512-EHcyIPBQ4BSGlvjB16k5KgAJ27CIsHY/2JBmCRReo48y9rQ3MaUzWX3KVlBa4U7MyX02HdVj0K7C3WaB3ju7FQ==",
  "call-bind@1.0.2": "sha512-7O+FbCihrB5WGbFYesctwmTKae6rOiIzmz1icreWJ+0aA7LJfuqhEso2T9ncpcFtzMQtzXf2QGGueWJGTYsqrA==",
  "callsite@1.0.0": "sha1-KAOY5dZkvXQDi28JBRU+borxvCA=",
  "callsites@3.1.0": "sha512-P8BjAsXvZS+VIDUI11hHCQEv74YT67YUi5JJFNWIqL235sBmjX4+qx9Muvls5ivyNENctx46xQLQ3aTuE7ssaQ==",
  "caniuse-lite@1.0.30001322": "sha512-neRmrmIrCGuMnxGSoh+x7zYtQFFgnSY2jaomjU56sCkTA6JINqQrxutF459JpWcWRajvoyn95sOXq4Pqrnyjew==",
  "caseless@0.12.0": "sha1-G2gcIf+EAzyCZUMJBolCDRhxUdw=",
  "chalk@2.4.2": "sha512-Mti+f9lpJNcwF4tWV8/OrTTtF1gZi+f8FqlyAdouralcFWFQWF2+NgCHShjkCb+IFBLq9buZwE1xckQU4peSuQ==",
  "chalk@4.1.0": "sha512-qwx12AxXe2Q5xQ43Ac//I6v5aXTipYrSESdOgzrN+9XjgEpyjpKuvSGaN4qE93f7TQTlerQQ8S+EQ0EyDoVL1A==",
  "chalk@4.1.2": "sha512-oKnbhFyRIXpUuez8iBMmyEa4nbj4IOQyuhc/wy9kY7/WVPcwIO9VA668Pu8RkO7+0G76SLROeyw9CpQ061i4mA==",
  "cheerio-select@1.5.0": "sha512-qocaHPv5ypefh6YNxvnbABM07KMxExbtbfuJoIie3iZXX1ERwYmJcIiRrr9H05ucQP1k28dav8rpdDgjQd8drg==",
  "cheerio@1.0.0-rc.10": "sha512-g0J0q/O6mW8z5zxQ3A8E8J1hUgp4SMOvEoW/x84OwyHKe/Zccz83PVT4y5Crcr530FV6NgmKI1qvGTKVl9XXVw==",
  "chokidar@3.5.3": "sha512-Dr3sfKRP6oTcjf2JmUmFJfeVMvXBdegxB0iVQ5eb2V10uFJUCAS8OByZdVAyVb8xXNz3GjjTgj9kLWsZTqE6kw==",
  "ckeditor4@4.18.0": "sha512-O4tnQCH0APKrBsz78L+m48s9Cs90aq0Nsatmh9CUj2YBTh8UZYdYcelBLVA84SlwA1nsx07aC76Zn08vgHqmLQ==",
  "cli-cursor@3.1.0": "sha512-I/zHAwsKf9FqGoXM4WWRACob9+SNukZTd94DWF57E4toouRulbCxcUh6RKUEOQlYTHJnzkPMySvPNaaSLNfLZw==",
  "cli-spinners@2.6.1": "sha512-x/5fWmGMnbKQAaNwN+UZlV79qBLM9JFnJuJ03gIi5whrob0xV0ofNVHy9DhwGdsMJQc2OKv0oGmLzvaqvAVv+g==",
  "clone@1.0.4": "sha1-2jCcwmPfFZlMaIypAheco8fNfH4=",
  "code-block-writer@11.0.0": "sha512-GEqWvEWWsOvER+g9keO4ohFoD3ymwyCnqY3hoTr7GZipYFwEhMHJw+TtV0rfgRhNImM6QWZGO2XYjlJVyYT62w==",
  "color-convert@1.9.3": "sha512-QfAUtd+vFdAtFQcC8CCyYt1fYWxSqAiK2cSD6zDB8N3cpsEBAvRxp9zOGg6G/SHHJYAT88/az/IuDGALsNVbGg==",
  "color-convert@2.0.1": "sha512-RRECPsj7iu/xb5oKYcsFHSppFNnsj/52OVTRKb4zP5onXwVF3zVmmToNcOfGC+CRDpfK/U584fMg38ZHCaElKQ==",
  "color-name@1.1.3": "sha1-p9BVi9icQveV3UIyj3QIMcpTvCU=",
  "color-name@1.1.4": "sha512-dOy+3AuW3a2wNbZHIuMZpTcgjGuLU/uBL/ubcZF9OXbDo8ff4O8yVp5Bf0efS8uEoYo5q4Fx7dY9OgQGXgAsQA==",
  "color-support@1.1.3": "sha512-qiBjkpbMLO/HL68y+lh4q0/O1MZFj2RX6X/KmMa3+gJD3z+WwI1ZzDHysvqHGS3mP6mznPckpXmw1nI9cJjyRg==",
  "colors@1.4.0": "sha512-a+UqTh4kgZg/SlGvfbzDHpgRu7AAQOmmqRHJnxhRZICKFUT91brVhNNt58CMWU9PsBbv3PDCZUHbVxuDiH2mtA==",
  "combined-stream@1.0.8": "sha512-FQN4MRfuJeHf7cBbBMJFXhKSDq+2kAArBlmRBvcvFE5BB1HZKXtSFASDhdlz9zOYwxh8lDdnvmMOe/+5cdoEdg==",
  "commander@9.1.0": "sha512-i0/MaqBtdbnJ4XQs4Pmyb+oFQl+q0lsAmokVUH92SlSw4fkeAcG3bVon+Qt7hmtF+u3Het6o4VgrcY3qAoEB6w==",
  "comment-parser@0.7.6": "sha512-GKNxVA7/iuTnAqGADlTWX4tkhzxZKXp5fLJqKTlQLHkE65XDUKutZ3BHaJC5IGcper2tT3QRD1xr4o3jNpgXXg==",
  "concat-map@0.0.1": "sha1-2Klr13/Wjfd5OnMDajug1UBdR3s=",
  "concat-stream@1.6.2": "sha512-27HBghJxjiZtIk3Ycvn/4kbJk/1uZuJFfuPEns6LaEvpvG1f0hTea8lilrouyo9mVc2GWdcEZ8OLoGmSADlrCw==",
  "connect@3.7.0": "sha512-ZqRXc+tZukToSNmh5C2iWMSoV3X1YUcPbqEM4DkEG5tNQXrQUZCNVGGv3IuicnkMtPfGf3Xtp8WCXs295iQ1pQ==",
  "contains-path@0.1.0": "sha1-/ozxhP9mcLa67wGp1IYaXL7EEgo=",
  "convert-source-map@1.8.0": "sha512-+OQdjP49zViI/6i7nIJpA8rAl4sV/JdPfU9nZs3VqOwGIgizICvuN2ru6fMd+4llL0tar18UYJXfZ/TWtmhUjA==",
  "core-js-compat@3.21.1": "sha512-gbgX5AUvMb8gwxC7FLVWYT7Kkgu/y7+h/h1X43yJkNqhlK2fuYyQimqvKGNZFAY6CKii/GFKJ2cp/1/42TN36g==",
  "core-js@2.6.5": "sha512-klh/kDpwX8hryYL14M9w/xei6vrv6sE8gTHDG7/T/+SEovB/G4ejwcfE/CBzO6Edsu+OETZMZ3wcX/EjUkrl5A==",
  "core-util-is@1.0.2": "sha1-tf1UIgqivFq1eqtxQMlAdUUDwac=",
  "core-util-is@1.0.3": "sha512-ZQBvi1DcpJ4GDqanjucZ2Hj3wEO5pZDS89BWbkcrvdxksJorwUDDZamX9ldFkp9aw2lmBDLgkObEA4DWNJ9FYQ==",
  "cors@2.8.5": "sha512-KIHbLJqu73RGr/hnbrO9uBeixNGuvSQjul/jdFvS/KFSIH1hWVd1ng7zOHx+YrEfInLG7q4n6GHQ9cDtxv/P6g==",
  "cosmiconfig@7.0.1": "sha512-a1YWNUV2HwGimB7dU2s1wUMurNKjpx60HxBB6xUM8Re+2s1g1IIfJvFR0/iCF+XHdE0GMTKTuLR32UQff4TEyQ==",
  "cross-spawn@7.0.3": "sha512-iRDPJKUPVEND7dHPO8rkbOnPpyDygcDFtWjpeWNCgy8WP2rXcxXL8TskReQl6OrB2G7+UJrags1q15Fudc7G6w==",
  "crypto-js@4.0.0": "sha512-bzHZN8Pn+gS7DQA6n+iUmBfl0hO5DJq++QP3U6uTucDtk/0iGpXd/Gg7CGR0p8tJhofJyaKoWBuJI4eAO00BBg==",
  "css-select@4.1.3": "sha512-gT3wBNd9Nj49rAbmtFHj1cljIAOLYSX1nZ8CB7TBO3INYckygm5B7LISU/szY//YmdiSLbJvDLOx9VnMVpMBxA==",
  "css-what@5.1.0": "sha512-arSMRWIIFY0hV8pIxZMEfmMI47Wj3R/aWpZDDxWYCPEiOMv6tfOrnpDtgxBYPEQD4V0Y/958+1TdC3iWTFcUPw==",
  "d@1.0.1": "sha512-m62ShEObQ39CfralilEQRjH6oAMtNCV1xJyEx5LpRYUVN+EviphDgUc/F3hnYbADmkiNs67Y+3ylmlG7Lnu+FA==",
  "dash-ast@2.0.1": "sha512-5TXltWJGc+RdnabUGzhRae1TRq6m4gr+3K2wQX0is5/F2yS6MJXJvLyI3ErAnsAXuJoGqvfVD5icRgim07DrxQ==",
  "dashdash@1.14.1": "sha1-hTz6D3y+L+1d4gMmuN1YEDX24vA=",
  "debug@2.6.9": "sha512-bC7ElrdJaJnPbAP+1EotYvqZsb3ecl5wi6Bfi6BJTUcNowp6cvspg0jXznRTKDjm/E7AdgFBVeAPVMNcKGsHMA==",
  "debug@3.2.7": "sha512-CFjzYYAi4ThfiQvizrFQevTTXHtnCqWfe7x1AhgEscTz6ZbLbfoLRLPugTQyBth6f8ZERVUSyWHFD/7Wu4t1XQ==",
  "debug@4.3.3": "sha512-/zxw5+vh1Tfv+4Qn7a5nsbcJKPaSvCDhojn6FEl9vupwK2VCSDtEiEtqr8DFtzYFOdz63LBkxec7DYuc2jon6Q==",
  "decache@4.6.1": "sha512-ohApBM8u9ygepJCjgBrEZSSxPjc0T/PJkD+uNyxXPkqudyUpdXpwJYp0VISm2WrPVzASU6DZyIi6BWdyw7uJ2Q==",
  "deep-equal@1.1.1": "sha512-yd9c5AdiqVcR+JjcwUQb9DkhJc8ngNr0MahEBGvDiJw8puWab2yZlh+nkasOnZP+EGTAP6rRp2JzJhJZzvNF8g==",
  "deep-is@0.1.4": "sha512-oIPzksmTg4/MriiaYGO+okXDT7ztn/w3Eptv/+gSIdMdKsJo0u4CfYNFJPy+4SKMuCqGw2wxnA+URMg3t8a/bQ==",
  "defaults@1.0.3": "sha1-xlYFHpgX2f8I7YgUd/P+QBnz730=",
  "define-lazy-prop@2.0.0": "sha512-Ds09qNh8yw3khSjiJjiUInaGX9xlqZDY7JVryGxdxV7NPeuqQfplOpQ66yJFZut3jLa5zOwkXw1g9EI2uKh4Og==",
  "define-properties@1.1.3": "sha512-3MqfYKj2lLzdMSf8ZIZE/V+Zuy+BgD6f164e8K2w7dgnpKArBDerGYpM46IYYcjnkdPNMjPk9A6VFB8+3SKlXQ==",
  "delayed-stream@1.0.0": "sha1-3zrhmayt+31ECqrgsp4icrJOxhk=",
  "depd@1.1.2": "sha1-m81S4UwJd2PnSbJ0xDRu0uVgtak=",
  "depd@2.0.0": "sha512-g7nH6P6dyDioJogAAGprGpCtVImJhpPk/roCzdb3fIh61/s/nPsfR6onyMwkCAR/OlC3yBC0lESvUoQEAssIrw==",
  "destroy@1.2.0": "sha512-2sJGJTaXIIaR1w4iJSNoN0hnMY7Gpc/n8D4qSCJw8QqFWXf7cuAgnEHxBpweaVcPevC2l3KpjYCx3NypQQgaJg==",
  "dfa@1.2.0": "sha512-ED3jP8saaweFTjeGX8HQPjeC1YYyZs98jGNZx6IiBvxW7JG5v492kamAQB3m2wop07CvU/RQmzcKr6bgcC5D/Q==",
  "dir-glob@3.0.1": "sha512-WkrWp9GR4KXfKGYzOLmTuGVi1UWFfws377n9cc55/tb6DuqyF6pcQ5AbiHEshaDpY9v6oaSr2XCDidGmMwdzIA==",
  "doctrine@1.5.0": "sha1-N53Ocw9hZvds76TmcHoVmwLFpvo=",
  "doctrine@3.0.0": "sha512-yS+Q5i3hBf7GBkd4KG8a7eBNNWNGLTaEwwYWUijIYM7zrlYDM0BFXHjjPWlWZ1Rg7UaddZeIDmi9jF3HmqiQ2w==",
  "dom-serializer@1.3.2": "sha512-5c54Bk5Dw4qAxNOI1pFEizPSjVsx5+bpJKmL2kPn8JhBUq2q09tTCa3mjijun2NfK78NMouDYNMBkOrPZiS+ig==",
  "domelementtype@2.2.0": "sha512-DtBMo82pv1dFtUmHyr48beiuq792Sxohr+8Hm9zoxklYPfa6n0Z3Byjj2IV7bmr2IyqClnqEQhfgHJJ5QF0R5A==",
  "domhandler@4.3.0": "sha512-fC0aXNQXqKSFTr2wDNZDhsEYjCiYsDWl3D01kwt25hm1YIPyDGHvvi3rw+PLqHAl/m71MaiF7d5zvBr0p5UB2g==",
  "domutils@2.8.0": "sha512-w96Cjofp72M5IIhpjgobBimYEfoPjx1Vx0BSX9P30WBdZW2WIKU0T1Bd0kz2eNZ9ikjKgHbEyKx8BB6H1L3h3A==",
  "dot@1.1.3": "sha512-/nt74Rm+PcfnirXGEdhZleTwGC2LMnuKTeeTIlI82xb5loBBoXNYzr2ezCroPSMtilK8EZIfcNZwOcHN+ib1Lg==",
  "duplexer2@0.1.4": "sha1-ixLauHjA1p4+eJEFFmKjL8a93ME=",
  "duplexer@0.1.2": "sha512-jtD6YG370ZCIi/9GTaJKQxWTZD045+4R4hTk/x1UyoqadyJ9x9CgSi1RlVDQF8U2sxLLSnFkCaMihqljHIWgMg==",
  "ecc-jsbn@0.1.2": "sha1-OoOpBOVDUyh4dMVkt1SThoSamMk=",
  "ee-first@1.1.1": "sha1-WQxhFWsK4vTwJVcyoViyZrxWsh0=",
  "electron-to-chromium@1.4.101": "sha512-XJH+XmJjACx1S7ASl/b//KePcda5ocPnFH2jErztXcIS8LpP0SE6rX8ZxiY5/RaDPnaF1rj0fPaHfppzb0e2Aw==",
  "emoji-regex@7.0.3": "sha512-CwBLREIQ7LvYFB0WyRvwhq5N5qPhc6PMjD6bYggFlI5YyDgl+0vxq5VHbMOFqLg7hfWzmu8T5Z1QofhmTIhItA==",
  "encodeurl@1.0.2": "sha1-rT/0yG7C0CkyL1oCw6mmBslbP1k=",
  "end-of-stream@1.4.4": "sha512-+uw1inIHVPQoaVuHzRyXd21icM+cnt4CzD5rW+NC1wjOUSTOs+Te7FOv7AhN7vS9x/oIyhLP5PR1H+phQAHu5Q==",
  "enquirer@2.3.6": "sha512-yjNnPr315/FjS4zIsUxYguYUPP2e1NK4d7E7ZOLiyYCcbFBiTMyID+2wvm2w6+pZ/odMA7cRkjhsPbltwBOrLg==",
  "entities@2.2.0": "sha512-p92if5Nz619I0w+akJrLZH0MX0Pb5DX39XOwQTtXSdQQOaYH03S1uIQp4mhOZtAXrxq4ViO67YTiLBo2638o9A==",
  "eonasdan-bootstrap-datetimepicker@4.17.47": "sha1-ekmXAEQGUnbnll79Fvgic1IZ5zU=",
  "error-ex@1.3.2": "sha512-7dFHNmqeFSEt2ZBsCriorKnn3Z2pj+fd9kmI6QoWw4//DL+icEBfc0U7qJCisqrTsKTjw4fNFy2pW9OqStD84g==",
  "es-abstract@1.19.1": "sha512-2vJ6tjA/UfqLm2MPs7jxVybLoB8i1t1Jd9R3kISld20sIxPcTbLuggQOUxeWeAvIUkduv/CfMjuh4WmiXr2v9w==",
  "es-to-primitive@1.2.1": "sha512-QCOllgZJtaUo9miYBcLChTUaHNjJF3PYs1VidD7AwiEj1kYxKeQTctLAezAOH5ZKRH0g2IgPn6KwB4IT8iRpvA==",
  "es5-ext@0.10.53": "sha512-Xs2Stw6NiNHWypzRTY1MtaG/uJlwCk8kH81920ma8mvN8Xq1gsfhZvpkImLQArw8AHnv8MT2I45J3c0R8slE+Q==",
  "es6-iterator@2.0.3": "sha1-p96IkUGgWpSwhUQDstCg+/qY87c=",
  "es6-map@0.1.5": "sha1-kTbgUD3MBqMBaQ8LsU/042TpSfA=",
  "es6-set@0.1.5": "sha1-0rPsXU2ADO2BjbU40ol02wpzzLE=",
  "es6-symbol@3.1.1": "sha1-vwDvT9q2uhtG7Le2KbTH7VcVzHc=",
  "es6-symbol@3.1.3": "sha512-NJ6Yn3FuDinBaBRWl/q5X/s4koRHBrgKAu+yGI6JCBeiu3qrcbJhwT2GeR/EXVfylRk8dpQVJoLEFhK+Mu31NA==",
  "escalade@3.1.1": "sha512-k0er2gUkLf8O0zKJiAhmkTnJlTvINGv7ygDNPbeIsX/TJjGJZHuh9B2UxbsaEkmlEo9MfhrSzmhIlhRlI2GXnw==",
  "escape-html@1.0.3": "sha1-Aljq5NPQwJdN4cFpGI7wBR0dGYg=",
  "escape-string-regexp@1.0.5": "sha1-G2HAViGQqN/2rjuyzwIAyhMLhtQ=",
  "escodegen@1.14.3": "sha512-qFcX0XJkdg+PB3xjZZG/wKSuT1PnQWx57+TVSjIMmILd2yC/6ByYElPwJnslDsuWuSAp4AwJGumarAAmJch5Kw==",
  "escodegen@1.2.0": "sha1-Cd55Z3kcyVi3+Jot220jRRrzJ+E=",
  "eslint-config-prettier@6.11.0_eslint@7.9.0": "sha512-oB8cpLWSAjOVFEJhhyMZh6NOEOtBVziaqdDQ86+qhDHFbZXoRTM7pNSvFRfW/W/L/LrQ38C99J5CGuRBBzBsdA==",
  "eslint-import-resolver-node@0.3.6": "sha512-0En0w03NRVMn9Uiyn8YRPDKvWjxCWkslUEhGNTdGx15RvPJYQ+lbOlqrlNI2vEAs4pDYK4f/HN2TbDmk5TP0iw==",
  "eslint-module-utils@2.7.1": "sha512-fjoetBXQZq2tSTWZ9yWVl2KuFrTZZH3V+9iD1V1RfpDgxzJR+mPd/KZmMiA8gbPqdBzpNiEHOuT7IYEWxrH0zQ==",
  "eslint-plugin-ban@1.5.1": "sha512-I15ptCK+Oy/6N0/Trd9+fXRW0DHivX2K3lQf6+XNK0mRRv5G/4PFuVs7YQa5VxIxui8HVgXnwoa1HGHJDQF/WQ==",
  "eslint-plugin-deprecation@1.1.0_eslint@7.9.0+typescript@3.9.3": "sha512-+oDa6JbdZXyh7Bx2zx7VoDFZvFnV1pZVPVo/bEGVkuXlLih/evX0LQG2/nSuNg83CmwZTcAFZXXpLgsX4ctIDQ==",
  "eslint-plugin-import@2.22.0_eslint@7.9.0": "sha512-66Fpf1Ln6aIS5Gr/55ts19eUuoDhAbZgnr6UxK5hbDx6l/QgQgx61AePq+BV4PP2uXQFClgMVzep5zZ94qqsxg==",
  "eslint-plugin-jsdoc@30.5.1_eslint@7.9.0": "sha512-cY3YNxdhFcQVkcQLnZw/iZGsTPMuWa9yWZclorMWkjdHprBQX0TMWMEcmJYM3IjHp1HJr7aD0Z0sCRifEBhnzg==",
  "eslint-plugin-prefer-arrow@1.2.2_eslint@7.9.0": "sha512-C8YMhL+r8RMeMdYAw/rQtE6xNdMulj+zGWud/qIGnlmomiPRaLDGLMeskZ3alN6uMBojmooRimtdrXebLN4svQ==",
  "eslint-plugin-prettier@3.1.4_eslint@7.9.0+prettier@2.1.1": "sha512-jZDa8z76klRqo+TdGDTFJSavwbnWK2ZpqGKNZ+VvweMW516pDUMmQ2koXvxEE4JhzNvTv+radye/bWGBmA6jmg==",
  "eslint-scope@5.1.1": "sha512-2NxwbF/hZ0KpepYN0cNbo+FN6XoK7GaHlQhgx/hIZl6Va0bF45RQOOwhLIy8lQDbuCiadSLCBnH2CFYquit5bw==",
  "eslint-utils@2.1.0": "sha512-w94dQYoauyvlDc43XnGB8lU3Zt713vNChgt4EWwhXAP2XkBvndfxF0AgIqKOOasjPIPzj9JqgwkwbCYD0/V3Zg==",
  "eslint-visitor-keys@1.3.0": "sha512-6J72N8UNa462wa/KFODt/PJ3IU60SDpC3QXC1Hjc1BXXpfL2C9R5+AU7jhe0F6GREqVMh4Juu+NY7xn+6dipUQ==",
  "eslint-visitor-keys@2.1.0": "sha512-0rSmRBzXgDzIsD6mGdJgevzgezI534Cer5L/vyMX0kHzT/jiB43jRhd9YUlMGYLQy2zprNmoT8qasCGtY+QaKw==",
  "eslint@7.9.0": "sha512-V6QyhX21+uXp4T+3nrNfI3hQNBDa/P8ga7LoQOenwrlEFXrEnUEE+ok1dMtaS3b6rmLXhT1TkTIsG75HMLbknA==",
  "espree@7.3.1": "sha512-v3JCNCE64umkFpmkFGqzVKsOT0tN1Zr+ueqLZfpV1Ob8e+CEgPWa+OxCoGH3tnhimMKIaBm4m/vaRpJ/krRz2g==",
  "esprima@1.0.4": "sha1-n1V+CPw7TSbs6d00+Pv0drYlha0=",
  "esprima@4.0.1": "sha512-eGuFFw7Upda+g4p+QHvnW0RyTX/SVeJBDM/gCtMARO0cLuT2HcEKnTPvhjV6aGeqrCB/sbNop0Kszm0jsaWU4A==",
  "esquery@1.4.0": "sha512-cCDispWt5vHHtwMY2YrAQ4ibFkAL8RbH5YGBnZBc90MolvvfkkQcJro/aZiAQUlQ3qgrYS6D6v8Gc5G5CQsc9w==",
  "esrecurse@4.3.0": "sha512-KmfKL3b6G+RXvP8N1vr3Tq1kL/oCFgn2NYXEtqP8/L3pKapUA4G8cFVaoF3SU323CD4XypR/ffioHmkti6/Tag==",
  "estraverse@1.5.1": "sha1-hno+jlip+EYYr7bC3bzZFrfLr3E=",
  "estraverse@4.3.0": "sha512-39nnKffWz8xN1BU/2c79n9nB9HDzo0niYUqx6xyqUnyoAnQyyWpOTdZEeiCch8BBu515t4wp9ZmgVfVhn9EBpw==",
  "estraverse@5.3.0": "sha512-MMdARuVEQziNTeJD8DgMqmhwR11BRQ/cBP+pLtYdSTnf3MIO8fFeiINEbX36ZdNlfU/7A9f3gUw49B3oQsvwBA==",
  "estree-is-function@1.0.0": "sha512-nSCWn1jkSq2QAtkaVLJZY2ezwcFO161HVc174zL1KPW3RJ+O6C3eJb8Nx7OXzvhoEv+nLgSR1g71oWUHUDTrJA==",
  "esutils@1.0.0": "sha1-gVHTWOIMisx/t0XnRywAJf5JZXA=",
  "esutils@2.0.3": "sha512-kVscqXk4OCp68SZ0dkgEKVi6/8ij300KBWTJq32P/dYeWTSwK41WyTxalN1eRmA5Z9UU/LX9D7FWSmV9SAYx6g==",
  "etag@1.8.1": "sha1-Qa4u62XvpiJorr/qg6x9eSmbCIc=",
  "event-emitter@0.3.5": "sha1-34xp7vFkeSPHFXuc6DhAYQsCzDk=",
  "event-stream@4.0.1": "sha512-qACXdu/9VHPBzcyhdOWR5/IahhGMf0roTeZJfzz077GwylcDd90yOHLouhmv7GJ5XzPi6ekaQWd8AvPP2nOvpA==",
  "execa@4.1.0": "sha512-j5W0//W7f8UxAn8hXVnwG8tLwdiUy4FJLcSupCg6maBYZDpyBvTApK7KyuI4bKj8KOh1r2YH+6ucuYtJv1bTZA==",
  "ext@1.6.0": "sha512-sdBImtzkq2HpkdRLtlLWDa6w4DX22ijZLKx8BMPUuKe1c5lbN6xwQDQCxSfxBQnHZ13ls/FH0MQZx/q/gr6FQg==",
  "extend@3.0.2": "sha512-fjquC59cD7CyW6urNXK0FBufkZcoiGG80wTuPujX590cB5Ttln20E2UB4S/WARVqhXffZl2LNgS+gQdPIIim/g==",
  "extsprintf@1.3.0": "sha1-lpGEQOMEGnpBT4xS48V06zw+HgU=",
  "fancy-log@1.3.3": "sha512-k9oEhlyc0FrVh25qYuSELjr8oxsCoc4/LEZfg2iJJrfEk/tZL9bCoJE47gqAvI2m/AUjluCS4+3I0eTx8n3AEw==",
  "fancy-log@2.0.0": "sha512-9CzxZbACXMUXW13tS0tI8XsGGmxWzO2DmYrGuBJOJ8k8q2K7hwfJA5qHjuPPe8wtsco33YR9wc+Rlr5wYFvhSA==",
  "fast-deep-equal@3.1.3": "sha512-f3qQ9oQy9j2AhBe/H9VC91wLmKBCCU/gDOnKNAYG5hswO7BLKj09Hc5HYNz9cGI++xlpDCIgDaitVs03ATR84Q==",
  "fast-diff@1.2.0": "sha512-xJuoT5+L99XlZ8twedaRf6Ax2TgQVxvgZOYoPKqZufmJib0tL2tegPBOZb1pVNgIhlqDlA0eO0c3wBvQcmzx4w==",
  "fast-glob@3.2.11": "sha512-xrO3+1bxSo3ZVHAnqzyuewYT6aMFHRAd4Kcs92MAonjwQZLsK9d0SF1IyQ3k5PoirxTW0Oe/RqFgMQ6TcNE5Ew==",
  "fast-glob@3.2.2": "sha512-UDV82o4uQyljznxwMxyVRJgZZt3O5wENYojjzbaGEGZgeOxkLFf+V4cnUD+krzb2F72E18RhamkMZ7AdeggF7A==",
  "fast-json-stable-stringify@2.1.0": "sha512-lhd/wF+Lk98HZoTCtlVraHtfh5XYijIjalXck7saUtuanSDyLMxnHhSXEDJqHxD7msR8D0uCmqlkwjCV8xvwHw==",
  "fast-levenshtein@2.0.6": "sha1-PYpcZog6FqMMqGQ+hR8Zuqd5eRc=",
  "fastq@1.13.0": "sha512-YpkpUnK8od0o1hmeSc7UUs/eB/vIPWJYjKck2QKIzAf71Vm1AAQ3EbuZB3g2JIy+pg+ERD0vqI79KyZiB2e2Nw==",
  "faye-websocket@0.11.4": "sha512-CzbClwlXAuiRQAlUyfqPgvPoNKTckTPGfwZV4ZdAhVcP2lh9KUxJg2b5GkE7XbjKQ3YJnQ9z6D9ntLAlB+tP8g==",
  "file-entry-cache@5.0.1": "sha512-bCg29ictuBaKUwwArK4ouCaqDgLZcysCFLmM/Yn/FDoqndh/9vNuQfXRDvTuXKLxfD/JtZQGKFT8MGcJBK644g==",
  "fill-range@7.0.1": "sha512-qOo9F+dMUmC2Lcb4BbVvnKJxTPjCm+RRpe4gDuGrzkL7mEVl/djYSu2OdQ2Pa302N4oqkSg9ir6jaLWJ2USVpQ==",
  "finalhandler@1.1.2": "sha512-aAWcW57uxVNrQZqFXjITpW3sIUQmHGG3qSb9mUah9MgMC4NeWhNOlNjXEYq3HjRAvL6arUviZGGJsBg6z0zsWA==",
  "find-up@2.1.0": "sha1-RdG35QbHF93UgndaK3eSCjwMV6c=",
  "findit2@2.2.3": "sha1-WKRmaX34piBc39vzlVNri9d3pfY=",
  "fiori-fundamentals@1.5.10": "sha512-v2h65H9VWQ7H3PbJ8RXYB1jEYfCPi1ZYEF1k1GJ9ADDnXZeC8aIIUtBgbaq26N8aJLY/5qZ2P9O4nYO8YrNVTw==",
  "flat-cache@2.0.1": "sha512-LoQe6yDuUMDzQAEH8sgmh4Md6oZnc/7PjtwjNFSzveXqSHt6ka9fPBuso7IGf9Rz4uqnSnWiFH2B/zj24a5ReA==",
  "flatted@2.0.2": "sha512-r5wGx7YeOwNWNlCA0wQ86zKyDLMQr+/RB8xy74M4hTphfmjlijTSSXGuH8rnvKZnfT9i+75zmd8jcKdMR4O6jA==",
  "focus-trap@5.1.0": "sha512-CkB/nrO55069QAUjWFBpX6oc+9V90Qhgpe6fBWApzruMq5gnlh90Oo7iSSDK7pKiV5ugG6OY2AXM5mxcmL3lwQ==",
  "font-awesome@4.7.0": "sha1-j6jPBBGhoxr9B7BtKQK7n8gVoTM=",
  "forever-agent@0.6.1": "sha1-+8cfDEGt6zf5bFd60e1C2P2sypE=",
  "form-data@2.3.3": "sha512-1lLKB2Mu3aGP1Q/2eCOx0fNbRMe7XdwktwOruhfqqd0rIJWwN4Dh+E3hrPSlDCXnSR7UtZ1N38rVXm+6+MEhJQ==",
  "fresh@0.5.2": "sha1-PYyt2Q2XZWn6g1qx+OSyOhBWBac=",
  "from@0.1.7": "sha1-g8YK/Fi5xWmXAH7Rp2izqzA6RP4=",
  "fs-extra@10.0.1": "sha512-NbdoVMZso2Lsrn/QwLXOy6rm0ufY2zEOKCDzJR/0kBsb0E6qed0P3iYK+Ath3BfvXEeu4JhEtXLgILx5psUfag==",
  "fs-extra@9.1.0": "sha512-hcg3ZmepS30/7BSFqRvoo3DOMQu7IjqxO5nCDt+zM9XWjb33Wg7ziNT+Qvqbuc3+gWpzO02JubVyk2G4Zvo1OQ==",
  "fs.realpath@1.0.0": "sha1-FQStJSMVjKpA20onh8sBQRmU6k8=",
  "fsevents@2.3.2": "sha512-xiqMQR4xAeHTuB9uWm+fFRcIOgKBMiOBP+eXiyT7jsgVCq1bkVygt00oASowB7EdtpOHaaPgKt812P9ab+DDKA==",
  "function-bind@1.1.1": "sha512-yIovAzMX49sF8Yl58fSCWJ5svSLuaibPxXQJFLmBObTuCr0Mf1KiPopGM9NiFjiYBCbfaa2Fh6breQ6ANVTI0A==",
  "functional-red-black-tree@1.0.1": "sha1-GwqzvVU7Kg1jmdKcDj6gslIHgyc=",
  "fundamental-styles@0.4.1": "sha512-jmm42ecaif3iIvgNwF0PpydBlmHWY2i+gMpLuzkB7WiDJSXefsmL9KD0Riw5guV4hYw/KanYUeqMUBWyxU8ENA==",
  "gensync@1.0.0-beta.2": "sha512-3hN7NaskYvMDLQY55gnW3NQ+mesEAepTqlg+VEbj7zzqEMBVNhzcGYYeqFo/TlYz6eQiFcp1HcsCZO+nGgS8zg==",
  "get-assigned-identifiers@1.2.0": "sha512-mBBwmeGTrxEMO4pMaaf/uUEFHnYtwr8FTe8Y/mer4rcV/bye0qGm6pw1bGZFGStxC5O76c5ZAVBGnqHmOaJpdQ==",
  "get-intrinsic@1.1.1": "sha512-kWZrnVM42QCiEA2Ig1bG8zjoIMOgxWwYCEeNdwY6Tv/cOSeGpcoX4pXHfKUxNKVoArnrEr2e9srnAxxGIraS9Q==",
  "get-stdin@6.0.0": "sha512-jp4tHawyV7+fkkSKyvjuLZswblUtz+SQKzSWnBbii16BuZksJlU1wuBYXY75r+duh/llF1ur6oNwi+2ZzjKZ7g==",
  "get-stream@5.2.0": "sha512-nBF+F1rAZVCu/p7rjzgA+Yb4lfYXrpl7a6VmJrU8wF9I1CKvP/QwPNZHnOlwbTkY6dvtFIzFMSyQXbLoTQPRpA==",
  "get-symbol-description@1.0.0": "sha512-2EmdH1YvIQiZpltCNgkuiUnyukzxM/R6NDJX31Ke3BG1Nq5b0S2PhX59UKi9vZpPDQVdqn+1IcaAwnzTT5vCjw==",
  "getpass@0.1.7": "sha1-Xv+OPmhNVprkyysSgmBOi6YhSfo=",
  "glob-parent@5.1.2": "sha512-AOIgSQCepiJYwP3ARnGx+5VnTu2HBYdzbGP45eLw1vr3zB3vZLeyed1sC9hnbcOc9/SrMyM5RPQrkGz4aS9Zow==",
  "glob@7.1.6": "sha512-LwaxwyZ72Lk7vZINtNNrywX0ZuLyStrdDtabefZKAY5ZGJhVtgdznluResxNmPitE0SAO+O26sWTHeKSI2wMBA==",
  "glob@7.2.0": "sha512-lmLf6gtyrPq8tTjSmrO94wBeQbFR3HbLHbuyD69wuyQkImp2hWqMGB47OX65FBkPffO641IP9jWa1z4ivqG26Q==",
  "globals@11.12.0": "sha512-WOBp/EEGUiIsJSp7wcv/y6MO+lV9UoncWqxuFfm8eBwzWNgyfBd6Gz+IeKQ9jCmyhoH99g15M3T+QaVHFjizVA==",
  "globals@12.4.0": "sha512-BWICuzzDvDoH54NHKCseDanAhE3CeDorgDL5MT6LMXXj2WCnd9UC2szdk4AWLfjdgNBCXLUanXYcpBBKOSWGwg==",
  "globby@11.0.4": "sha512-9O4MVG9ioZJ08ffbcyVYyLOJLk5JQ688pJ4eMGLpdWLHq/Wr1D9BlriLQyL0E+jbkuePVZXYFj47QM/v093wHg==",
  "graceful-fs@4.2.8": "sha512-qkIilPUYcNhJpd33n0GBXTB1MMPp14TxEsEs0pTrsSVucApsYzW5V+Q8Qxhik6KU3evy+qkAAowTByymK0avdg==",
  "handlebars@4.7.7": "sha512-aAcXm5OAfE/8IXkcZvCepKU3VzW1/39Fb5ZuqMtgI/hT8X2YgoMvBY5dLhq/cpOvw7Lk1nK/UF71aLG/ZnVYRA==",
  "har-schema@2.0.0": "sha1-qUwiJOvKwEeCoNkDVSHyRzW37JI=",
  "har-validator@5.1.5": "sha512-nmT2T0lljbxdQZfspsno9hgrG3Uir6Ks5afism62poxqBM6sDnMEuPmzTq8XN0OEwqKLLdh1jQI3qyE66Nzb3w==",
  "has-bigints@1.0.1": "sha512-LSBS2LjbNBTf6287JEbEzvJgftkF5qFkmCo9hDRpAzKhUOlJ+hx8dd4USs00SgsUNwc4617J9ki5YtEClM2ffA==",
  "has-flag@3.0.0": "sha1-tdRU3CGZriJWmfNGfloH87lVuv0=",
  "has-flag@4.0.0": "sha512-EykJT/Q1KjTWctppgIAgfSO0tKVuZUjhgMr17kqTumMl6Afv3EISleU7qZUzoXDFTAHTDC4NOoG/ZxU3EvlMPQ==",
  "has-symbols@1.0.2": "sha512-chXa79rL/UC2KlX17jo3vRGz0azaWEx5tGqZg5pO3NUyEJVB17dMruQlzCCOfUvElghKcm5194+BCRvi2Rv/Gw==",
  "has-tostringtag@1.0.0": "sha512-kFjcSNhnlGV1kyoGk7OXKSawH5JOb/LzUc5w9B02hOTO0dfFRjbHQKvg1d6cf3HbeUmtU9VbbV3qzZ2Teh97WQ==",
  "has@1.0.3": "sha512-f2dvO0VU6Oej7RkWJGrehjbzMAjFp5/VKPp5tTpWIV4JHHZK1/BxbFRtf/siA2SWTe09caDmVtYYzWEIbBS4zw==",
  "hosted-git-info@2.8.9": "sha512-mxIDAb9Lsm6DoOJ7xH+5+X4y1LU/4Hi50L9C5sIswK3JzULS4bwk1FvjdBgvYR4bzT4tuUQiC15FE2f5HbLvYw==",
  "html-entities@2.3.3": "sha512-DV5Ln36z34NNTDgnz0EWGBLZENelNAtkiFA4kyNOG2tDI6Mz1uSWiq1wAKdyjnJwyDiDO7Fa2SO1CTxPXL8VxA==",
  "htmlparser2@6.1.0": "sha512-gyyPk6rgonLFEDGoeRgQNaEUvdJ4ktTmmUh/h2t7s+M8oPpIPxgNACWa+6ESR57kXstwqPiCut0V8NRpcwgU7A==",
  "http-auth-connect@1.0.5": "sha512-zykAOKpVAXyzhOLm6+xyB/RtRcfN3uDfH4Al73DIfeSb6B7nr0WToLI6UyyM6ohtcLmbBPksWXzVbEDStz8ObQ==",
  "http-auth@4.1.9": "sha512-kvPYxNGc9EKGTXvOMnTBQw2RZfuiSihK/mLw/a4pbtRueTE45S55Lw/3k5CktIf7Ak0veMKEIteDj4YkNmCzmQ==",
  "http-errors@1.6.3": "sha1-i1VoC7S+KDoLW/TqLjhYC+HZMg0=",
  "http-errors@2.0.0": "sha512-FtwrG/euBzaEjYeRqOgly7G0qviiXoJWnvEH2Z1plBdXgbyjv34pHTSb9zoeHMyDy33+DWy5Wt9Wo+TURtOYSQ==",
  "http-parser-js@0.5.5": "sha512-x+JVEkO2PoM8qqpbPbOL3cqHPwerep7OwzK7Ay+sMQjKzaKCqWvjoXm5tqMP9tXWWTnTzAjIhXg+J99XYuPhPA==",
  "http-signature@1.2.0": "sha1-muzZJRFHcvPZW2WmCruPfBj7rOE=",
  "human-signals@1.1.1": "sha512-SEQu7vl8KjNL2eoGBLF3+wAjpsNfA9XMlXAYj/3EdaNfAlxKthD1xjEQfGOUhllCGGJVNY34bRr6lPINhNjyZw==",
  "i18next@21.6.14": "sha512-XL6WyD+xlwQwbieXRlXhKWoLb/rkch50/rA+vl6untHnJ+aYnkQ0YDZciTWE78PPhOpbi2gR0LTJCJpiAhA+uQ==",
  "iconv-lite@0.6.3": "sha512-4fCk79wshMdzMp2rH06qWrJE4iolqLhCUH+OiuIgU++RB0+94NlDL81atO7GX55uUKueo0txHNtvEyI6D7WdMw==",
  "ieee754@1.2.1": "sha512-dcyqhDvX1C46lXZcVqCpK+FtMRQVdIMN6/Df5js2zouUsqG7I6sFxitIC+7KYK29KdXOLHdu9zL4sFnoVQnqaA==",
  "ignore@4.0.6": "sha512-cyFDKrqc/YdcWFniJhzI42+AzS+gNwmUzOSFcRCQYwySuBBBy/KjuxWLZ/FHEH6Moq1NizMOBWyTcv8O4OZIMg==",
  "ignore@5.1.9": "sha512-2zeMQpbKz5dhZ9IwL0gbxSW5w0NK/MSAMtNuhgIHEPmaU3vPdKPL0UdvUCXs5SS4JAwsBxysK5sFMW8ocFiVjQ==",
  "import-fresh@3.3.0": "sha512-veYYhQa+D1QBKznvhUHxb8faxlrwUnxseDAbAp457E0wLNio2bOSKnjYDhMj+YiAq61xrMGhQk9iXVk5FzgQMw==",
  "imurmurhash@0.1.4": "sha1-khi5srkoojixPcT7a21XbyMUU+o=",
  "inflight@1.0.6": "sha1-Sb1jMdfQLQwJvJEKEHW6gWW1bfk=",
  "inherits@2.0.3": "sha1-Yzwsg+PaQqUC9SRmAiSA9CCCYd4=",
  "inherits@2.0.4": "sha512-k/vGaX4/Yla3WzyMCvTQOXYeIHvqOKtnqBduzTHpzpQZzAskKMhZ2K+EnBiSM9zGSoIFeMpXKxa4dYeZIQqewQ==",
  "inside@1.0.0": "sha1-20Xpk1c82z23C5gy6ChbrUZCR3A=",
  "internal-slot@1.0.3": "sha512-O0DB1JC/sPyZl7cIo78n5dR7eUSwwpYPiXRhTzNxZVAMUuB8vlnRFyLxdrVToks6XPLVnFfbzaVd5WLjhgg+vA==",
  "intersection-observer@0.7.0": "sha512-Id0Fij0HsB/vKWGeBe9PxeY45ttRiBmhFyyt/geBdDHBYNctMRTE3dC1U3ujzz3lap+hVXlEcVaB56kZP/eEUg==",
  "is-arguments@1.1.1": "sha512-8Q7EARjzEnKpt/PCD7e1cgUS0a6X8u5tdSiMqXhojOdoV9TsMsiO+9VLC5vAmO8N7/GmXn7yjR8qnA6bVAEzfA==",
  "is-arrayish@0.2.1": "sha1-d8mYQFJ6qOyxqLppe4BkWnqSap0=",
  "is-bigint@1.0.4": "sha512-zB9CruMamjym81i2JZ3UMn54PKGsQzsJeo6xvN3HJJ4CAsQNB6iRutp2To77OfCNuoxspsIhzaPoO1zyCEhFOg==",
  "is-binary-path@2.1.0": "sha512-ZMERYes6pDydyuGidse7OsHxtbI7WVeUEozgR/g7rd0xUimYNlvZRE/K2MgZTjWy725IfelLeVcEM97mmtRGXw==",
  "is-boolean-object@1.1.2": "sha512-gDYaKHJmnj4aWxyj6YHyXVpdQawtVLHU5cb+eztPGczf6cjuTdwve5ZIEfgXqH4e57An1D1AKf8CZ3kYrQRqYA==",
  "is-callable@1.2.4": "sha512-nsuwtxZfMX67Oryl9LCQ+upnC0Z0BgpwntpS89m1H/TLF0zNfzfLMV/9Wa/6MZsj0acpEjAO0KF1xT6ZdLl95w==",
  "is-core-module@2.8.0": "sha512-vd15qHsaqrRL7dtH6QNuy0ndJmRDrS9HAM1CAiSifNUFv4x1a0CCVsj18hJ1mShxIG6T2i1sO78MkP56r0nYRw==",
  "is-date-object@1.0.5": "sha512-9YQaSxsAiSwcvS33MBk3wTCVnWK+HhF8VZR2jRxehM16QcVOdHqPn4VPHmRK4lSr38n9JriurInLcP90xsYNfQ==",
  "is-docker@2.2.1": "sha512-F+i2BKsFrH66iaUFc0woD8sLy8getkwTwtOBjvs56Cx4CgJDeKQeqfz8wAYiSb8JOprWhHH5p77PbmYCvvUuXQ==",
  "is-extglob@2.1.1": "sha1-qIwCU1eR8C7TfHahueqXc8gz+MI=",
  "is-fullwidth-code-point@2.0.0": "sha1-o7MKXE8ZkYMWeqq5O+764937ZU8=",
  "is-glob@4.0.3": "sha512-xelSayHH36ZgE7ZWhli7pW34hNbNl8Ojv5KVmkJD4hBdD3th8Tfk9vYasLM+mXWOZhFkgZfxhLSnrwRr4elSSg==",
  "is-interactive@1.0.0": "sha512-2HvIEKRoqS62guEC+qBjpvRubdX910WCMuJTZ+I9yvqKU2/12eSL549HMwtabb4oupdj2sMP50k+XJfB/8JE6w==",
  "is-negative-zero@2.0.1": "sha512-2z6JzQvZRa9A2Y7xC6dQQm4FSTSTNWjKIYYTt4246eMTJmIo0Q+ZyOsU66X8lxK1AbB92dFeglPLrhwpeRKO6w==",
  "is-number-object@1.0.6": "sha512-bEVOqiRcvo3zO1+G2lVMy+gkkEm9Yh7cDMRusKKu5ZJKPUYSJwICTKZrNKHA2EbSP0Tu0+6B/emsYNHZyn6K8g==",
  "is-number@7.0.0": "sha512-41Cifkg6e8TylSpdtTpeLVMqvSBEVzTttHvERD741+pnZ8ANv0004MRL43QKPDlK9cGvNp6NZWZUBlbGXYxxng==",
  "is-regex@1.1.4": "sha512-kvRdxDsxZjhzUX07ZnLydzS1TU/TJlTUHHY4YLL87e37oUA49DfkLqgy+VjFocowy29cKvcSiu+kIv728jTTVg==",
  "is-shared-array-buffer@1.0.1": "sha512-IU0NmyknYZN0rChcKhRO1X8LYz5Isj/Fsqh8NJOSf+N/hCOTwy29F32Ik7a+QszE63IdvmwdTPDd6cZ5pg4cwA==",
  "is-stream@2.0.1": "sha512-hFoiJiTl63nn+kstHGBtewWSKnQLpyb155KHheA1l39uvtO9nWIop1p3udqPcUd/xbF1VLMO4n7OI6p7RbngDg==",
  "is-string@1.0.7": "sha512-tE2UXzivje6ofPW7l23cjDOMa09gb7xlAqG6jG5ej6uPV32TlWP3NKPigtaGeHNu9fohccRYvIiZMfOOnOYUtg==",
  "is-symbol@1.0.4": "sha512-C/CPBqKWnvdcxqIARxyOh4v1UUEOCHpgDa0WYgpKDFMszcrPcffg5uhwSgPCLD2WWxmq6isisz87tzT01tuGhg==",
  "is-typedarray@1.0.0": "sha1-5HnICFjfDBsR3dppQPlgEfzaSpo=",
  "is-unicode-supported@0.1.0": "sha512-knxG2q4UC3u8stRGyAVJCOdxFmv5DZiRcdlIaAQXAbSfJya+OhopNotLQrstBhququ4ZpuKbDc/8S6mgXgPFPw==",
  "is-weakref@1.0.1": "sha512-b2jKc2pQZjaeFYWEf7ScFj+Be1I+PXmlu572Q8coTXZ+LD/QQZ7ShPMst8h16riVgyXTQwUsFEl74mDvc/3MHQ==",
  "is-wsl@2.2.0": "sha512-fKzAra0rGJUUBwGBgNkHZuToZcn+TtXHpeCgmkMJMMYx1sQDYaCSyjJBSCa2nH1DGm7s3n1oBnohoVTBaN7Lww==",
  "isarray@1.0.0": "sha1-u5NdSFgsuhaMBoNJV6VKPgcSTxE=",
  "isexe@2.0.0": "sha1-6PvzdNxVb/iUehDcsFctYz8s+hA=",
  "isstream@0.1.2": "sha1-R+Y/evVa+m+S4VAOaQ64uFKcCZo=",
  "jquery@3.5.1": "sha512-XwIBPqcMn57FxfT+Go5pzySnm4KWkT1Tv7gjrpT1srtf8Weynl6R273VJ5GjkRb51IzMp5nbaPjJXMWeju2MKg==",
  "js-tokens@4.0.0": "sha512-RdJUflcE3cUzKiMqQgsCu06FPu9UdIJO0beYbPhHN4k6apgJtifcoCtT9bcxOpYBtpD2kCM6Sbzg4CausW/PKQ==",
  "js-yaml@3.14.1": "sha512-okMH7OXXJ7YrN9Ok3/SXrnu4iX9yOk+25nqX4imS2npuvTYDmo/QEZoqwZkYaIDk3jVvBOTOIEgEhaLOynBS9g==",
  "jsbn@0.1.1": "sha1-peZUwuWi3rXyAdls77yoDA7y9RM=",
  "jsdoctypeparser@9.0.0": "sha512-jrTA2jJIL6/DAEILBEh2/w9QxCuwmvNXIry39Ay/HVfhE3o2yVV0U44blYkqdHA/OKloJEqvJy0xU+GSdE2SIw==",
  "jsesc@0.5.0": "sha1-597mbjXW/Bb3EP6R1c9p9w8IkR0=",
  "jsesc@2.5.2": "sha512-OYu7XEzjkCQ3C5Ps3QIZsQfNpqoJyZZA99wd9aWd05NCtC5pWOkShK2mkL6HXQR6/Cy2lbNdPlZBpuQHXE63gA==",
  "json-parse-even-better-errors@2.3.1": "sha512-xyFwyhro/JEof6Ghe2iz2NcXoj2sloNsWr/XsERDK/oiPCfaNhl5ONfp+jQdAZRQQ0IJWNzH9zIZF7li91kh2w==",
  "json-schema-traverse@0.4.1": "sha512-xbbCH5dCYU5T8LcEhhuh7HJ88HXuW3qsI3Y0zOZFKfZEHcpWiHU/Jxzk629Brsab/mMiHQti9wMP+845RPe3Vg==",
  "json-schema-traverse@1.0.0": "sha512-NM8/P9n3XjXhIZn1lLhkFaACTOURQXjWhV4BA/RnOv8xvgqtqpAX9IO4mRQxSx1Rlo4tqzeqb0sOlruaOy3dug==",
  "json-schema@0.4.0": "sha512-es94M3nTIfsEPisRafak+HDLfHXnKBhV3vU5eqPcS3flIWqcxJWgXHXiey3YrpaNsanY5ei1VoYEbOzijuq9BA==",
  "json-stable-stringify-without-jsonify@1.0.1": "sha1-nbe1lJatPzz+8wp1FC0tkwrXJlE=",
  "json-stringify-safe@5.0.1": "sha1-Epai1Y/UXxmg9s4B1lcB4sc1tus=",
  "json5@1.0.1": "sha512-aKS4WQjPenRxiQsC93MNfjx+nbF4PAdYzmd/1JIj8HYzqfbu86beTuNgXDzPknWk0n0uARlyewZo4s++ES36Ow==",
  "json5@2.2.0": "sha512-f+8cldu7X/y7RAJurMEJmdoKXGB/X550w2Nr3tTbezL6RwEE/iMcm+tZnXeoZtKuOq6ft8+CqzEkrIgx1fPoQA==",
  "jsonc-parser@3.0.0": "sha512-fQzRfAbIBnR0IQvftw9FJveWiHp72Fg20giDrHz6TdfB12UH/uue0D3hm57UB5KgAVuniLMCaS8P1IMj9NR7cA==",
  "jsonfile@6.1.0": "sha512-5dgndWOriYSm5cnYaJNhalLNDKOqFwyDB/rr1E9ZsGciGvKPs8R2xYGCacuf3z6K1YKDz182fd+fY3cn3pMqXQ==",
  "jsprim@1.4.2": "sha512-P2bSOMAc/ciLz6DzgjVlGJP9+BrJWu5UDGK70C2iweC5QBIeFf0ZXRvGjEj2uYgrY2MkAAhsSWHDWlFtEroZWw==",
  "levn@0.3.0": "sha1-OwmSTt+fCDwEkP3UwLxEIeBHZO4=",
  "levn@0.4.1": "sha512-+bT2uH4E5LGE7h/n3evcS/sQlJXCpIp6ym8OWJ5eV6+67Dsql/LaaT7qJBAt2rzfoa/5QBGBhxDix1dMt2kQKQ==",
  "lines-and-columns@1.2.4": "sha512-7ylylesZQ/PV29jhEDl3Ufjo6ZX7gCqJr5F7PKrqc93v7fzSymt1BpwEU8nAUXs8qzzvqhbjhK5QZg6Mt/HkBg==",
  "load-json-file@2.0.0": "sha1-eUfkIUmvgNaWy/eXvKq8/h/inKg=",
  "locate-path@2.0.0": "sha1-K1aLJl7slExtnA3pw9u7ygNUzY4=",
  "lodash.debounce@4.0.8": "sha1-gteb/zCmfEAF/9XiUVMArZyk168=",
  "lodash@4.17.21": "sha512-v2kDEe57lecTulaDIuNTPy3Ry4gLGJ6Z1O3vE1krgXZNrsQ+LFTGHVxVjcXPs17LhbZVGedAJv8XZ1tvj5FvSg==",
  "log-symbols@4.1.0": "sha512-8XPvpAA8uyhfteu8pIvQxpJZ7SYYdpUivZpGy6sFsBuKRY/7rQGavedeB8aK+Zkyq6upMFVL/9AW6vOYzfRyLg==",
  "loglevel-plugin-prefix@0.8.4": "sha512-WpG9CcFAOjz/FtNht+QJeGpvVl/cdR6P0z6OcXSkr8wFJOsV2GRj2j10JLfjuA4aYkcKCNIEqRGCyTife9R8/g==",
  "loglevel@1.8.0": "sha512-G6A/nJLRgWOuuwdNuA6koovfEV1YpqqAG4pRUlFaz3jj2QNZ8M4vBqnVA+HBTmU/AMNUtlOsMmSpF6NyOjztbA==",
  "lru-cache@6.0.0": "sha512-Jo6dJ04CmSjuznwJSS3pUeWmd/H0ffTlkXXgwZi+eq1UCmqQwCh+eLsYOYCwY991i2Fah4h1BEMCx4qThGbsiA==",
  "lunr@2.3.9": "sha512-zTU3DaZaF3Rt9rhN3uBMGQD3dD2/vFQqnvZCDv4dl5iOzq2IZQqTxu90r4E5J+nP70J3ilqVCrbho2eWaeW8Ow==",
  "macos-release@2.5.0": "sha512-EIgv+QZ9r+814gjJj0Bt5vSLJLzswGmSUbUpbi9AIr/fsN2IWFBl2NucV9PAiek+U1STK468tEkxmVYUtuAN3g==",
  "magic-string@0.25.1": "sha512-sCuTz6pYom8Rlt4ISPFn6wuFodbKMIHUMv4Qko9P17dpxb7s52KJTmRuZZqHdGmLCK9AOcDare039nRIcfdkEg==",
  "magic-string@0.25.7": "sha512-4CrMT5DOHTDk4HYDlzmwu4FVCcIYI8gauveasrdCu2IKIFOJ3f0v/8MDGJCDL9oD2ppz/Av1b0Nj345H9M+XIA==",
  "map-stream@0.0.7": "sha1-ih8HiW2CsQkmvTdEokIACfiJdKg=",
  "marked@4.0.12": "sha512-hgibXWrEDNBWgGiK18j/4lkS6ihTe9sxtV4Q1OQppb/0zzyPSzoFANBa5MfsG/zgsWklmNnhm0XACZOH/0HBiQ==",
  "merge-source-map@1.0.4": "sha1-pd5GU42uhNQRTMXqArR3KmNGcB8=",
  "merge-stream@2.0.0": "sha512-abv/qOcuPfk3URPfDzmZU1LKmuw8kT+0nIHvKrKgFrwifol/doWcdA4ZqsWQ8ENrFKkd67Mfpo/LovbIUsbt3w==",
  "merge2@1.4.1": "sha512-8q7VEgMJW4J8tcfVPy8g09NcQwZdbwFEqhe/WZkoIzjn/3TGDwtOCYtXGxA3O8tPzpczCCDgv+P2P5y00ZJOOg==",
  "micromatch@4.0.4": "sha512-pRmzw/XUcwXGpD9aI9q/0XOwLNygjETJ8y0ao0wdqprrzDa4YnxLcz7fQRZr8voh8V10kGhABbNcHVk5wHgWwg==",
  "mime-db@1.51.0": "sha512-5y8A56jg7XVQx2mbv1lu49NR4dokRnhZYTtL+KGfaa27uq4pSTXkwQkFJl4pkRMyNFz/EtYDSkiiEHx3F7UN6g==",
  "mime-types@2.1.34": "sha512-6cP692WwGIs9XXdOO4++N+7qjqv0rqxxVvJ3VHPh/Sc9mVZcQP+ZGhkKiTvWMQRr2tbHkJP/Yn7Y0npb3ZBs4A==",
  "mime@1.6.0": "sha512-x0Vn8spI+wuJ1O6S7gnbaQg8Pxh4NNHb7KSINmEWKiPE4RKOplvijn+NkmYmmRgP68mc70j2EbeTFRsrswaQeg==",
  "mimic-fn@2.1.0": "sha512-OqbOk5oEQeAZ8WXWydlu9HJjz9WVdEIvamMCcXmuqUYjTknH/sqsWvhQ3vgwKFRR1HpjvNBKQ37nbJgYzGqGcg==",
  "minimatch@3.0.4": "sha512-yJHVQEhyqPLUTgt9B83PXu6W3rx4MvvHvSUvToogpwoGDOUQ+yDrR0HRot+yOCdCO7u4hX3pWft6kWBBcqh0UA==",
  "minimist@1.2.5": "sha512-FM9nNUYrRBAELZQT3xeZQ7fmMOBg6nWNmJKTcgsJeaLstP/UODVpGsr5OhXhhXg6f+qtJ8uiZ+PUxkDWcgIXLw==",
  "mkdirp@0.5.5": "sha512-NKmAlESf6jMGym1++R0Ra7wvhV+wFW63FaSOFPwRahvea0gMUcGUhVeAg/0BC0wiv9ih5NYPB1Wn1UEI1/L+xQ==",
  "mkdirp@1.0.4": "sha512-vVqVZQyf3WLx2Shd0qJ9xuvqgAyKPLAiqITEtqW0oIUjzo3PePDd6fW9iFz30ef7Ysp/oiWqbhszeGWW2T6Gzw==",
  "moment-timezone@0.4.1": "sha1-gfWYw61eIs2teWtn7NjYjQ9bqgY=",
  "moment@2.24.0": "sha512-bV7f+6l2QigeBBZSM/6yTNq4P2fNpSWj/0e7jQcy87A8e7o2nAfP/34/2ky5Vw4B9S446EtIhodAzkFCcR4dQg==",
  "morgan@1.10.0": "sha512-AbegBVI4sh6El+1gNwvD5YIck7nSA36weD7xvIxG4in80j/UoK8AEGaWnnz8v1GxonMCltmlNs5ZKbGvl9b1XQ==",
  "ms@2.0.0": "sha1-VgiurfwAvmwpAd9fmGF4jeDVl8g=",
  "ms@2.1.2": "sha512-sGkPx+VjMtmA6MX27oA4FBFELFCZZ4S4XqeGOXCv68tT+jb3vk/RyaKWP0PTKyWtmLSM0b+adUTEvbs1PEaH2w==",
  "ms@2.1.3": "sha512-6FlzubTLZG3J2a/NVCAleEhjzq5oxgHyaCU9yYXvcLsvoVaHJq/s5xXI6/XXP6tz7R9xAOtHnSO/tXtF3WRTlA==",
  "natural-compare@1.4.0": "sha1-Sr6/7tdUHywnrPspvbvRXI1bpPc=",
  "negotiator@0.6.2": "sha512-hZXc7K2e+PgeI1eDBe/10Ard4ekbfrrqG8Ep+8Jmf4JID2bNg7NvCPOZN+kfF574pFQI7mum2AUqDidoKqcTOw==",
  "neo-async@2.6.2": "sha512-Yd3UES5mWCSqR+qNT93S3UoYUkqAZ9lLg8a7g9rimsWmYGK8cVToA4/sF3RrshdyV3sAGMXVUmpMYOw+dLpOuw==",
  "next-tick@1.0.0": "sha1-yobR/ogoFpsBICCOPchCS524NCw=",
  "ng-infinite-scroll@1.3.0": "sha1-wumNj9E0sFJaTSz1jJXZtYN1URI=",
  "node-releases@2.0.2": "sha512-XxYDdcQ6eKqp/YjI+tb2C5WM2LgjnZrfYg4vgQt49EK268b6gYCHsBLrK2qvJo4FmCtqmKezb0WZFK4fkrZNsg==",
  "normalize-package-data@2.5.0": "sha512-/5CMN3T0R4XTj4DcGaexo+roZSdSFW/0AOOTROrjxzCG1wrWXEsGbRKevjlIL+ZDE4sZlJr5ED4YW0yqmkK+eA==",
  "normalize-path@3.0.0": "sha512-6eZs5Ls3WtCisHWp9S2GUy8dqkpGi4BVSz3GaqiE6ezub0512ESztXUwUB6C6IKbQkY2Pnb/mD4WYojCRwcwLA==",
  "npm-run-path@4.0.1": "sha512-S48WzZW777zhNIrn7gxOlISNAqi9ZC/uQFnRdbeIHhZhCA6UqpkOT8T1G7BvfdgP4Er8gF4sUbaS0i7QvIfCWw==",
  "nth-check@2.0.1": "sha512-it1vE95zF6dTT9lBsYbxvqh0Soy4SPowchj0UBGj/V6cTPnXXtQOPUbhZ6CmGzAD/rW22LQK6E96pcdJXk4A4w==",
  "oauth-sign@0.9.0": "sha512-fexhUFFPTGV8ybAtSIGbV6gOkSv8UtRbDBnAyLQw4QPKkgNlsH2ByPGtMUqdWkos6YCRmAqViwgZrJc/mRDzZQ==",
  "object-assign@4.1.1": "sha1-IQmtx5ZYh8/AXLvUQsrIv7s2CGM=",
  "object-inspect@1.11.1": "sha512-If7BjFlpkzzBeV1cqgT3OSWT3azyoxDGajR+iGnFBfVV2EWyDyWaZZW2ERDjUaY2QM8i5jI3Sj7mhsM4DDAqWA==",
  "object-is@1.1.5": "sha512-3cyDsyHgtmi7I7DfSSI2LDp6SK2lwvtbg0p0R1e0RvTqF5ceGx+K2dfSjm1bKDMVCFEDAQvy+o8c6a7VujOddw==",
  "object-keys@1.1.1": "sha512-NuAESUOUMrlIXOfHKzD6bpPu3tYt3xvjNdRIQ+FeT0lNb4K8WR70CaDxhuNguS2XG+GjkyMwOzsN5ZktImfhLA==",
  "object.assign@4.1.2": "sha512-ixT2L5THXsApyiUPYKmW+2EHpXXe5Ii3M+f4e+aJFAHao5amFRW6J0OO6c/LU8Be47utCx2GL89hxGB6XSmKuQ==",
  "object.values@1.1.5": "sha512-QUZRW0ilQ3PnPpbNtgdNV1PDbEqLIiSFB3l+EnGtBQ/8SUTLj1PZwtQHABZtLgwpJZTSZhuGLOGk57Drx2IvYg==",
  "on-finished@2.3.0": "sha1-IPEzZIGwg811M3mSoWlxqi2QaUc=",
  "on-finished@2.4.1": "sha512-oVlzkg3ENAhCk2zdv7IJwd/QUD4z2RxRwpkcGY8psCVcCYZNq4wYnVWALHM+brtuJjePWiYF/ClmuDr8Ch5+kg==",
  "on-headers@1.0.2": "sha512-pZAE+FJLoyITytdqK0U5s+FIpjN0JP3OzFi/u8Rx+EV5/W+JTWGXG8xFzevE7AjBfDqHv/8vL8qQsIhHnqRkrA==",
  "once@1.4.0": "sha1-WDsap3WWHUsROsF9nFC6753Xa9E=",
  "onetime@5.1.2": "sha512-kbpaSSGJTWdAY5KPVeMOKXSrPtr8C8C7wodJbcsd51jRnmD+GZu8Y0VoU6Dm5Z4vWr0Ig/1NKuWRKf7j5aaYSg==",
  "open@8.4.0": "sha512-XgFPPM+B28FtCCgSb9I+s9szOC1vZRSwgWsRUA5ylIxRTgKozqjOCrVOqGsYABPYK5qnfqClxZTFBa8PKt2v6Q==",
  "opencollective-postinstall@2.0.3": "sha512-8AV/sCtuzUeTo8gQK5qDZzARrulB3egtLzFgteqB2tcT4Mw7B8Kt7JcDHmltjz6FOAHsvTevk70gZEbhM4ZS9Q==",
  "optionator@0.8.3": "sha512-+IW9pACdk3XWmmTXG8m3upGUJst5XRGzxMRjXzAuJ1XnIFNvfhjjIuYkDvysnPQ7qzqVzLt78BCruntqRhWQbA==",
  "optionator@0.9.1": "sha512-74RlY5FCnhq4jRxVUPKDaRwrVNXMqsGsiW6AJw4XK8hmtm10wC0ypZBLw5IIp85NZMr91+qd1RvvENwg7jjRFw==",
  "ora@5.4.1": "sha512-5b6Y85tPxZZ7QytO+BQzysW31HJku27cRIlkbAXaNx+BdcVi+LlRFmVXzeF6a7JCwJpyw5c4b+YSVImQIrBpuQ==",
  "os-name@4.0.1": "sha512-xl9MAoU97MH1Xt5K9ERft2YfCAoaO6msy1OBA0ozxEC0x0TmIoE6K3QvgJMMZA9yKGLmHXNY/YZoDbiGDj4zYw==",
  "p-limit@1.3.0": "sha512-vvcXsLAJ9Dr5rQOPk7toZQZJApBl2K4J6dANSsEuh6QI41JYcsS/qhTGa9ErIUUgK3WNQoJYvylxvjqmiqEA9Q==",
  "p-locate@2.0.0": "sha1-IKAQOyIqcMj9OcwuWAaA893l7EM=",
  "p-try@1.0.0": "sha1-y8ec26+P1CKOE/Yh8rGiN8GyB7M=",
  "pako@0.2.9": "sha1-8/dSL073gjSNqBYbrZ7P1Rv4OnU=",
  "parent-module@1.0.1": "sha512-GQ2EWRpQV8/o+Aw8YqtfZZPfNRWZYkbidE9k5rpl/hC3vtHHBfGm2Ifi6qWV+coDGkrUKZAxE3Lot5kcsRlh+g==",
  "parse-json@2.2.0": "sha1-9ID0BDTvgHQfhGkJn43qGPVaTck=",
  "parse-json@5.2.0": "sha512-ayCKvm/phCGxOkYRSCM82iDwct8/EonSEgCSxWxD7ve6jHggsFl4fZVQBPRNgQoKiuV/odhFrGzQXZwbifC8Rg==",
  "parse-node-version@1.0.1": "sha512-3YHlOa/JgH6Mnpr05jP9eDG254US9ek25LyIxZlDItp2iJtwyaXQb57lBYLdT3MowkUFYEV2XXNAYIPlESvJlA==",
  "parse5-htmlparser2-tree-adapter@6.0.1": "sha512-qPuWvbLgvDGilKc5BoicRovlT4MtYT6JfJyBOMDsKoiT+GiuP5qyrPCnR9HcPECIJJmZh5jRndyNThnhhb/vlA==",
  "parse5@5.1.1": "sha512-ugq4DFI0Ptb+WWjAdOK16+u/nHfiIrcE+sh8kZMaM0WllQKLI9rOUq6c2b7cwPkXdzfQESqvoqK6ug7U/Yyzug==",
  "parse5@6.0.1": "sha512-Ofn/CTFzRGTTxwpNEs9PP93gXShHcTq255nzRYSKe8AkVpZY7e1fpmTfOyoIvjP5HG7Z2ZM7VS9PPhQGW2pOpw==",
  "parseurl@1.3.3": "sha512-CiyeOxFT/JZyN5m0z9PfXw4SCBJ6Sygz1Dpl0wqjlhDEGGBP1GnsUVEL0p63hoG1fcj3fHynXi9NYO4nWOL+qQ==",
  "path-browserify@1.0.1": "sha512-b7uo2UCUOYZcnF/3ID0lulOJi/bafxa1xPe7ZPsammBSpjSWQkjNxlt635YGS2MiR9GjvuXCtz2emr3jbsz98g==",
  "path-exists@3.0.0": "sha1-zg6+ql94yxiSXqfYENe1mwEP1RU=",
  "path-is-absolute@1.0.1": "sha1-F0uSaHNVNP+8es5r9TpanhtcX18=",
  "path-key@3.1.1": "sha512-ojmeN0qd+y0jszEtoY48r0Peq5dwMEkIlCOu6Q5f41lfkswXuKtYrhgoTpLnyIcHm24Uhqx+5Tqm2InSwLhE6Q==",
  "path-parse@1.0.7": "sha512-LDJzPVEEEPR+y48z93A0Ed0yXb8pAByGWo/k5YYdYgpY2/2EsOsksJrq7lOHxryrVOn1ejG6oAp8ahvOIQD8sw==",
  "path-type@2.0.0": "sha1-8BLMuEFbcJb8LaoQVMPXI4lZTHM=",
  "path-type@4.0.0": "sha512-gDKb8aZMDeD/tZWs9P6+q0J9Mwkdl6xMV8TjnGP3qJVJ06bdMgkbBlLU8IdfOsIsFz2BW1rNVT3XuNEl8zPAvw==",
  "pause-stream@0.0.11": "sha1-/lo0sMvOErWqaitAPuLnO2AvFEU=",
  "pdfjs-dist@2.13.216": "sha512-qn/9a/3IHIKZarTK6ajeeFXBkG15Lg1Fx99PxU09PAU2i874X8mTcHJYyDJxu7WDfNhV6hM7bRQBZU384anoqQ==",
  "pdfmake@0.2.4": "sha512-EM39waHUe/Dg1W9C3XqYbpx6tfhYyU14JHZlI1HaW0AUEY32GbkRBjDLGWo9f7z/k3ea6k1p9yyDrflnvtZS1A==",
  "performance-now@2.1.0": "sha1-Ywn04OX6kT7BxpMHrjZLSzd8nns=",
  "picocolors@1.0.0": "sha512-1fygroTLlHu66zi26VoTDv8yRgm0Fccecssto+MhsZ0D/DGW2sm8E8AjW7NU5VVTRt5GxbeZ5qBuJr+HyLYkjQ==",
  "picomatch@2.3.0": "sha512-lY1Q/PiJGC2zOv/z391WOTD+Z02bCgsFfvxoXXf6h7kv9o+WmsmzYqrAwY63sNgOxE4xEdq0WyUnXfKeBrSvYw==",
  "pify@2.3.0": "sha1-7RQaasBDqEnqWISY59yosVMw6Qw=",
  "pkg-dir@2.0.0": "sha1-9tXREJ4Z1j7fQo4L1X4Sd3YVM0s=",
  "png-js@1.0.0": "sha512-k+YsbhpA9e+EFfKjTCH3VW6aoKlyNYI6NYdTfDL4CIvFnvsuO84ttonmZE7rc+v23SLTH8XX+5w/Ak9v0xGY4g==",
  "popper.js@1.16.1": "sha512-Wb4p1J4zyFTbM+u6WuO4XstYx4Ky9Cewe4DWrel7B0w6VVICvPwdOpotjzcf6eD8TsckVnIMNONQyPIUFOUbCQ==",
  "prelude-ls@1.1.2": "sha1-IZMqVJ9eUv/ZqCf1cOBL5iqX2lQ=",
  "prelude-ls@1.2.1": "sha512-vkcDPrRZo1QZLbn5RLGPpg/WmIQ65qoWWhcGKf/b5eplkkarX0m9z8ppCat4mlOqUsWpyNuYgO3VRyrYHSzX5g==",
  "prettier-linter-helpers@1.0.0": "sha512-GbK2cP9nraSSUF9N2XwUwqfzlAFlMNYYl+ShE/V+H8a9uNl/oUqB1w2EL54Jh0OlyRSd8RfWYJ3coVS4TROP2w==",
  "prettier@2.1.1": "sha512-9bY+5ZWCfqj3ghYBLxApy2zf6m+NJo5GzmLTpr9FsApsfjriNnS2dahWReHMi7qNPhhHl9SYHJs2cHZLgexNIw==",
  "process-nextick-args@2.0.1": "sha512-3ouUOpQhtgrbOa17J7+uxOTpITYWaGP7/AhoR3+A+/1e9skrzelGi/dXzEYyvbxubEF6Wn2ypscTKiKJFFn1ag==",
  "progress@2.0.3": "sha512-7PiHtLll5LdnKIMw100I+8xJXR5gW2QwWYkT6iJva0bXitZKa/XMrSbdmg3r2Xnaidz9Qumd0VPaMrZlF9V9sA==",
  "protractor-http-client@1.0.4": "sha1-+O6vJz7BPijXW5YwJosAcVy4/KY=",
  "proxy-middleware@0.15.0": "sha1-o/3xvvtzD5UZZYcqwvYHTGFHelY=",
  "psl@1.8.0": "sha512-RIdOzyoavK+hA18OGGWDqUTsCLhtA7IcZ/6NCs4fFJaHBDab+pDDmDIByWFRQJq2Cd7r1OoQxBGKOaztq+hjIQ==",
  "pump@3.0.0": "sha512-LwZy+p3SFs1Pytd/jYct4wpv49HiYCqd9Rlc5ZVdk0V+8Yzv6jR5Blk3TRmPL1ft69TxP0IMZGJ+WPFU2BFhww==",
  "punycode@2.1.1": "sha512-XRsRjdf+j5ml+y/6GKHPZbrF/8p2Yga0JPtdqTIY2Xe5ohJPD9saDJJLPvp9+NSBprVvevdXZybnj2cv8OEd0A==",
  "qs@6.5.2": "sha512-N5ZAX4/LxJmF+7wN74pUD6qAh9/wnvdQcjq9TZjevvXzSUo7bfmw91saqMjzGS2xq91/odN2dW/WOl7qQHNDGA==",
  "queue-microtask@1.2.3": "sha512-NuaNSa6flKT5JaSYQzJok04JzTL1CA6aGhv5rfLW3PgqA+M2ChpZQnAC8h8i4ZFkBS8X5RqkDBHA7r4hej3K9A==",
  "quote-stream@1.0.2": "sha1-hJY/jJwmuULhU/7rU6rnRlK34LI=",
  "range-parser@1.2.1": "sha512-Hrgsx+orqoygnmhFbKaHE6c296J+HTAQXoxEF6gNupROmmGJRoyzfG3ccAveqCBrwr/2yxQ5BVd/GTl5agOwSg==",
  "read-pkg-up@2.0.0": "sha1-a3KoBImE4MQeeVEP1en6mbO1Sb4=",
  "read-pkg@2.0.0": "sha1-jvHAYjxqbbDcZxPEv6xGMysjaPg=",
  "readable-stream@2.3.7": "sha512-Ebho8K4jIbHAxnuxi7o42OrZgF/ZTNcsZj6nRKyUmkhLFq8CHItp/fy6hQZuZmP/n3yZ9VBUbp4zz/mX8hmYPw==",
  "readable-stream@3.6.0": "sha512-BViHy7LKeTz4oNnkcLJ+lVSL6vpiFeX6/d3oSH8zCW7UxP2onchk+vTGB143xuFjHS3deTgkKoXXymXqymiIdA==",
  "readdirp@3.6.0": "sha512-hOS089on8RduqdbhvQ5Z37A0ESjsqz6qnRcffsMU3495FuTdqSm+7bhJ29JvIOsBDEEnan5DPu9t3To9VRlMzA==",
  "reflect-metadata@0.1.13": "sha512-Ts1Y/anZELhSsjMcU605fU9RE4Oi3p5ORujwbIKXfWa+0Zxs510Qrmrce5/Jowq3cHSZSJqBjypxmHarc+vEWg==",
  "regenerate-unicode-properties@10.0.1": "sha512-vn5DU6yg6h8hP/2OkQo3K7uVILvY4iu0oI4t3HFa81UPkhGJwkRwM10JEc3upjdhHjs/k8GJY1sRBhk5sr69Bw==",
  "regenerate@1.4.2": "sha512-zrceR/XhGYU/d/opr2EKO7aRHUeiBI8qjtfHqADTwZd6Szfy16la6kqD0MIUs5z5hx6AaKa+PixpPrR289+I0A==",
  "regenerator-runtime@0.13.9": "sha512-p3VT+cOEgxFsRRA9X4lkI1E+k2/CtnKtU4gcxyaCUreilL/vqI6CdZ3wxVUx3UOUg+gnUOQQcRI7BmSI656MYA==",
  "regenerator-transform@0.14.5": "sha512-eOf6vka5IO151Jfsw2NO9WpGX58W6wWmefK3I1zEGr0lOD0u8rwPaNqQL1aRxUaxLeKO3ArNh3VYg1KbaD+FFw==",
  "regexp.prototype.flags@1.3.1": "sha512-JiBdRBq91WlY7uRJ0ds7R+dU02i6LKi8r3BuQhNXn+kmeLN+EfHhfjqMRis1zJxnlu88hq/4dx0P2OP3APRTOA==",
  "regexpp@3.2.0": "sha512-pq2bWo9mVD43nbts2wGv17XLiNLya+GklZ8kaDLV2Z08gDCsGpnKn9BFMepvWuHCbyVvY7J5o5+BVvoQbmlJLg==",
  "regexpu-core@5.0.1": "sha512-CriEZlrKK9VJw/xQGJpQM5rY88BtuL8DM+AEwvcThHilbxiTAy8vq4iJnd2tqq8wLmjbGZzP7ZcKFjbGkmEFrw==",
  "regextras@0.7.1": "sha512-9YXf6xtW+qzQ+hcMQXx95MOvfqXFgsKDZodX3qZB0x2n5Z94ioetIITsBtvJbiOyxa/6s9AtyweBLCdPmPko/w==",
  "regjsgen@0.6.0": "sha512-ozE883Uigtqj3bx7OhL1KNbCzGyW2NQZPl6Hs09WTvCuZD5sTI4JY58bkbQWa/Y9hxIsvJ3M8Nbf7j54IqeZbA==",
  "regjsparser@0.8.4": "sha512-J3LABycON/VNEu3abOviqGHuB/LOtOQj8SKmfP9anY5GfAVw/SPjwzSjxGjbZXIxbGfqTHtJw58C2Li/WkStmA==",
  "request@2.88.2": "sha512-MsvtOrfG9ZcrOwAW+Qi+F6HbD0CWXEh9ou77uOb7FM2WPhwT7smM833PzanhJLsgXjN89Ir6V2PczXNnMpwKhw==",
  "require-from-string@2.0.2": "sha512-Xf0nWe6RseziFMu+Ap9biiUbmplq6S9/p+7w7YXP/JBHhrUDDUhwa+vANyubuqfZWTveU//DYVGsDG7RKL/vEw==",
  "requireindex@1.2.0": "sha512-L9jEkOi3ASd9PYit2cwRfyppc9NoABujTP8/5gFcbERmo5jUoAKovIC3fsF17pkTnGsrByysqX+Kxd2OTNI1ww==",
  "resize-observer-polyfill@1.5.1": "sha512-LwZrotdHOo12nQuZlHEmtuXdqGoOD0OhaxopaNFxWzInpEgaLWoVuAMbTzixuosCx2nEG58ngzW3vxdWoxIgdg==",
  "resolve-from@4.0.0": "sha512-pb/MYmXstAkysRFx8piNI1tGFNQIFA3vkE3Gq4EuA1dF6gHp/+vgZqsCGJapvy8N3Q+4o7FwvquPJcnZ7RYy4g==",
  "resolve@1.1.7": "sha1-IDEU2CrSxe2ejgQRs5ModeiJ6Xs=",
  "resolve@1.20.0": "sha512-wENBPt4ySzg4ybFQW2TT1zMQucPK95HSh/nq2CFTZVOGut2+pQvSsgtda4d26YrYcr067wjbmzOG8byDPBX63A==",
  "restore-cursor@3.1.0": "sha512-l+sSefzHpj5qimhFSE5a8nufZYAM3sBSVMAPtYkmC+4EH2anSGaEMXSD0izRQbu9nfyQ9y5JrVmp7E8oZrUjvA==",
  "reusify@1.0.4": "sha512-U9nH88a3fc/ekCF1l0/UP1IosiuIjyTh7hBvXVMHYgVcfGvt897Xguj2UOLDeI5BG2m7/uwyaLVT6fbtCwTyzw==",
  "rimraf@2.6.3": "sha512-mwqeW5XsA2qAejG46gYdENaxXjx9onRNCfn7L0duuP4hCuTIi/QO7PDK07KJfp1d+izWPrzEJDcSqBa0OZQriA==",
  "run-parallel@1.2.0": "sha512-5l4VyZR86LZ/lDxZTR6jqL8AFE2S0IFLMP26AbjsLVADxHdhB/c0GUsH+y39UfCi3dzz8OlQuPmnaJOMoDHQBA==",
  "rxjs@6.5.4": "sha512-naMQXcgEo3csAEGvw/NydRA0fuS2nDZJiw1YUWFKU7aPPAPGZEsD4Iimit96qwCieH6y614MCLYwdkrWx7z/7Q==",
  "rxjs@6.6.7": "sha512-hTdwr+7yYNIT5n4AMYp85KA6yw2Va0FLa3Rguvbpa4W3I5xynaBZo41cM3XM+4Q6fRMj3sBYIR1VAmZMXYJvRQ==",
  "safe-buffer@5.1.2": "sha512-Gd2UZBJDkXlY7GbJxfsE8/nvKkUEU1G38c1siN6QP6a9PT9MmHB8GnpscSmMJSoF8LOIrt8ud/wPtojys4G6+g==",
  "safe-buffer@5.2.1": "sha512-rp3So07KcdmmKbGvgaNxQSJr7bGVSVk5S9Eq1F+ppbRo70+YeaDxkw5Dd8NPN+GD6bjnYm2VuPuCXmpuYvmCXQ==",
  "safer-buffer@2.1.2": "sha512-YZo3K82SD7Riyi0E1EQPojLz7kpepnSQI9IyPbHHg1XXXevb5dJI7tpyN2ADxGcQbHG7vcyRHk0cbwqcQriUtg==",
  "sax@1.2.4": "sha512-NqVDv9TpANUjFm0N8uM5GxL36UgKi9/atZw+x7YFnQ8ckwFGKrl4xX4yWtrey3UJm5nP1kUbnYgLopqWNSRhWw==",
  "scope-analyzer@2.1.2": "sha512-5cfCmsTYV/wPaRIItNxatw02ua/MThdIUNnUOCYp+3LSEJvnG804ANw2VLaavNILIfWXF1D1G2KNANkBBvInwQ==",
  "scriptjs@2.5.9": "sha512-qGVDoreyYiP1pkQnbnFAUIS5AjenNwwQBdl7zeos9etl+hYKWahjRTfzAZZYBv5xNHx7vNKCmaLDQZ6Fr2AEXg==",
  "select2@4.0.13": "sha512-1JeB87s6oN/TDxQQYCvS5EFoQyvV6eYMZZ0AeA4tdFDYWN3BAGZ8npr17UBFddU0lgAt3H0yjX3X6/ekOj1yjw==",
  "semver@5.7.1": "sha512-sauaDf/PZdVgrLTNYHRtpXa1iRiKcaebiKQ1BJdpQlWH2lCvexQdX55snPFyK7QzpudqbCI0qXFfOasHdyNDGQ==",
  "semver@6.3.0": "sha512-b39TBaTSfV6yBrapU89p5fKekE2m/NwnDocOVruQFS1/veMgdzuPcnOM34M6CwxW8jH/lxEa5rBoDeUwu5HHTw==",
  "semver@7.0.0": "sha512-+GB6zVA9LWh6zovYQLALHwv5rb2PHGlJi3lfiqIHxR0uuwCgefcOJc59v9fv1w8GbStwxuuqqAjI9NMAOOgq1A==",
  "semver@7.3.5": "sha512-PoeGJYh8HK4BTO/a9Tf6ZG3veo/A7ZVsYrSA6J8ny9nb3B1VrpkuN+z9OE5wfE5p6H4LchYZsegiQgbJD94ZFQ==",
  "send@0.18.0": "sha512-qqWzuOjSFOuqPjFe4NOsMLafToQQwBSOEpS+FwEt3A2V3vKubTquT3vmLTQpFgMXp8AlFWFuP1qKaJZOtPpVXg==",
  "serve-index@1.9.1": "sha1-03aNabHn2C5c4FD/9bRTvqEqkjk=",
  "setprototypeof@1.1.0": "sha512-BvE/TwpZX4FXExxOxZyRGQQv651MSwmWKZGqvmPcRIjDqWub67kTKuIMx43cZZrS/cBBzwBcNDWoFxt2XEFIpQ==",
  "setprototypeof@1.2.0": "sha512-E5LDX7Wrp85Kil5bhZv46j8jOeboKq5JMmYM3gVGdGH8xFpPWXUMsNrlODCrkoxMEeNi/XZIwuRvY4XNwYMJpw==",
  "shallow-copy@0.0.1": "sha1-QV9CcC1z2BAzApLMXuhurhoRoXA=",
  "shebang-command@2.0.0": "sha512-kHxr2zZpYtdmrN1qDjrrX/Z1rR1kG8Dx+gkpK1G4eXmvXswmcE1hTWBWYUzlraYw1/yZp6YuDY77YtvbN0dmDA==",
  "shebang-regex@3.0.0": "sha512-7++dFhtcx3353uBaq8DDR4NuxBetBzC7ZQOhmTQInHEd6bSrXdiEyzCvG07Z44UYdLShWUyXt5M/yhz8ekcb1A==",
  "side-channel@1.0.4": "sha512-q5XPytqFEIKHkGdiMIrY10mvLRvnQh42/+GoBlFW3b2LXLE2xxJpZFdm94we0BaoV3RwJyGqg5wS7epxTv0Zvw==",
  "signal-exit@3.0.6": "sha512-sDl4qMFpijcGw22U5w63KmD3cZJfBuFlVNbVMKje2keoKML7X2UzWbc4XrmEbDwg0NXJc3yv4/ox7b+JWb57kQ==",
  "slash@3.0.0": "sha512-g9Q1haeby36OSStwb4ntCGGGaKsaVSjQ68fBxoQcutl5fS1vuY18H3wSt3jFyFtrkx+Kz0V1G85A4MyAdDMi2Q==",
  "slice-ansi@2.1.0": "sha512-Qu+VC3EwYLldKa1fCxuuvULvSJOKEgk9pi8dZeCVK7TqBfUNTH4sFkk4joj8afVSfAYgJoSOetjx9QWOJ5mYoQ==",
  "source-map@0.1.43": "sha1-wkvBRspRfBRx9drL4lcbK3+eM0Y=",
  "source-map@0.5.7": "sha1-igOdLRAh0i0eoUyA2OpGi6LvP8w=",
  "source-map@0.6.1": "sha512-UjgapumWlbMhkBgzT7Ykc5YXUT46F0iKu8SGXq0bcwP5dz/h0Plj6enJqjz1Zbq2l5WaqYnrVbwWOWMyF3F47g==",
  "source-map@0.7.3": "sha512-CkCj6giN3S+n9qrYiBTX5gystlENnRW5jZeNLHpe6aue+SrHcG5VYwujhW9s4dY31mEGsxBDrHR6oI69fTXsaQ==",
  "sourcemap-codec@1.4.8": "sha512-9NykojV5Uih4lgo5So5dtw+f0JgJX30KCNI8gwhz2J9A15wD0Ml6tjHKwf6fTSa6fAdVBdZeNOs9eJ71qCk8vA==",
  "spdx-correct@3.1.1": "sha512-cOYcUWwhCuHCXi49RhFRCyJEK3iPj1Ziz9DpViV3tbZOwXD49QzIN3MpOLJNxh2qwq2lJJZaKMVw9qNi4jTC0w==",
  "spdx-exceptions@2.3.0": "sha512-/tTrYOC7PPI1nUAgx34hUpqXuyJG+DTHJTnIULG4rDygi4xu/tfgmq1e1cIRwRzwZgo4NLySi+ricLkZkw4i5A==",
  "spdx-expression-parse@3.0.1": "sha512-cbqHunsQWnJNE6KhVSMsMeH5H/L9EpymbzqTQ3uLwNCLZ1Q481oWaofqH7nO6V07xlXwY6PhQdQ2IedWx/ZK4Q==",
  "spdx-license-ids@3.0.11": "sha512-Ctl2BrFiM0X3MANYgj3CkygxhRmr9mi6xhejbdO960nF6EDJApTYpn0BQnDKlnNBULKiCN1n3w9EBkHK8ZWg+g==",
  "split@1.0.1": "sha512-mTyOoPbrivtXnwnIxZRFYRrPNtEFKlpB2fvjSnCQUiAA6qAZzqwna5envK4uk6OIeP17CsdF3rSBGYVBsU0Tkg==",
  "sprintf-js@1.0.3": "sha1-BOaSb2YolTVPPdAVIDYzuFcpfiw=",
  "sshpk@1.16.1": "sha512-HXXqVUq7+pcKeLqqZj6mHFUMvXtOJt1uoUx09pFW6011inTMxqI8BA8PM95myrIyyKwdnzjdFjLiE6KBPVtJIg==",
  "static-eval@2.1.0": "sha512-agtxZ/kWSsCkI5E4QifRwsaPs0P0JmZV6dkLz6ILYfFYQGn+5plctanRN+IC8dJRiFkyXHrwEE3W9Wmx67uDbw==",
  "static-module@3.0.4": "sha512-gb0v0rrgpBkifXCa3yZXxqVmXDVE+ETXj6YlC/jt5VzOnGXR2C15+++eXuMDUYsePnbhf+lwW0pE1UXyOLtGCw==",
  "statuses@1.5.0": "sha1-Fhx9rBd2Wf2YEfQ3cfqZOBR4Yow=",
  "statuses@2.0.1": "sha512-RwNA9Z/7PrK06rYLIzFMlaF+l73iwpzsqRIFgbMLbTcLD6cOao82TaWefPXQvB2fOC4AjuYSEndS7N/mTCbkdQ==",
  "stream-combiner@0.2.2": "sha1-rsjLrBd7Vrb0+kec7YwZEs7lKFg=",
  "string-width@3.1.0": "sha512-vafcv6KjVZKSgz06oM/H6GDBrAtz8vdhQakGjFIvNrHA6y3HCF1CInLy+QLq8dTJPQ1b+KDUqDFctkdRW44e1w==",
  "string.prototype.trimend@1.0.4": "sha512-y9xCjw1P23Awk8EvTpcyL2NIr1j7wJ39f+k6lvRnSMz+mz9CGz9NYPelDk42kOz6+ql8xjfK8oYzy3jAP5QU5A==",
  "string.prototype.trimstart@1.0.4": "sha512-jh6e984OBfvxS50tdY2nRZnoC5/mLFKOREQfw8t5yytkoUsJRNxvI/E39qu1sD0OtWI3OC0XgKSmcWwziwYuZw==",
  "string_decoder@1.1.1": "sha512-n/ShnvDi6FHbbVfviro+WojiFzv+s8MPMHBczVePfUpDJLwoLT0ht1l4YwBCbi8pJAveEEdnkHyPyTP/mzRfwg==",
  "string_decoder@1.3.0": "sha512-hkRX8U1WjJFd8LsDJ2yQ/wWWxaopEsABU1XfkM8A+j0+85JAGppt16cr1Whg6KIbb4okU6Mql6BOj+uup/wKeA==",
  "strip-ansi@5.2.0": "sha512-DuRs1gKbBqsMKIZlrffwlug8MHkcnpjs5VPmL1PAh+mA30U0DTotfDZ0d2UUsXpPmPmMMJ6W773MaA3J+lbiWA==",
  "strip-ansi@6.0.1": "sha512-Y38VPSHcqkFrCpFnQ9vuSXmquuv5oXOKpGeT6aGrr3o3Gc9AlVa6JBfUSOCnbxGGZF+/0ooI7KrPuUSztUdU5A==",
  "strip-bom@3.0.0": "sha1-IzTBjpx1n3vdVv3vfprj1YjmjtM=",
  "strip-final-newline@2.0.0": "sha512-BrpvfNAE3dcvq7ll3xVumzjKjZQ5tI1sEUIKr3Uoks0XUl45St3FlatVqef9prk4jRDzhW6WZg+3bk93y6pLjA==",
  "strip-json-comments@3.1.1": "sha512-6fPc+R4ihwqP6N/aIv2f1gMH8lOVtWQHoqC4yK6oSDVVocumAsfCqjkXnqiYMhmMwS/mEHLp7Vehlt3ql6lEig==",
  "supports-color@5.5.0": "sha512-QjVjwdXIt408MIiAqCX4oUKsgU2EqAGzs2Ppkm4aQYbjm+ZEWEcW4SfFNTr4uMNZma0ey4f5lgLrkB0aX0QMow==",
  "supports-color@7.2.0": "sha512-qpCAvRl9stuOHveKsn7HncJRvv501qIacKzQlO/+Lwxc9+0q2wLyv4Dfvt80/DPn2pqOBsJdDiogXGR9+OvwRw==",
  "tabbable@4.0.0": "sha512-H1XoH1URcBOa/rZZWxLxHCtOdVUEev+9vo5YdYhC9tCY4wnybX+VQrCYuy9ubkg69fCBxCONJOSLGfw0DWMffQ==",
  "table@5.4.6": "sha512-wmEc8m4fjnob4gt5riFRtTu/6+4rSe12TpAELNSqHMfF3IqnA+CH37USM6/YR3qRZv7e56kAEAtd6nKZaxe0Ug==",
  "techne@1.5.10": "sha512-h5s/R+kJKx5lJK/fU417X9PwhPw9yP+fMr3JfVO5vRqFBJpM1LJg725l7oGolm/MdEIYFSKeHyZa4BOg3GTcsQ==",
  "text-table@0.2.0": "sha1-f17oI66AUgfACvLfSoTsP8+lcLQ=",
  "through2@2.0.5": "sha512-/mrRod8xqpA+IHSLyGCQ2s8SPHiCDEeQJSep1jqLYeEUClOFG2Qsh+4FU6G9VeqpZnGW/Su8LQGc4YKni5rYSQ==",
  "through@2.3.8": "sha1-DdTJ/6q8NXlgsbckEV1+Doai4fU=",
  "time-stamp@1.1.0": "sha1-dkpaEa9QVhkhsTPztE5hhofg9cM=",
  "tiny-inflate@1.0.3": "sha512-pkY1fj1cKHb2seWDy0B16HeWyczlJA9/WW3u3c4z/NiWDsO3DOU5D7nhTLE9CF0yXv/QZFY7sEJmj24dK+Rrqw==",
  "to-fast-properties@2.0.0": "sha1-3F5pjL0HkmW8c+A3doGk5Og/YW4=",
  "to-regex-range@5.0.1": "sha512-65P7iz6X5yEr1cwcgvQxbbIw7Uk3gOy5dIdtZ4rDveLqhrdJP+Li/Hx6tyK0NEb+2GCyneCMJiGqrADCSNk8sQ==",
  "toidentifier@1.0.1": "sha512-o5sSPKEkg/DIQNmH43V0/uerLrpzVedkUh8tGNvaeXpfpuwjKenlSox/2O/BTlZUtEe+JG7s5YhEz608PlAHRA==",
  "tough-cookie@2.5.0": "sha512-nlLsUzgm1kfLXSXfRZMc1KLAugd4hqJHDTvc2hDIwS3mZAfMEuMbc03SujMF+GEcpaX/qboeycw6iO8JwVv2+g==",
  "traverse@0.6.6": "sha1-y99WD9e5r2MlAv7UD5GMFX6pcTc=",
  "ts-morph@13.0.3": "sha512-pSOfUMx8Ld/WUreoSzvMFQG5i9uEiWIsBYjpU9+TTASOeUa89j5HykomeqVULm1oqWtBdleI3KEFRLrlA3zGIw==",
  "tsconfig-paths@3.9.0": "sha512-dRcuzokWhajtZWkQsDVKbWyY+jgcLC5sqJhg2PSgf4ZkH2aHPvaOY8YWGhmjb68b5qqTfasSsDO9k7RUiEmZAw==",
  "tslib@1.10.0": "sha512-qOebF53frne81cf0S9B41ByenJ3/IuH8yJKngAX35CmiZySA0khhkovshKK+jGCaMnVomla7gVlIcc3EvKPbTQ==",
  "tslib@1.11.2": "sha512-tTSkux6IGPnUGUd1XAZHcpu85MOkIl5zX49pO+jfsie3eP0B6pyhOlLXm3cAC6T7s+euSDDUUV+Acop5WmtkVg==",
  "tslib@2.3.1": "sha512-77EbyPPpMz+FRFRuAFlWMtmgUWGe9UOG2Z25NqCwiIjRhOf5iKGuzSe5P2w1laq+FkRy4p+PCuVkJSGkzTEKVw==",
  "tsutils@3.17.1_typescript@3.9.3": "sha512-kzeQ5B8H3w60nFY2g8cJIuH7JDpsALXySGtwGJ0p2LSjLgay3NdIpqq5SoOBe46bKDW2iq25irHCr8wjomUS2g==",
  "tunnel-agent@0.6.0": "sha1-J6XeoGs2sEoKmWZ3SykIaPD8QP0=",
  "tweetnacl@0.14.5": "sha1-WuaBd/GS1EViadEIr6k/+HQ/T2Q=",
  "type-check@0.3.2": "sha1-WITKtRLPHTVeP7eE8wgEsrUg23I=",
  "type-check@0.4.0": "sha512-XleUoc9uwGXqjWwXaUTZAmzMcFZ5858QA2vvx1Ur5xIcixXIP+8LnFDgRplU30us6teqdlskFfu+ae4K79Ooew==",
  "type-fest@0.8.1": "sha512-4dbzIzqvjtgiM5rw1k5rEHtBANKmdudhGyBEajN01fEyhaAIhsoKNy6y7+IN93IfpFtwY9iqi7kD+xwKhQsNJA==",
  "type@1.2.0": "sha512-+5nt5AAniqsCnu2cEQQdpzCAh33kVx8n0VoFidKpB1dVVLAN/F+bgVOqOJqOnEnrhp222clB5p3vUlD+1QAnfg==",
  "type@2.5.0": "sha512-180WMDQaIMm3+7hGXWf12GtdniDEy7nYcyFMKJn/eZz/6tSLXrUN9V0wKSbMjej0I1WHWbpREDEKHtqPQa9NNw==",
  "typedarray@0.0.6": "sha1-hnrHTjhkGHsdPUfZlqeOxciDB3c=",
  "typescript@3.9.3": "sha512-D/wqnB2xzNFIcoBG9FG8cXRDjiqSTbG2wd8DMZeQyJlP1vfTkIxH4GKveWaEBYySKIg+USu+E+EDIR47SqnaMQ==",
  "typescript@4.2.3": "sha512-qOcYwxaByStAWrBf4x0fibwZvMRG+r4cQoTjbPtUlrWjBHbmCAww1i448U0GJ+3cNNEtebDteo/cHOR3xJ4wEw==",
  "uglify-js@3.14.4": "sha512-AbiSR44J0GoCeV81+oxcy/jDOElO2Bx3d0MfQCUShq7JRXaM4KtQopZsq2vFv8bCq2yMaGrw1FgygUd03RyRDA==",
  "ui-select@0.19.8": "sha1-dIYISKf9i8SU2YVtL2J3bqmGN8E=",
  "unbox-primitive@1.0.1": "sha512-tZU/3NqK3dA5gpE1KtyiJUrEB0lxnGkMFHptJ7q6ewdZ8s12QrODwNbhIJStmJkd1QDXa1NRA8aF2A1zk/Ypyw==",
  "unicode-canonical-property-names-ecmascript@2.0.0": "sha512-yY5PpDlfVIU5+y/BSCxAJRBIS1Zc2dDG3Ujq+sR0U+JjUevW2JhocOF+soROYDSaAezOzOKuyyixhD6mBknSmQ==",
  "unicode-match-property-ecmascript@2.0.0": "sha512-5kaZCrbp5mmbz5ulBkDkbY0SsPOjKqVS35VpL9ulMPfSl0J0Xsm+9Evphv9CoIZFwre7aJoa94AY6seMKGVN5Q==",
  "unicode-match-property-value-ecmascript@2.0.0": "sha512-7Yhkc0Ye+t4PNYzOGKedDhXbYIBe1XEQYQxOPyhcXNMJ0WCABqqj6ckydd6pWRZTHV4GuCPKdBAUiMc60tsKVw==",
  "unicode-properties@1.3.1": "sha512-nIV3Tf3LcUEZttY/2g4ZJtGXhWwSkuLL+rCu0DIAMbjyVPj+8j5gNVz4T/sVbnQybIsd5SFGkPKg/756OY6jlA==",
  "unicode-property-aliases-ecmascript@2.0.0": "sha512-5Zfuy9q/DFr4tfO7ZPeVXb1aPoeQSdeFMLpYuFebehDAhbuevLs5yxSZmIFN1tP5F9Wl4IpJrYojg85/zgyZHQ==",
  "unicode-trie@2.0.0": "sha512-x7bc76x0bm4prf1VLg79uhAzKw8DVboClSN5VxJuQ+LKDOVEW9CdH+VY7SP+vX7xCYQqzzgQpFqz15zeLvAtZQ==",
  "universalify@2.0.0": "sha512-hAZsKq7Yy11Zu1DE0OzWjw7nnLZmJZYTDZZyEFHZdUhV8FkH5MCfoU1XMaxXovpyW5nq5scPqq0ZDP9Zyl04oQ==",
  "unix-crypt-td-js@1.1.4": "sha512-8rMeVYWSIyccIJscb9NdCfZKSRBKYTeVnwmiRYT2ulE3qd1RaDQ0xQDP+rI3ccIWbhu/zuo5cgN8z73belNZgw==",
  "unpipe@1.0.0": "sha1-sr9O6FFKrmFltIF4KdIbLvSZBOw=",
  "uri-js@4.4.1": "sha512-7rKUyy33Q1yc98pQ1DAmLtwX109F7TIfWlW1Ydo8Wl1ii1SeHieeh0HHfPeL2fMXK6z0s8ecKs9frCuLJvndBg==",
  "util-deprecate@1.0.2": "sha1-RQ1Nyfpw3nMnYvvS1KKJgUGaDM8=",
  "utils-merge@1.0.1": "sha1-n5VxD1CiZ5R7LMwSR0HBAoQn5xM=",
  "uuid@3.4.0": "sha512-HjSDRw6gZE5JMggctHBcjVak08+KEVhSIiDzFnT9S9aegmp85S/bReBVTb4QTFaRNptJ9kuYaNhnbNEOkbKb/A==",
  "uuid@8.3.2": "sha512-+NYs2QeMWy+GWFOEm9xnn6HCDp0l7QBD7ml8zLUmJ+93Q5NF0NocErnwkTkXVFNiX3/fpC6afS8Dhb/gz7R7eg==",
  "v8-compile-cache@2.3.0": "sha512-l8lCEmLcLYZh4nbunNZvQCJc5pv7+RCwa8q/LdUx8u7lsWvPDKmpodJAJNwkAhJC//dFY48KuIEmjtd4RViDrA==",
  "validate-npm-package-license@3.0.4": "sha512-DpKm2Ui/xN7/HQKCtpZxoRWBhZ9Z0kqtygG8XCgNQ8ZlDnxuQmWhj566j8fN4Cu3/JmbhsDo7fcAJq4s9h27Ew==",
  "vary@1.1.2": "sha1-IpnwLG3tMNSllhsLn3RSShj2NPw=",
  "verror@1.10.0": "sha1-OhBcoXBTr1XW4nDB+CiGguGNpAA=",
  "wcwidth@1.0.1": "sha1-8LDc+RW8X/FSivrbLA4XtTLaL+g=",
  "web-streams-polyfill@3.2.0": "sha512-EqPmREeOzttaLRm5HS7io98goBgZ7IVz79aDvqjD0kYXLtFZTc0T/U6wHTPKyIjb+MdN7DFIIX6hgdBEpWmfPA==",
  "websocket-driver@0.7.4": "sha512-b17KeDIQVjvb0ssuSDF2cYXSg2iztliJ4B9WdsuB6J952qCPKmnVq4DyW5motImXHDC1cBT/1UezrJVsKw5zjg==",
  "websocket-extensions@0.1.4": "sha512-OqedPIGOfsDlo31UNwYbCFMSaO9m9G/0faIHj5/dZFDMFqPTcx6UwqyOy3COEaEOg/9VsGIpdqn62W5KhoKSpg==",
  "whatwg-fetch@3.0.0": "sha512-9GSJUgz1D4MfyKU7KRqwOjXCXTqWdFNvEr7eUBYchQiVc744mqK/MzXPNR2WsPkmkOa4ywfg8C2n8h+13Bey1Q==",
  "which-boxed-primitive@1.0.2": "sha512-bwZdv0AKLpplFY2KZRX6TvyuN7ojjr7lwkg6ml0roIy9YeuSr7JS372qlNW18UQYzgYK9ziGcerWqZOmEn9VNg==",
  "which@2.0.2": "sha512-BLI3Tl1TW3Pvl70l3yq3Y64i+awpwXqsGBYWkkqMtnbXgrMD+yj7rhW0kuEDxzJaYXGjEW5ogapKNMEKNMjibA==",
  "windows-release@4.0.0": "sha512-OxmV4wzDKB1x7AZaZgXMVsdJ1qER1ed83ZrTYd5Bwq2HfJVg3DJS8nqlAG4sMoJ7mu8cuRmLEYyU13BKwctRAg==",
  "word-wrap@1.2.3": "sha512-Hz/mrNwitNRh/HUAtM/VT/5VH+ygD6DV7mYKZAtHOrbs8U7lvPS6xf7EJKMF0uW1KJCl0H701g3ZGus+muE5vQ==",
  "wordwrap@1.0.0": "sha1-J1hIEIkUVqQXHI0CJkQa3pDLyus=",
  "wrappy@1.0.2": "sha1-tSQ9jz7BqjXxNkYFvA0QNuMKtp8=",
  "write@1.0.3": "sha512-/lg70HAjtkUgWPVZhZcm+T4hkL8Zbtp1nFNOn3lRrxnlv50SRBv7cR7RqR+GMsd3hUXy9hWBo4CHTbFTcOYwig==",
  "xmldoc@1.1.2": "sha512-ruPC/fyPNck2BD1dpz0AZZyrEwMOrWTO5lDdIXS91rs3wtm4j+T8Rp2o+zoOYkkAxJTZRPOSnOGei1egoRmKMQ==",
  "xtend@4.0.2": "sha512-LKYU1iAXJXUgAXn9URjiu+MWhyUXHsvfp7mcuYm9dSUKK0/CjtrUwFAxD82/mCWbtLsGjFIad0wIsod4zrTAEQ==",
  "yallist@4.0.0": "sha512-3wdGidZyq5PB084XLES5TpOSRA3wjXAlIWMhum2kRcv/41Sn2emQ0dycQW4uZXLejwKvg6EsvbdlVL+FYEct7A==",
  "yaml@1.10.2": "sha512-r3vXyErRCYJ7wg28yvBY5VSoAF8ZvlcW9/BwUzEtUsjvX/DKs24dIkuwjtuprwJJHsbyUbLApepYTR1BN4uHrg==",
  "zone.js@0.9.1": "sha512-GkPiJL8jifSrKReKaTZ5jkhrMEgXbXYC+IPo1iquBjayRa0q86w3Dipjn8b415jpitMExe9lV8iTsv8tk3DGag=="
}
