[2022-10-21T11:47:03.009+0200][0.004s] Heap region size: 1M
[2022-10-21T11:47:03.076+0200][0.071s] Using G1
[2022-10-21T11:47:03.076+0200][0.071s] Heap address: 0x00000000e0000000, size: 512 MB, Compressed Oops mode: 32-bit
[2022-10-21T11:47:03.384+0200][0,379s] GC(0) Pause Young (Normal) (G1 Evacuation Pause)
[2022-10-21T11:47:03.385+0200][0,380s] GC(0) Using 4 workers of 4 for evacuation
[2022-10-21T11:47:03.389+0200][0,384s] GC(0)   Pre Evacuate Collection Set: 0,0ms
[2022-10-21T11:47:03.389+0200][0,384s] GC(0)   Evacuate Collection Set: 3,9ms
[2022-10-21T11:47:03.389+0200][0,384s] GC(0)   Post Evacuate Collection Set: 0,4ms
[2022-10-21T11:47:03.389+0200][0,384s] GC(0)   Other: 0,5ms
[2022-10-21T11:47:03.389+0200][0,384s] GC(0) Eden regions: 25->0(303)
[2022-10-21T11:47:03.389+0200][0,384s] GC(0) Survivor regions: 0->4(4)
[2022-10-21T11:47:03.389+0200][0,384s] GC(0) Old regions: 0->2
[2022-10-21T11:47:03.389+0200][0,384s] GC(0) Humongous regions: 0->0
[2022-10-21T11:47:03.389+0200][0,384s] GC(0) Metaspace: 8431K(8832K)->8431K(8832K) NonClass: 7685K(7936K)->7685K(7936K) Class: 746K(896K)->746K(896K)
[2022-10-21T11:47:03.389+0200][0,384s] GC(0) Pause Young (Normal) (G1 Evacuation Pause) 25M->5M(512M) 4,903ms
[2022-10-21T11:47:03.389+0200][0,384s] GC(0) User=0,01s Sys=0,00s Real=0,01s
[2022-10-21T11:47:03.953+0200][0,948s] GC(1) Pause Young (Concurrent Start) (Metadata GC Threshold)
[2022-10-21T11:47:03.953+0200][0,948s] GC(1) Using 4 workers of 4 for evacuation
[2022-10-21T11:47:03.962+0200][0,957s] GC(1)   Pre Evacuate Collection Set: 0,0ms
[2022-10-21T11:47:03.962+0200][0,957s] GC(1)   Evacuate Collection Set: 7,8ms
[2022-10-21T11:47:03.962+0200][0,957s] GC(1)   Post Evacuate Collection Set: 0,5ms
[2022-10-21T11:47:03.962+0200][0,957s] GC(1)   Other: 0,1ms
[2022-10-21T11:47:03.962+0200][0,957s] GC(1) Eden regions: 66->0(63)
[2022-10-21T11:47:03.962+0200][0,957s] GC(1) Survivor regions: 4->16(39)
[2022-10-21T11:47:03.962+0200][0,957s] GC(1) Old regions: 2->2
[2022-10-21T11:47:03.962+0200][0,957s] GC(1) Humongous regions: 4->4
[2022-10-21T11:47:03.962+0200][0,957s] GC(1) Metaspace: 20732K(21296K)->20732K(21296K) NonClass: 18526K(18864K)->18526K(18864K) Class: 2206K(2432K)->2206K(2432K)
[2022-10-21T11:47:03.962+0200][0,957s] GC(1) Pause Young (Concurrent Start) (Metadata GC Threshold) 75M->20M(512M) 8,607ms
[2022-10-21T11:47:03.962+0200][0,957s] GC(1) User=0,02s Sys=0,00s Real=0,00s
[2022-10-21T11:47:03.962+0200][0,957s] GC(2) Concurrent Cycle
[2022-10-21T11:47:03.962+0200][0,957s] GC(2) Concurrent Clear Claimed Marks
[2022-10-21T11:47:03.962+0200][0,957s] GC(2) Concurrent Clear Claimed Marks 0,041ms
[2022-10-21T11:47:03.962+0200][0,957s] GC(2) Concurrent Scan Root Regions
[2022-10-21T11:47:03.966+0200][0,961s] GC(2) Concurrent Scan Root Regions 3,666ms
[2022-10-21T11:47:03.966+0200][0,961s] GC(2) Concurrent Mark (0,961s)
[2022-10-21T11:47:03.966+0200][0,961s] GC(2) Concurrent Mark From Roots
[2022-10-21T11:47:03.966+0200][0,961s] GC(2) Using 1 workers of 1 for marking
[2022-10-21T11:47:03.970+0200][0,965s] GC(2) Concurrent Mark From Roots 3,858ms
[2022-10-21T11:47:03.970+0200][0,965s] GC(2) Concurrent Preclean
[2022-10-21T11:47:03.970+0200][0,965s] GC(2) Concurrent Preclean 0,024ms
[2022-10-21T11:47:03.970+0200][0,965s] GC(2) Concurrent Mark (0,961s, 0,965s) 3,906ms
[2022-10-21T11:47:03.970+0200][0,965s] GC(2) Pause Remark
[2022-10-21T11:47:03.971+0200][0,966s] GC(2) Cleaned string and symbol table, strings: 9669 processed, 0 removed, symbols: 68067 processed, 19 removed
[2022-10-21T11:47:03.971+0200][0,966s] GC(2) Pause Remark 21M->21M(512M) 1,200ms
[2022-10-21T11:47:03.971+0200][0,966s] GC(2) User=0,01s Sys=0,00s Real=0,00s
[2022-10-21T11:47:03.971+0200][0,966s] GC(2) Concurrent Rebuild Remembered Sets
[2022-10-21T11:47:03.972+0200][0,968s] GC(2) Concurrent Rebuild Remembered Sets 1,577ms
[2022-10-21T11:47:03.973+0200][0,968s] GC(2) Pause Cleanup
[2022-10-21T11:47:03.973+0200][0,968s] GC(2) Pause Cleanup 21M->21M(512M) 0,089ms
[2022-10-21T11:47:03.973+0200][0,968s] GC(2) User=0,00s Sys=0,00s Real=0,00s
[2022-10-21T11:47:03.973+0200][0,968s] GC(2) Concurrent Cleanup for Next Mark
[2022-10-21T11:47:03.975+0200][0,970s] GC(2) Concurrent Cleanup for Next Mark 2,063ms
[2022-10-21T11:47:03.975+0200][0,970s] GC(2) Concurrent Cycle 12,904ms
[2022-10-21T11:47:04.074+0200][1,069s] GC(3) Pause Young (Normal) (G1 Evacuation Pause)
[2022-10-21T11:47:04.074+0200][1,069s] GC(3) Using 4 workers of 4 for evacuation
[2022-10-21T11:47:04.080+0200][1,076s] GC(3)   Pre Evacuate Collection Set: 0,0ms
[2022-10-21T11:47:04.080+0200][1,076s] GC(3)   Evacuate Collection Set: 5,8ms
[2022-10-21T11:47:04.081+0200][1,076s] GC(3)   Post Evacuate Collection Set: 0,5ms
[2022-10-21T11:47:04.081+0200][1,076s] GC(3)   Other: 0,1ms
[2022-10-21T11:47:04.081+0200][1,076s] GC(3) Eden regions: 9->0(67)
[2022-10-21T11:47:04.081+0200][1,076s] GC(3) Survivor regions: 16->2(4)
[2022-10-21T11:47:04.081+0200][1,076s] GC(3) Old regions: 2->17
[2022-10-21T11:47:04.081+0200][1,076s] GC(3) Humongous regions: 4->4
[2022-10-21T11:47:04.081+0200][1,076s] GC(3) Metaspace: 22684K(23600K)->22684K(23600K) NonClass: 20272K(20912K)->20272K(20912K) Class: 2411K(2688K)->2411K(2688K)
[2022-10-21T11:47:04.081+0200][1,076s] GC(3) Pause Young (Normal) (G1 Evacuation Pause) 29M->22M(512M) 6,439ms
[2022-10-21T11:47:04.081+0200][1,076s] GC(3) User=0,03s Sys=0,00s Real=0,00s
[2022-10-21T11:47:04.530+0200][1,525s] GC(4) Pause Young (Normal) (G1 Evacuation Pause)
[2022-10-21T11:47:04.530+0200][1,525s] GC(4) Using 4 workers of 4 for evacuation
[2022-10-21T11:47:04.533+0200][1,528s] GC(4)   Pre Evacuate Collection Set: 0,0ms
[2022-10-21T11:47:04.533+0200][1,528s] GC(4)   Evacuate Collection Set: 2,5ms
[2022-10-21T11:47:04.533+0200][1,528s] GC(4)   Post Evacuate Collection Set: 0,8ms
[2022-10-21T11:47:04.533+0200][1,528s] GC(4)   Other: 0,1ms
[2022-10-21T11:47:04.533+0200][1,528s] GC(4) Eden regions: 67->0(147)
[2022-10-21T11:47:04.533+0200][1,528s] GC(4) Survivor regions: 2->5(9)
[2022-10-21T11:47:04.533+0200][1,528s] GC(4) Old regions: 17->17
[2022-10-21T11:47:04.533+0200][1,528s] GC(4) Humongous regions: 5->5
[2022-10-21T11:47:04.533+0200][1,528s] GC(4) Metaspace: 29251K(30000K)->29251K(30000K) NonClass: 26086K(26544K)->26086K(26544K) Class: 3164K(3456K)->3164K(3456K)
[2022-10-21T11:47:04.533+0200][1,528s] GC(4) Pause Young (Normal) (G1 Evacuation Pause) 90M->25M(512M) 3,477ms
[2022-10-21T11:47:04.533+0200][1,528s] GC(4) User=0,01s Sys=0,00s Real=0,01s
[2022-10-21T11:47:05.034+0200][2,030s] GC(5) Pause Young (Concurrent Start) (Metadata GC Threshold)
[2022-10-21T11:47:05.034+0200][2,030s] GC(5) Using 4 workers of 4 for evacuation
[2022-10-21T11:47:05.037+0200][2,032s] GC(5)   Pre Evacuate Collection Set: 0,0ms
[2022-10-21T11:47:05.037+0200][2,032s] GC(5)   Evacuate Collection Set: 2,4ms
[2022-10-21T11:47:05.037+0200][2,032s] GC(5)   Post Evacuate Collection Set: 0,3ms
[2022-10-21T11:47:05.037+0200][2,033s] GC(5)   Other: 0,1ms
[2022-10-21T11:47:05.037+0200][2,033s] GC(5) Eden regions: 56->0(295)
[2022-10-21T11:47:05.037+0200][2,033s] GC(5) Survivor regions: 5->5(19)
[2022-10-21T11:47:05.037+0200][2,033s] GC(5) Old regions: 17->17
[2022-10-21T11:47:05.037+0200][2,033s] GC(5) Humongous regions: 5->5
[2022-10-21T11:47:05.037+0200][2,033s] GC(5) Metaspace: 34943K(35920K)->34943K(35920K) NonClass: 31176K(31824K)->31176K(31824K) Class: 3767K(4096K)->3767K(4096K)
[2022-10-21T11:47:05.037+0200][2,033s] GC(5) Pause Young (Concurrent Start) (Metadata GC Threshold) 81M->26M(512M) 2,981ms
[2022-10-21T11:47:05.037+0200][2,033s] GC(5) User=0,01s Sys=0,00s Real=0,00s
[2022-10-21T11:47:05.037+0200][2,033s] GC(6) Concurrent Cycle
[2022-10-21T11:47:05.037+0200][2,033s] GC(6) Concurrent Clear Claimed Marks
[2022-10-21T11:47:05.037+0200][2,033s] GC(6) Concurrent Clear Claimed Marks 0,017ms
[2022-10-21T11:47:05.037+0200][2,033s] GC(6) Concurrent Scan Root Regions
[2022-10-21T11:47:05.039+0200][2,034s] GC(6) Concurrent Scan Root Regions 1,851ms
[2022-10-21T11:47:05.039+0200][2,034s] GC(6) Concurrent Mark (2,034s)
[2022-10-21T11:47:05.039+0200][2,034s] GC(6) Concurrent Mark From Roots
[2022-10-21T11:47:05.039+0200][2,034s] GC(6) Using 1 workers of 1 for marking
[2022-10-21T11:47:05.060+0200][2,055s] GC(6) Concurrent Mark From Roots 20,581ms
[2022-10-21T11:47:05.060+0200][2,055s] GC(6) Concurrent Preclean
[2022-10-21T11:47:05.060+0200][2,055s] GC(6) Concurrent Preclean 0,060ms
[2022-10-21T11:47:05.060+0200][2,055s] GC(6) Concurrent Mark (2,034s, 2,055s) 20,680ms
[2022-10-21T11:47:05.060+0200][2,055s] GC(6) Pause Remark
[2022-10-21T11:47:05.062+0200][2,057s] GC(6) Cleaned string and symbol table, strings: 15597 processed, 22 removed, symbols: 112222 processed, 37 removed
[2022-10-21T11:47:05.062+0200][2,058s] GC(6) Pause Remark 27M->27M(512M) 2,292ms
[2022-10-21T11:47:05.062+0200][2,058s] GC(6) User=0,01s Sys=0,00s Real=0,00s
[2022-10-21T11:47:05.063+0200][2,058s] GC(6) Concurrent Rebuild Remembered Sets
[2022-10-21T11:47:05.087+0200][2,082s] GC(6) Concurrent Rebuild Remembered Sets 24,725ms
[2022-10-21T11:47:05.087+0200][2,082s] GC(6) Pause Cleanup
[2022-10-21T11:47:05.087+0200][2,083s] GC(6) Pause Cleanup 28M->28M(512M) 0,086ms
[2022-10-21T11:47:05.087+0200][2,083s] GC(6) User=0,00s Sys=0,00s Real=0,00s
[2022-10-21T11:47:05.087+0200][2,083s] GC(6) Concurrent Cleanup for Next Mark
[2022-10-21T11:47:05.089+0200][2,084s] GC(6) Concurrent Cleanup for Next Mark 1,604ms
[2022-10-21T11:47:05.089+0200][2,084s] GC(6) Concurrent Cycle 51,680ms
[2022-10-21T11:50:37.799+0200][214,794s] GC(7) Pause Young (Normal) (G1 Evacuation Pause)
[2022-10-21T11:50:37.799+0200][214,794s] GC(7) Using 4 workers of 4 for evacuation
[2022-10-21T11:50:37.813+0200][214,808s] GC(7)   Pre Evacuate Collection Set: 0,0ms
[2022-10-21T11:50:37.813+0200][214,808s] GC(7)   Evacuate Collection Set: 12,5ms
[2022-10-21T11:50:37.813+0200][214,808s] GC(7)   Post Evacuate Collection Set: 0,9ms
[2022-10-21T11:50:37.813+0200][214,808s] GC(7)   Other: 0,2ms
[2022-10-21T11:50:37.813+0200][214,808s] GC(7) Eden regions: 295->0(288)
[2022-10-21T11:50:37.813+0200][214,808s] GC(7) Survivor regions: 5->19(38)
[2022-10-21T11:50:37.813+0200][214,808s] GC(7) Old regions: 17->17
[2022-10-21T11:50:37.813+0200][214,808s] GC(7) Humongous regions: 7->6
[2022-10-21T11:50:37.813+0200][214,808s] GC(7) Metaspace: 58308K(59856K)->58308K(59856K) NonClass: 51613K(52560K)->51613K(52560K) Class: 6695K(7296K)->6695K(7296K)
[2022-10-21T11:50:37.813+0200][214,808s] GC(7) Pause Young (Normal) (G1 Evacuation Pause) 323M->41M(512M) 13,695ms
[2022-10-21T11:50:37.813+0200][214,808s] GC(7) User=0,03s Sys=0,00s Real=0,02s
[2022-10-21T11:50:37.886+0200][214,881s] GC(8) Pause Young (Concurrent Start) (Metadata GC Threshold)
[2022-10-21T11:50:37.886+0200][214,881s] GC(8) Using 4 workers of 4 for evacuation
[2022-10-21T11:50:37.896+0200][214,891s] GC(8)   Pre Evacuate Collection Set: 0,1ms
[2022-10-21T11:50:37.896+0200][214,891s] GC(8)   Evacuate Collection Set: 9,9ms
[2022-10-21T11:50:37.896+0200][214,891s] GC(8)   Post Evacuate Collection Set: 0,3ms
[2022-10-21T11:50:37.896+0200][214,891s] GC(8)   Other: 0,1ms
[2022-10-21T11:50:37.896+0200][214,891s] GC(8) Eden regions: 10->0(224)
[2022-10-21T11:50:37.896+0200][214,891s] GC(8) Survivor regions: 19->19(39)
[2022-10-21T11:50:37.896+0200][214,891s] GC(8) Old regions: 17->17
[2022-10-21T11:50:37.896+0200][214,891s] GC(8) Humongous regions: 6->6
[2022-10-21T11:50:37.896+0200][214,891s] GC(8) Metaspace: 58884K(60296K)->58884K(60296K) NonClass: 52123K(53000K)->52123K(53000K) Class: 6760K(7296K)->6760K(7296K)
[2022-10-21T11:50:37.896+0200][214,891s] GC(8) Pause Young (Concurrent Start) (Metadata GC Threshold) 51M->41M(512M) 10,491ms
[2022-10-21T11:50:37.896+0200][214,891s] GC(8) User=0,02s Sys=0,00s Real=0,01s
[2022-10-21T11:50:37.896+0200][214,891s] GC(9) Concurrent Cycle
[2022-10-21T11:50:37.896+0200][214,891s] GC(9) Concurrent Clear Claimed Marks
[2022-10-21T11:50:37.896+0200][214,892s] GC(9) Concurrent Clear Claimed Marks 0,036ms
[2022-10-21T11:50:37.896+0200][214,892s] GC(9) Concurrent Scan Root Regions
[2022-10-21T11:50:37.903+0200][214,898s] GC(9) Concurrent Scan Root Regions 6,965ms
[2022-10-21T11:50:37.903+0200][214,899s] GC(9) Concurrent Mark (214,899s)
[2022-10-21T11:50:37.903+0200][214,899s] GC(9) Concurrent Mark From Roots
[2022-10-21T11:50:37.903+0200][214,899s] GC(9) Using 1 workers of 1 for marking
[2022-10-21T11:50:37.929+0200][214,924s] GC(9) Concurrent Mark From Roots 25,411ms
[2022-10-21T11:50:37.929+0200][214,924s] GC(9) Concurrent Preclean
[2022-10-21T11:50:37.930+0200][214,925s] GC(9) Concurrent Preclean 1,281ms
[2022-10-21T11:50:37.930+0200][214,925s] GC(9) Concurrent Mark (214,899s, 214,925s) 26,747ms
[2022-10-21T11:50:37.930+0200][214,925s] GC(9) Pause Remark
[2022-10-21T11:50:37.936+0200][214,931s] GC(9) Cleaned string and symbol table, strings: 26741 processed, 0 removed, symbols: 176931 processed, 468 removed
[2022-10-21T11:50:37.936+0200][214,931s] GC(9) Pause Remark 43M->43M(512M) 5,809ms
[2022-10-21T11:50:37.936+0200][214,931s] GC(9) User=0,02s Sys=0,00s Real=0,01s
[2022-10-21T11:50:37.936+0200][214,931s] GC(9) Concurrent Rebuild Remembered Sets
[2022-10-21T11:50:37.946+0200][214,941s] GC(9) Concurrent Rebuild Remembered Sets 9,731ms
[2022-10-21T11:50:37.946+0200][214,941s] GC(9) Pause Cleanup
[2022-10-21T11:50:37.946+0200][214,941s] GC(9) Pause Cleanup 44M->44M(512M) 0,111ms
[2022-10-21T11:50:37.946+0200][214,941s] GC(9) User=0,00s Sys=0,00s Real=0,00s
[2022-10-21T11:50:37.946+0200][214,941s] GC(9) Concurrent Cleanup for Next Mark
[2022-10-21T11:50:37.947+0200][214,942s] GC(9) Concurrent Cleanup for Next Mark 0,617ms
[2022-10-21T11:50:37.947+0200][214,942s] GC(9) Concurrent Cycle 50,543ms
[2022-10-21T11:54:53.529+0200][470,525s] GC(10) Pause Young (Normal) (G1 Evacuation Pause)
[2022-10-21T11:54:53.529+0200][470,525s] GC(10) Using 4 workers of 4 for evacuation
[2022-10-21T11:54:53.553+0200][470,548s] GC(10)   Pre Evacuate Collection Set: 0,0ms
[2022-10-21T11:54:53.553+0200][470,548s] GC(10)   Evacuate Collection Set: 22,4ms
[2022-10-21T11:54:53.553+0200][470,548s] GC(10)   Post Evacuate Collection Set: 1,4ms
[2022-10-21T11:54:53.553+0200][470,548s] GC(10)   Other: 0,1ms
[2022-10-21T11:54:53.553+0200][470,548s] GC(10) Eden regions: 248->0(264)
[2022-10-21T11:54:53.553+0200][470,548s] GC(10) Survivor regions: 19->34(34)
[2022-10-21T11:54:53.553+0200][470,548s] GC(10) Old regions: 17->23
[2022-10-21T11:54:53.553+0200][470,548s] GC(10) Humongous regions: 28->28
[2022-10-21T11:54:53.553+0200][470,548s] GC(10) Metaspace: 63620K(65416K)->63620K(65416K) NonClass: 56480K(57608K)->56480K(57608K) Class: 7139K(7808K)->7139K(7808K)
[2022-10-21T11:54:53.553+0200][470,548s] GC(10) Pause Young (Normal) (G1 Evacuation Pause) 311M->84M(512M) 23,976ms
[2022-10-21T11:54:53.553+0200][470,549s] GC(10) User=0,05s Sys=0,00s Real=0,03s
[2022-10-21T11:55:02.610+0200][479,605s] GC(11) Pause Young (Normal) (G1 Evacuation Pause)
[2022-10-21T11:55:02.610+0200][479,605s] GC(11) Using 4 workers of 4 for evacuation
[2022-10-21T11:55:02.621+0200][479,616s] GC(11)   Pre Evacuate Collection Set: 0,0ms
[2022-10-21T11:55:02.621+0200][479,616s] GC(11)   Evacuate Collection Set: 10,9ms
[2022-10-21T11:55:02.621+0200][479,616s] GC(11)   Post Evacuate Collection Set: 0,5ms
[2022-10-21T11:55:02.621+0200][479,616s] GC(11)   Other: 0,1ms
[2022-10-21T11:55:02.621+0200][479,616s] GC(11) Eden regions: 264->0(279)
[2022-10-21T11:55:02.621+0200][479,616s] GC(11) Survivor regions: 34->3(38)
[2022-10-21T11:55:02.621+0200][479,616s] GC(11) Old regions: 23->52
[2022-10-21T11:55:02.621+0200][479,616s] GC(11) Humongous regions: 28->28
[2022-10-21T11:55:02.621+0200][479,616s] GC(11) Metaspace: 64840K(66568K)->64840K(66568K) NonClass: 57613K(58632K)->57613K(58632K) Class: 7227K(7936K)->7227K(7936K)
[2022-10-21T11:55:02.621+0200][479,616s] GC(11) Pause Young (Normal) (G1 Evacuation Pause) 348M->82M(512M) 11,580ms
[2022-10-21T11:55:02.621+0200][479,616s] GC(11) User=0,04s Sys=0,00s Real=0,01s
[2022-10-21T11:55:20.430+0200][497,426s] GC(12) Pause Young (Normal) (G1 Evacuation Pause)
[2022-10-21T11:55:20.431+0200][497,426s] GC(12) Using 4 workers of 4 for evacuation
[2022-10-21T11:55:20.447+0200][497,442s] GC(12)   Pre Evacuate Collection Set: 0,0ms
[2022-10-21T11:55:20.447+0200][497,442s] GC(12)   Evacuate Collection Set: 12,4ms
[2022-10-21T11:55:20.447+0200][497,442s] GC(12)   Post Evacuate Collection Set: 4,1ms
[2022-10-21T11:55:20.447+0200][497,442s] GC(12)   Other: 0,1ms
[2022-10-21T11:55:20.447+0200][497,442s] GC(12) Eden regions: 279->0(276)
[2022-10-21T11:55:20.447+0200][497,442s] GC(12) Survivor regions: 3->19(36)
[2022-10-21T11:55:20.447+0200][497,442s] GC(12) Old regions: 52->52
[2022-10-21T11:55:20.447+0200][497,442s] GC(12) Humongous regions: 28->28
[2022-10-21T11:55:20.447+0200][497,442s] GC(12) Metaspace: 66111K(67720K)->66111K(67720K) NonClass: 58743K(59656K)->58743K(59656K) Class: 7367K(8064K)->7367K(8064K)
[2022-10-21T11:55:20.447+0200][497,442s] GC(12) Pause Young (Normal) (G1 Evacuation Pause) 361M->98M(512M) 16,689ms
[2022-10-21T11:55:20.447+0200][497,442s] GC(12) User=0,03s Sys=0,00s Real=0,02s
[2022-10-21T12:02:35.398+0200][932,393s] GC(13) Pause Young (Normal) (G1 Evacuation Pause)
[2022-10-21T12:02:35.398+0200][932,393s] GC(13) Using 4 workers of 4 for evacuation
[2022-10-21T12:02:35.420+0200][932,415s] GC(13)   Pre Evacuate Collection Set: 0,0ms
[2022-10-21T12:02:35.420+0200][932,415s] GC(13)   Evacuate Collection Set: 20,8ms
[2022-10-21T12:02:35.420+0200][932,415s] GC(13)   Post Evacuate Collection Set: 1,1ms
[2022-10-21T12:02:35.420+0200][932,415s] GC(13)   Other: 0,1ms
[2022-10-21T12:02:35.420+0200][932,415s] GC(13) Eden regions: 276->0(284)
[2022-10-21T12:02:35.420+0200][932,415s] GC(13) Survivor regions: 19->18(37)
[2022-10-21T12:02:35.420+0200][932,415s] GC(13) Old regions: 52->52
[2022-10-21T12:02:35.420+0200][932,415s] GC(13) Humongous regions: 28->28
[2022-10-21T12:02:35.420+0200][932,415s] GC(13) Metaspace: 67067K(69000K)->67067K(69000K) NonClass: 59608K(60680K)->59608K(60680K) Class: 7458K(8320K)->7458K(8320K)
[2022-10-21T12:02:35.420+0200][932,415s] GC(13) Pause Young (Normal) (G1 Evacuation Pause) 374M->97M(512M) 22,090ms
[2022-10-21T12:02:35.420+0200][932,415s] GC(13) User=0,04s Sys=0,00s Real=0,02s
[2022-10-21T12:02:48.565+0200][945,560s] GC(14) Pause Young (Normal) (G1 Evacuation Pause)
[2022-10-21T12:02:48.565+0200][945,560s] GC(14) Using 4 workers of 4 for evacuation
[2022-10-21T12:02:48.593+0200][945,588s] GC(14)   Pre Evacuate Collection Set: 0,0ms
[2022-10-21T12:02:48.593+0200][945,588s] GC(14)   Evacuate Collection Set: 25,2ms
[2022-10-21T12:02:48.593+0200][945,588s] GC(14)   Post Evacuate Collection Set: 2,1ms
[2022-10-21T12:02:48.593+0200][945,588s] GC(14)   Other: 0,1ms
[2022-10-21T12:02:48.593+0200][945,588s] GC(14) Eden regions: 284->0(280)
[2022-10-21T12:02:48.593+0200][945,588s] GC(14) Survivor regions: 18->27(38)
[2022-10-21T12:02:48.593+0200][945,588s] GC(14) Old regions: 52->52
[2022-10-21T12:02:48.593+0200][945,588s] GC(14) Humongous regions: 36->36
[2022-10-21T12:02:48.593+0200][945,588s] GC(14) Metaspace: 67714K(69768K)->67714K(69768K) NonClass: 60215K(61448K)->60215K(61448K) Class: 7499K(8320K)->7499K(8320K)
[2022-10-21T12:02:48.593+0200][945,588s] GC(14) Pause Young (Normal) (G1 Evacuation Pause) 389M->114M(512M) 27,485ms
[2022-10-21T12:02:48.593+0200][945,588s] GC(14) User=0,07s Sys=0,00s Real=0,03s
[2022-10-21T12:20:41.257+0200][2018,252s] GC(15) Pause Young (Normal) (G1 Evacuation Pause)
[2022-10-21T12:20:41.257+0200][2018,252s] GC(15) Using 4 workers of 4 for evacuation
[2022-10-21T12:20:41.280+0200][2018,275s] GC(15)   Pre Evacuate Collection Set: 0,0ms
[2022-10-21T12:20:41.280+0200][2018,275s] GC(15)   Evacuate Collection Set: 21,6ms
[2022-10-21T12:20:41.280+0200][2018,275s] GC(15)   Post Evacuate Collection Set: 1,4ms
[2022-10-21T12:20:41.280+0200][2018,275s] GC(15)   Other: 0,1ms
[2022-10-21T12:20:41.280+0200][2018,275s] GC(15) Eden regions: 280->0(267)
[2022-10-21T12:20:41.280+0200][2018,275s] GC(15) Survivor regions: 27->31(39)
[2022-10-21T12:20:41.280+0200][2018,275s] GC(15) Old regions: 52->60
[2022-10-21T12:20:41.280+0200][2018,275s] GC(15) Humongous regions: 44->44
[2022-10-21T12:20:41.280+0200][2018,275s] GC(15) Metaspace: 68534K(70664K)->68534K(70664K) NonClass: 60959K(62216K)->60959K(62216K) Class: 7575K(8448K)->7575K(8448K)
[2022-10-21T12:20:41.280+0200][2018,275s] GC(15) Pause Young (Normal) (G1 Evacuation Pause) 402M->134M(512M) 23,204ms
[2022-10-21T12:20:41.280+0200][2018,275s] GC(15) User=0,06s Sys=0,00s Real=0,02s
[2022-10-21T12:20:41.719+0200][2018,714s] GC(16) Pause Young (Normal) (G1 Evacuation Pause)
[2022-10-21T12:20:41.719+0200][2018,714s] GC(16) Using 4 workers of 4 for evacuation
[2022-10-21T12:20:41.734+0200][2018,729s] GC(16)   Pre Evacuate Collection Set: 0,0ms
[2022-10-21T12:20:41.734+0200][2018,729s] GC(16)   Evacuate Collection Set: 14,0ms
[2022-10-21T12:20:41.734+0200][2018,729s] GC(16)   Post Evacuate Collection Set: 1,0ms
[2022-10-21T12:20:41.734+0200][2018,729s] GC(16)   Other: 0,1ms
[2022-10-21T12:20:41.734+0200][2018,729s] GC(16) Eden regions: 267->0(274)
[2022-10-21T12:20:41.734+0200][2018,729s] GC(16) Survivor regions: 31->18(38)
[2022-10-21T12:20:41.734+0200][2018,729s] GC(16) Old regions: 60->74
[2022-10-21T12:20:41.734+0200][2018,729s] GC(16) Humongous regions: 44->44
[2022-10-21T12:20:41.734+0200][2018,729s] GC(16) Metaspace: 68559K(70664K)->68559K(70664K) NonClass: 60983K(62216K)->60983K(62216K) Class: 7575K(8448K)->7575K(8448K)
[2022-10-21T12:20:41.734+0200][2018,729s] GC(16) Pause Young (Normal) (G1 Evacuation Pause) 401M->134M(512M) 15,150ms
[2022-10-21T12:20:41.734+0200][2018,729s] GC(16) User=0,06s Sys=0,00s Real=0,02s
[2022-10-21T12:33:22.745+0200][2779,740s] Heap
[2022-10-21T12:33:22.745+0200][2779,740s]  garbage-first heap   total 524288K, used 198426K [0x00000000e0000000, 0x0000000100000000)
[2022-10-21T12:33:22.745+0200][2779,740s]   region size 1024K, 79 young (80896K), 18 survivors (18432K)
[2022-10-21T12:33:22.745+0200][2779,740s]  Metaspace       used 68798K, capacity 70778K, committed 70920K, reserved 1112064K
[2022-10-21T12:33:22.745+0200][2779,740s]   class space    used 7605K, capacity 8386K, committed 8448K, reserved 1048576K
