[2022-10-21T07:53:01.833+0200][0.003s] Heap region size: 1M
[2022-10-21T07:53:01.881+0200][0.051s] Using G1
[2022-10-21T07:53:01.881+0200][0.051s] Heap address: 0x00000000e0000000, size: 512 MB, Compressed Oops mode: 32-bit
[2022-10-21T07:53:02.144+0200][0,314s] GC(0) Pause Young (Normal) (G1 Evacuation Pause)
[2022-10-21T07:53:02.144+0200][0,314s] GC(0) Using 4 workers of 4 for evacuation
[2022-10-21T07:53:02.149+0200][0,319s] GC(0)   Pre Evacuate Collection Set: 0,0ms
[2022-10-21T07:53:02.149+0200][0,319s] GC(0)   Evacuate Collection Set: 4,5ms
[2022-10-21T07:53:02.149+0200][0,319s] GC(0)   Post Evacuate Collection Set: 0,2ms
[2022-10-21T07:53:02.149+0200][0,319s] GC(0)   Other: 0,4ms
[2022-10-21T07:53:02.149+0200][0,319s] GC(0) Eden regions: 25->0(303)
[2022-10-21T07:53:02.149+0200][0,319s] GC(0) Survivor regions: 0->4(4)
[2022-10-21T07:53:02.149+0200][0,319s] GC(0) Old regions: 0->1
[2022-10-21T07:53:02.149+0200][0,319s] GC(0) Humongous regions: 0->0
[2022-10-21T07:53:02.149+0200][0,319s] GC(0) Metaspace: 8407K(8832K)->8407K(8832K) NonClass: 7660K(7936K)->7660K(7936K) Class: 746K(896K)->746K(896K)
[2022-10-21T07:53:02.149+0200][0,319s] GC(0) Pause Young (Normal) (G1 Evacuation Pause) 25M->4M(512M) 5,106ms
[2022-10-21T07:53:02.149+0200][0,319s] GC(0) User=0,02s Sys=0,00s Real=0,01s
[2022-10-21T07:53:02.695+0200][0,866s] GC(1) Pause Young (Concurrent Start) (Metadata GC Threshold)
[2022-10-21T07:53:02.695+0200][0,866s] GC(1) Using 4 workers of 4 for evacuation
[2022-10-21T07:53:02.703+0200][0,874s] GC(1)   Pre Evacuate Collection Set: 0,0ms
[2022-10-21T07:53:02.703+0200][0,874s] GC(1)   Evacuate Collection Set: 7,3ms
[2022-10-21T07:53:02.703+0200][0,874s] GC(1)   Post Evacuate Collection Set: 0,5ms
[2022-10-21T07:53:02.703+0200][0,874s] GC(1)   Other: 0,2ms
[2022-10-21T07:53:02.703+0200][0,874s] GC(1) Eden regions: 66->0(63)
[2022-10-21T07:53:02.703+0200][0,874s] GC(1) Survivor regions: 4->17(39)
[2022-10-21T07:53:02.703+0200][0,874s] GC(1) Old regions: 1->1
[2022-10-21T07:53:02.703+0200][0,874s] GC(1) Humongous regions: 4->4
[2022-10-21T07:53:02.703+0200][0,874s] GC(1) Metaspace: 20735K(21296K)->20735K(21296K) NonClass: 18527K(18864K)->18527K(18864K) Class: 2208K(2432K)->2208K(2432K)
[2022-10-21T07:53:02.703+0200][0,874s] GC(1) Pause Young (Concurrent Start) (Metadata GC Threshold) 74M->20M(512M) 8,070ms
[2022-10-21T07:53:02.703+0200][0,874s] GC(1) User=0,02s Sys=0,00s Real=0,00s
[2022-10-21T07:53:02.703+0200][0,874s] GC(2) Concurrent Cycle
[2022-10-21T07:53:02.703+0200][0,874s] GC(2) Concurrent Clear Claimed Marks
[2022-10-21T07:53:02.703+0200][0,874s] GC(2) Concurrent Clear Claimed Marks 0,012ms
[2022-10-21T07:53:02.703+0200][0,874s] GC(2) Concurrent Scan Root Regions
[2022-10-21T07:53:02.707+0200][0,877s] GC(2) Concurrent Scan Root Regions 3,363ms
[2022-10-21T07:53:02.707+0200][0,877s] GC(2) Concurrent Mark (0,877s)
[2022-10-21T07:53:02.707+0200][0,877s] GC(2) Concurrent Mark From Roots
[2022-10-21T07:53:02.707+0200][0,877s] GC(2) Using 1 workers of 1 for marking
[2022-10-21T07:53:02.708+0200][0,879s] GC(2) Concurrent Mark From Roots 1,594ms
[2022-10-21T07:53:02.708+0200][0,879s] GC(2) Concurrent Preclean
[2022-10-21T07:53:02.708+0200][0,879s] GC(2) Concurrent Preclean 0,023ms
[2022-10-21T07:53:02.708+0200][0,879s] GC(2) Concurrent Mark (0,877s, 0,879s) 1,636ms
[2022-10-21T07:53:02.708+0200][0,879s] GC(2) Pause Remark
[2022-10-21T07:53:02.710+0200][0,881s] GC(2) Cleaned string and symbol table, strings: 9672 processed, 3 removed, symbols: 68067 processed, 19 removed
[2022-10-21T07:53:02.711+0200][0,881s] GC(2) Pause Remark 21M->21M(512M) 2,100ms
[2022-10-21T07:53:02.711+0200][0,881s] GC(2) User=0,01s Sys=0,01s Real=0,00s
[2022-10-21T07:53:02.711+0200][0,881s] GC(2) Concurrent Rebuild Remembered Sets
[2022-10-21T07:53:02.712+0200][0,882s] GC(2) Concurrent Rebuild Remembered Sets 1,451ms
[2022-10-21T07:53:02.712+0200][0,883s] GC(2) Pause Cleanup
[2022-10-21T07:53:02.712+0200][0,883s] GC(2) Pause Cleanup 21M->21M(512M) 0,109ms
[2022-10-21T07:53:02.712+0200][0,883s] GC(2) User=0,00s Sys=0,00s Real=0,00s
[2022-10-21T07:53:02.712+0200][0,883s] GC(2) Concurrent Cleanup for Next Mark
[2022-10-21T07:53:02.713+0200][0,883s] GC(2) Concurrent Cleanup for Next Mark 0,652ms
[2022-10-21T07:53:02.713+0200][0,883s] GC(2) Concurrent Cycle 9,655ms
[2022-10-21T07:53:02.808+0200][0,978s] GC(3) Pause Young (Normal) (G1 Evacuation Pause)
[2022-10-21T07:53:02.808+0200][0,978s] GC(3) Using 4 workers of 4 for evacuation
[2022-10-21T07:53:02.815+0200][0,986s] GC(3)   Pre Evacuate Collection Set: 0,0ms
[2022-10-21T07:53:02.815+0200][0,986s] GC(3)   Evacuate Collection Set: 6,3ms
[2022-10-21T07:53:02.815+0200][0,986s] GC(3)   Post Evacuate Collection Set: 0,9ms
[2022-10-21T07:53:02.815+0200][0,986s] GC(3)   Other: 0,1ms
[2022-10-21T07:53:02.815+0200][0,986s] GC(3) Eden regions: 10->0(77)
[2022-10-21T07:53:02.815+0200][0,986s] GC(3) Survivor regions: 17->2(4)
[2022-10-21T07:53:02.815+0200][0,986s] GC(3) Old regions: 1->17
[2022-10-21T07:53:02.815+0200][0,986s] GC(3) Humongous regions: 4->4
[2022-10-21T07:53:02.815+0200][0,986s] GC(3) Metaspace: 22784K(23600K)->22784K(23600K) NonClass: 20358K(20912K)->20358K(20912K) Class: 2425K(2688K)->2425K(2688K)
[2022-10-21T07:53:02.815+0200][0,986s] GC(3) Pause Young (Normal) (G1 Evacuation Pause) 30M->22M(512M) 7,383ms
[2022-10-21T07:53:02.815+0200][0,986s] GC(3) User=0,03s Sys=0,00s Real=0,01s
[2022-10-21T07:53:03.205+0200][1,376s] GC(4) Pause Young (Normal) (G1 Evacuation Pause)
[2022-10-21T07:53:03.205+0200][1,376s] GC(4) Using 4 workers of 4 for evacuation
[2022-10-21T07:53:03.207+0200][1,378s] GC(4)   Pre Evacuate Collection Set: 0,0ms
[2022-10-21T07:53:03.207+0200][1,378s] GC(4)   Evacuate Collection Set: 1,5ms
[2022-10-21T07:53:03.207+0200][1,378s] GC(4)   Post Evacuate Collection Set: 0,5ms
[2022-10-21T07:53:03.207+0200][1,378s] GC(4)   Other: 0,1ms
[2022-10-21T07:53:03.207+0200][1,378s] GC(4) Eden regions: 77->0(95)
[2022-10-21T07:53:03.207+0200][1,378s] GC(4) Survivor regions: 2->5(10)
[2022-10-21T07:53:03.207+0200][1,378s] GC(4) Old regions: 17->17
[2022-10-21T07:53:03.207+0200][1,378s] GC(4) Humongous regions: 5->5
[2022-10-21T07:53:03.207+0200][1,378s] GC(4) Metaspace: 31060K(32048K)->31060K(32048K) NonClass: 27752K(28336K)->27752K(28336K) Class: 3307K(3712K)->3307K(3712K)
[2022-10-21T07:53:03.207+0200][1,378s] GC(4) Pause Young (Normal) (G1 Evacuation Pause) 100M->25M(512M) 2,136ms
[2022-10-21T07:53:03.207+0200][1,378s] GC(4) User=0,01s Sys=0,00s Real=0,00s
[2022-10-21T07:53:03.631+0200][1,801s] GC(5) Pause Young (Concurrent Start) (Metadata GC Threshold)
[2022-10-21T07:53:03.631+0200][1,801s] GC(5) Using 4 workers of 4 for evacuation
[2022-10-21T07:53:03.633+0200][1,804s] GC(5)   Pre Evacuate Collection Set: 0,0ms
[2022-10-21T07:53:03.633+0200][1,804s] GC(5)   Evacuate Collection Set: 2,2ms
[2022-10-21T07:53:03.633+0200][1,804s] GC(5)   Post Evacuate Collection Set: 0,3ms
[2022-10-21T07:53:03.633+0200][1,804s] GC(5)   Other: 0,1ms
[2022-10-21T07:53:03.633+0200][1,804s] GC(5) Eden regions: 53->0(115)
[2022-10-21T07:53:03.633+0200][1,804s] GC(5) Survivor regions: 5->5(13)
[2022-10-21T07:53:03.633+0200][1,804s] GC(5) Old regions: 17->17
[2022-10-21T07:53:03.633+0200][1,804s] GC(5) Humongous regions: 5->5
[2022-10-21T07:53:03.633+0200][1,804s] GC(5) Metaspace: 35017K(35920K)->35017K(35920K) NonClass: 31240K(31824K)->31240K(31824K) Class: 3777K(4096K)->3777K(4096K)
[2022-10-21T07:53:03.633+0200][1,804s] GC(5) Pause Young (Concurrent Start) (Metadata GC Threshold) 78M->26M(512M) 2,625ms
[2022-10-21T07:53:03.633+0200][1,804s] GC(5) User=0,01s Sys=0,00s Real=0,01s
[2022-10-21T07:53:03.633+0200][1,804s] GC(6) Concurrent Cycle
[2022-10-21T07:53:03.633+0200][1,804s] GC(6) Concurrent Clear Claimed Marks
[2022-10-21T07:53:03.633+0200][1,804s] GC(6) Concurrent Clear Claimed Marks 0,016ms
[2022-10-21T07:53:03.633+0200][1,804s] GC(6) Concurrent Scan Root Regions
[2022-10-21T07:53:03.635+0200][1,805s] GC(6) Concurrent Scan Root Regions 1,756ms
[2022-10-21T07:53:03.635+0200][1,806s] GC(6) Concurrent Mark (1,806s)
[2022-10-21T07:53:03.635+0200][1,806s] GC(6) Concurrent Mark From Roots
[2022-10-21T07:53:03.635+0200][1,806s] GC(6) Using 1 workers of 1 for marking
[2022-10-21T07:53:03.653+0200][1,824s] GC(6) Concurrent Mark From Roots 18,029ms
[2022-10-21T07:53:03.653+0200][1,824s] GC(6) Concurrent Preclean
[2022-10-21T07:53:03.653+0200][1,824s] GC(6) Concurrent Preclean 0,059ms
[2022-10-21T07:53:03.653+0200][1,824s] GC(6) Concurrent Mark (1,806s, 1,824s) 18,122ms
[2022-10-21T07:53:03.653+0200][1,824s] GC(6) Pause Remark
[2022-10-21T07:53:03.655+0200][1,826s] GC(6) Cleaned string and symbol table, strings: 15970 processed, 20 removed, symbols: 113938 processed, 37 removed
[2022-10-21T07:53:03.655+0200][1,826s] GC(6) Pause Remark 27M->27M(512M) 1,994ms
[2022-10-21T07:53:03.655+0200][1,826s] GC(6) User=0,01s Sys=0,00s Real=0,00s
[2022-10-21T07:53:03.655+0200][1,826s] GC(6) Concurrent Rebuild Remembered Sets
[2022-10-21T07:53:03.667+0200][1,838s] GC(6) Concurrent Rebuild Remembered Sets 11,714ms
[2022-10-21T07:53:03.667+0200][1,838s] GC(6) Pause Cleanup
[2022-10-21T07:53:03.667+0200][1,838s] GC(6) Pause Cleanup 28M->28M(512M) 0,097ms
[2022-10-21T07:53:03.667+0200][1,838s] GC(6) User=0,00s Sys=0,00s Real=0,00s
[2022-10-21T07:53:03.667+0200][1,838s] GC(6) Concurrent Cleanup for Next Mark
[2022-10-21T07:53:03.668+0200][1,838s] GC(6) Concurrent Cleanup for Next Mark 0,592ms
[2022-10-21T07:53:03.668+0200][1,838s] GC(6) Concurrent Cycle 34,751ms
[2022-10-21T10:32:25.535+0200][9563,706s] GC(7) Pause Young (Concurrent Start) (G1 Evacuation Pause)
[2022-10-21T10:32:25.537+0200][9563,707s] GC(7) Using 4 workers of 4 for evacuation
[2022-10-21T10:32:25.554+0200][9563,725s] GC(7)   Pre Evacuate Collection Set: 0,4ms
[2022-10-21T10:32:25.554+0200][9563,725s] GC(7)   Evacuate Collection Set: 15,7ms
[2022-10-21T10:32:25.554+0200][9563,725s] GC(7)   Post Evacuate Collection Set: 1,3ms
[2022-10-21T10:32:25.554+0200][9563,725s] GC(7)   Other: 1,3ms
[2022-10-21T10:32:25.554+0200][9563,725s] GC(7) Eden regions: 115->0(149)
[2022-10-21T10:32:25.554+0200][9563,725s] GC(7) Survivor regions: 5->8(15)
[2022-10-21T10:32:25.554+0200][9563,725s] GC(7) Old regions: 17->17
[2022-10-21T10:32:25.554+0200][9563,725s] GC(7) Humongous regions: 5->5
[2022-10-21T10:32:25.554+0200][9563,725s] GC(7) Metaspace: 43359K(44700K)->43359K(44700K) NonClass: 38600K(39504K)->38600K(39504K) Class: 4759K(5196K)->4759K(5196K)
[2022-10-21T10:32:25.554+0200][9563,725s] GC(7) Pause Young (Concurrent Start) (G1 Evacuation Pause) 141M->29M(512M) 18,763ms
[2022-10-21T10:32:25.554+0200][9563,725s] GC(7) User=0,02s Sys=0,00s Real=0,02s
[2022-10-21T10:32:25.554+0200][9563,725s] GC(8) Concurrent Cycle
[2022-10-21T10:32:25.554+0200][9563,725s] GC(8) Concurrent Clear Claimed Marks
[2022-10-21T10:32:25.554+0200][9563,725s] GC(8) Concurrent Clear Claimed Marks 0,064ms
[2022-10-21T10:32:25.554+0200][9563,725s] GC(8) Concurrent Scan Root Regions
[2022-10-21T10:32:25.559+0200][9563,729s] GC(8) Concurrent Scan Root Regions 4,355ms
[2022-10-21T10:32:25.559+0200][9563,729s] GC(8) Concurrent Mark (9563,729s)
[2022-10-21T10:32:25.559+0200][9563,729s] GC(8) Concurrent Mark From Roots
[2022-10-21T10:32:25.559+0200][9563,729s] GC(8) Using 1 workers of 1 for marking
[2022-10-21T10:32:25.617+0200][9563,788s] GC(8) Concurrent Mark From Roots 58,395ms
[2022-10-21T10:32:25.617+0200][9563,788s] GC(8) Concurrent Preclean
[2022-10-21T10:32:25.617+0200][9563,788s] GC(8) Concurrent Preclean 0,134ms
[2022-10-21T10:32:25.617+0200][9563,788s] GC(8) Concurrent Mark (9563,729s, 9563,788s) 58,593ms
[2022-10-21T10:32:25.618+0200][9563,788s] GC(8) Pause Remark
[2022-10-21T10:32:25.665+0200][9563,835s] GC(8) Cleaned string and symbol table, strings: 19105 processed, 374 removed, symbols: 135439 processed, 78 removed
[2022-10-21T10:32:25.665+0200][9563,836s] GC(8) Pause Remark 29M->29M(512M) 47,657ms
[2022-10-21T10:32:25.665+0200][9563,836s] GC(8) User=0,00s Sys=0,03s Real=0,05s
[2022-10-21T10:32:25.665+0200][9563,836s] GC(8) Concurrent Rebuild Remembered Sets
[2022-10-21T10:32:25.673+0200][9563,844s] GC(8) Concurrent Rebuild Remembered Sets 8,196ms
[2022-10-21T10:32:25.674+0200][9563,844s] GC(8) Pause Cleanup
[2022-10-21T10:32:25.674+0200][9563,844s] GC(8) Pause Cleanup 29M->29M(512M) 0,076ms
[2022-10-21T10:32:25.674+0200][9563,844s] GC(8) User=0,00s Sys=0,00s Real=0,00s
[2022-10-21T10:32:25.674+0200][9563,844s] GC(8) Concurrent Cleanup for Next Mark
[2022-10-21T10:32:25.674+0200][9563,845s] GC(8) Concurrent Cleanup for Next Mark 0,572ms
[2022-10-21T10:32:25.674+0200][9563,845s] GC(8) Concurrent Cycle 119,983ms
[2022-10-21T11:47:00.866+0200][14039,037s] Heap
[2022-10-21T11:47:00.866+0200][14039,037s]  garbage-first heap   total 524288K, used 74897K [0x00000000e0000000, 0x0000000100000000)
[2022-10-21T11:47:00.866+0200][14039,037s]   region size 1024K, 54 young (55296K), 8 survivors (8192K)
[2022-10-21T11:47:00.866+0200][14039,037s]  Metaspace       used 47032K, capacity 48057K, committed 48284K, reserved 1091584K
[2022-10-21T11:47:00.866+0200][14039,037s]   class space    used 5239K, capacity 5650K, committed 5708K, reserved 1048576K
