8796219899905;8796264431617;8796515467883;bundleTemplates,targetBundleRules;;false
8796219998209;8796264529921;8796516287083;bundleTemplates;;false
8796222259201;8796266790913;8796534178411;bundleTemplates;;false
8796222390273;8796266921985;8796535358059;bundleTemplates;;false
8796222423041;8796266954753;8796535652971;bundleTemplates;;false
8796223275009;8796267806721;8796542861931;bundleTemplates,conditionalBundleRules,targetBundleRules;;false
8796223373313;8796267905025;8796543779435;bundleTemplates;;false
8796223438849;8796267970561;8796544369259;bundleTemplates;;false
8796223504385;8796268036097;8796544959083;bundleTemplates,conditionalBundleRules,targetBundleRules;;false
8796224389121;8796268920833;8796549153387;bundleTemplates,conditionalBundleRules,targetBundleRules;;false
8796224421889;8796268953601;8796549448299;bundleTemplates,conditionalBundleRules,targetBundleRules;;false
8796224454657;8796268986369;8796549743211;bundleTemplates;;false
8796224487425;8796269019137;8796550038123;bundleTemplates;;false
8796224520193;8796269051905;8796550333035;bundleTemplates;;false
8796224552961;8796269084673;8796550627947;bundleTemplates;;false
8796224749569;8796269281281;8796552364651;bundleTemplates;;false
8796224880641;8796269412353;8796553445995;bundleTemplates;;false
8796224913409;8796269445121;8796553740907;bundleTemplates;;false
8796225273857;8796269805569;8796556722795;bundleTemplates;;false
8796225372161;8796269903873;8796557574763;bundleTemplates;;false
8796225568769;8796270100481;8796559180395;bundleTemplates;;false
8796225601537;8796270133249;8796559475307;bundleTemplates,targetBundleRules;;false
8796226158593;8796270690305;8796564193899;bundleTemplates;;false
8796226224129;8796270755841;8796564750955;bundleTemplates;;false
8796227928065;8796272459777;8796579693163;bundleTemplates;;false
8796227960833;8796272492545;8796579988075;bundleTemplates;;false
8796229042177;8796273573889;8796589359723;bundleTemplates;;false
8796229107713;8796273639425;8796589949547;bundleTemplates;;false
8796229206017;8796273737729;8796590768747;bundleTemplates;;false
8796229238785;8796273770497;8796591063659;bundleTemplates;;false
8796229894145;8796274425857;8796596634219;bundleTemplates;;false
8796229926913;8796274458625;8796596929131;bundleTemplates;;false
8796229959681;8796274491393;8796597224043;bundleTemplates;;false
8796231892993;8796276424705;8796613771883;bundleTemplates;;false
8796233564161;8796278095873;8796628648555;bundleTemplates;;false
8796233596929;8796278128641;8796628943467;bundleTemplates;;false
8796233826305;8796278358017;8796630844011;bundleTemplates;;false
8796234448897;8796306931713;8796701491819;bundleTemplates,conditionalBundleRules;;false
8796093061285;8796093651109;8796755657323;childTemplates,status;;false
8796093094053;8796093683877;8796755755627;status;;false
8796093126821;8796093716645;8796755853931;status;;false
8796093159589;8796093749413;8796755886699;childTemplates,status;;false
8796093192357;8796093782181;8796755919467;childTemplates,status;;false
8796093225125;8796093814949;8796755952235;childTemplates,status;;false
8796093257893;8796093847717;8796756083307;status;;false
8796093290661;8796093880485;8796756116075;childTemplates,status;;false
8796093323429;8796093913253;8796756181611;status;;false
8796093356197;8796093946021;8796756247147;status;;false
8796093388965;8796093978789;8796756312683;status;;false
8796093421733;8796094011557;8796756378219;status;;false
8796093454501;8796094044325;8796756410987;childTemplates,status;;false
8796093487269;8796094077093;8796756476523;status;;false
8796093520037;8796094109861;8796756542059;status;;false
8796093552805;8796094142629;8796756574827;childTemplates,status;;false
8796093585573;8796094175397;8796756640363;dependentBundleTemplates,status;;false
8796093618341;8796094208165;8796756705899;status;;false
