8796751134750;8796754444318;8796487123563;mediaContainer;;false
8796751200286;8796754477086;8796487156331;mediaContainer;;false
8796751265822;8796754509854;8796487189099;mediaContainer;;false
8796751331358;8796754542622;8796487221867;mediaContainer;;false
8796751396894;8796754575390;8796487254635;mediaContainer;;false
8796751462430;8796754608158;8796487287403;mediaContainer;;false
