8796561866782;8796746547230;8796440003179;mediaContainer;;false
8796561932318;8796746579998;8796440035947;mediaContainer;;false
8796561997854;8796746612766;8796440068715;mediaContainer;;false
8796562063390;8796746645534;8796440101483;mediaContainer;;false
8796562128926;8796746678302;8796440134251;mediaContainer;;false
8796562194462;8796746711070;8796440167019;mediaContainer;;false
8796562259998;8796746743838;8796440199787;mediaContainer;;false
8796562325534;8796746776606;8796440232555;mediaContainer;;false
8796562391070;8796746809374;8796440265323;mediaContainer;;false
8796562456606;8796746842142;8796440298091;mediaContainer;;false
8796562522142;8796746874910;8796440330859;mediaContainer;;false
8796562587678;8796746907678;8796440363627;mediaContainer;;false
8796562653214;8796746940446;8796440396395;mediaContainer;;false
8796562718750;8796746973214;8796440429163;mediaContainer;;false
8796562784286;8796747005982;8796440461931;mediaContainer;;false
8796562849822;8796747038750;8796440494699;mediaContainer;;false
8796562915358;8796747071518;8796440527467;mediaContainer;;false
8796562980894;8796747104286;8796440560235;mediaContainer;;false
8796563046430;8796747137054;8796440593003;mediaContainer;;false
8796563111966;8796747169822;8796440625771;mediaContainer;;false
8796563177502;8796747202590;8796440658539;mediaContainer;;false
8796563243038;8796747235358;8796440691307;mediaContainer;;false
8796563308574;8796747268126;8796440724075;mediaContainer;;false
8796563374110;8796747300894;8796440756843;mediaContainer;;false
8796563439646;8796747333662;8796440789611;mediaContainer;;false
8796563505182;8796747366430;8796440822379;mediaContainer;;false
8796563570718;8796747399198;8796440855147;mediaContainer;;false
8796563636254;8796747431966;8796440887915;mediaContainer;;false
8796563701790;8796747464734;8796440920683;mediaContainer;;false
8796563767326;8796747497502;8796440953451;mediaContainer;;false
8796563832862;8796747530270;8796440986219;mediaContainer;;false
8796563898398;8796747563038;8796441018987;mediaContainer;;false
8796563963934;8796747595806;8796441051755;mediaContainer;;false
8796564029470;8796747628574;8796441084523;mediaContainer;;false
8796564095006;8796747661342;8796441117291;mediaContainer;;false
8796564160542;8796747694110;8796441150059;mediaContainer;;false
8796564226078;8796747726878;8796441182827;mediaContainer;;false
8796564291614;8796747759646;8796441215595;mediaContainer;;false
8796564357150;8796747792414;8796441248363;mediaContainer;;false
8796564422686;8796747825182;8796441281131;mediaContainer;;false
8796564488222;8796747857950;8796441313899;mediaContainer;;false
8796564553758;8796747890718;8796441346667;mediaContainer;;false
8796564619294;8796747923486;8796441379435;mediaContainer;;false
8796564684830;8796747956254;8796441412203;mediaContainer;;false
8796564750366;8796747989022;8796441444971;mediaContainer;;false
8796564815902;8796748021790;8796441477739;mediaContainer;;false
8796564881438;8796748054558;8796441510507;mediaContainer;;false
8796564946974;8796748087326;8796441543275;mediaContainer;;false
8796565012510;8796748120094;8796441576043;mediaContainer;;false
8796565078046;8796748152862;8796441608811;mediaContainer;;false
8796565143582;8796748185630;8796441641579;mediaContainer;;false
8796565209118;8796748218398;8796441674347;mediaContainer;;false
8796565274654;8796748251166;8796441707115;mediaContainer;;false
8796565340190;8796748283934;8796441739883;mediaContainer;;false
8796565405726;8796748316702;8796441772651;mediaContainer;;false
8796565471262;8796748349470;8796441805419;mediaContainer;;false
8796565536798;8796748382238;8796441838187;mediaContainer;;false
8796565602334;8796748415006;8796441870955;mediaContainer;;false
8796093613106;;;;8796101116988->8796117140540,8796094661674->8796104459306;false
8796101116988;8796117140540;8796442722923;restrictions,navigationNode;8796094661674->8796104459306;false
8796101182524;8796117271612;8796442985067;navigationNode;8796094792746->8796104590378;false
8796101248060;8796117337148;8796443083371;navigationNode;8796094825514->8796104623146;false
8796101313596;8796117402684;8796443181675;navigationNode;8796094858282->8796104655914;false
8796096922696;;;;8796097872960->8796106949696,8796097741888->8796106916928,8796097709120->8796106884160,8796097676352->8796106851392,8796097643584->8796106818624;false
8796097872960;8796106949696;8796462645867;entries;8796097741888->8796106916928,8796097709120->8796106884160,8796097676352->8796106851392,8796097643584->8796106818624;false
8796096955464;;;;8796097905728->8796106982464,8796097741888->8796106916928,8796097709120->8796106884160,8796097676352->8796106851392,8796097643584->8796106818624;false
8796097905728;8796106982464;8796462678635;entries;8796097741888->8796106916928,8796097709120->8796106884160,8796097676352->8796106851392,8796097643584->8796106818624;false
8796097053768;;;;8796097938496->8796107015232,8796097741888->8796106916928,8796097709120->8796106884160,8796097676352->8796106851392,8796097643584->8796106818624;false
8796097938496;8796107015232;8796462711403;entries;8796097741888->8796106916928,8796097709120->8796106884160,8796097676352->8796106851392,8796097643584->8796106818624;false
8796096988232;;;;8796097971264->8796107048000,8796097741888->8796106916928,8796097709120->8796106884160,8796097676352->8796106851392,8796097643584->8796106818624;false
8796097971264;8796107048000;8796462744171;entries;8796097741888->8796106916928,8796097709120->8796106884160,8796097676352->8796106851392,8796097643584->8796106818624;false
8796097086536;;;;8796098004032->8796107080768,8796097741888->8796106916928,8796097709120->8796106884160,8796097676352->8796106851392,8796097643584->8796106818624;false
8796098004032;8796107080768;8796462776939;entries;8796097741888->8796106916928,8796097709120->8796106884160,8796097676352->8796106851392,8796097643584->8796106818624;false
8796097021000;;;;8796098036800->8796107113536,8796097741888->8796106916928,8796097709120->8796106884160,8796097676352->8796106851392,8796097643584->8796106818624;false
8796098036800;8796107113536;8796462809707;entries;8796097741888->8796106916928,8796097709120->8796106884160,8796097676352->8796106851392,8796097643584->8796106818624;false
8796097119304;;;;8796098069568->8796107146304,8796097741888->8796106916928,8796097709120->8796106884160,8796097676352->8796106851392,8796097643584->8796106818624;false
8796098069568;8796107146304;8796462842475;entries;8796097741888->8796106916928,8796097709120->8796106884160,8796097676352->8796106851392,8796097643584->8796106818624;false
8796097152072;;;;8796098102336->8796107179072,8796097741888->8796106916928,8796097709120->8796106884160,8796097676352->8796106851392,8796097643584->8796106818624;false
8796098102336;8796107179072;8796462875243;entries;8796097741888->8796106916928,8796097709120->8796106884160,8796097676352->8796106851392,8796097643584->8796106818624;false
8796097184840;;;;8796098135104->8796107211840,8796097741888->8796106916928,8796097709120->8796106884160,8796097676352->8796106851392,8796097643584->8796106818624;false
8796098135104;8796107211840;8796462908011;entries;8796097741888->8796106916928,8796097709120->8796106884160,8796097676352->8796106851392,8796097643584->8796106818624;false
8796097217608;;;;8796098167872->8796107277376,8796097774656->8796107244608,8796097709120->8796106884160,8796097676352->8796106851392,8796097643584->8796106818624;false
8796098167872;8796107277376;8796462973547;entries;8796097774656->8796107244608,8796097709120->8796106884160,8796097676352->8796106851392,8796097643584->8796106818624;false
8796097250376;;;;8796098200640->8796107310144,8796097774656->8796107244608,8796097709120->8796106884160,8796097676352->8796106851392,8796097643584->8796106818624;false
8796098200640;8796107310144;8796463006315;entries;8796097774656->8796107244608,8796097709120->8796106884160,8796097676352->8796106851392,8796097643584->8796106818624;false
8796097446984;;;;8796098397248->8796107441216,8796101477440->8796107408448,8796098233408->8796107375680,8796097807424->8796107342912,8796097709120->8796106884160,8796097676352->8796106851392,8796097643584->8796106818624;false
8796098397248;8796107441216;8796463071851;entries;8796101477440->8796107408448,8796098233408->8796107375680,8796097807424->8796107342912,8796097709120->8796106884160,8796097676352->8796106851392,8796097643584->8796106818624;false
8796097479752;;;;8796098430016->8796107473984,8796101477440->8796107408448,8796098233408->8796107375680,8796097807424->8796107342912,8796097709120->8796106884160,8796097676352->8796106851392,8796097643584->8796106818624;false
8796098430016;8796107473984;8796463104619;entries;8796101477440->8796107408448,8796098233408->8796107375680,8796097807424->8796107342912,8796097709120->8796106884160,8796097676352->8796106851392,8796097643584->8796106818624;false
8796097512520;;;;8796098462784->8796107506752,8796101477440->8796107408448,8796098233408->8796107375680,8796097807424->8796107342912,8796097709120->8796106884160,8796097676352->8796106851392,8796097643584->8796106818624;false
8796098462784;8796107506752;8796463137387;entries;8796101477440->8796107408448,8796098233408->8796107375680,8796097807424->8796107342912,8796097709120->8796106884160,8796097676352->8796106851392,8796097643584->8796106818624;false
8796097545288;;;;8796098495552->8796107539520,8796101477440->8796107408448,8796098233408->8796107375680,8796097807424->8796107342912,8796097709120->8796106884160,8796097676352->8796106851392,8796097643584->8796106818624;false
8796098495552;8796107539520;8796463170155;entries;8796101477440->8796107408448,8796098233408->8796107375680,8796097807424->8796107342912,8796097709120->8796106884160,8796097676352->8796106851392,8796097643584->8796106818624;false
8796097578056;;;;8796098528320->8796107572288,8796101477440->8796107408448,8796098233408->8796107375680,8796097807424->8796107342912,8796097709120->8796106884160,8796097676352->8796106851392,8796097643584->8796106818624;false
8796098528320;8796107572288;8796463202923;entries;8796101477440->8796107408448,8796098233408->8796107375680,8796097807424->8796107342912,8796097709120->8796106884160,8796097676352->8796106851392,8796097643584->8796106818624;false
8796097610824;;;;8796098561088->8796107605056,8796101477440->8796107408448,8796098233408->8796107375680,8796097807424->8796107342912,8796097709120->8796106884160,8796097676352->8796106851392,8796097643584->8796106818624;false
8796098561088;8796107605056;8796463235691;entries;8796101477440->8796107408448,8796098233408->8796107375680,8796097807424->8796107342912,8796097709120->8796106884160,8796097676352->8796106851392,8796097643584->8796106818624;false
8796097643592;;;;8796098593856->8796107637824,8796101477440->8796107408448,8796098233408->8796107375680,8796097807424->8796107342912,8796097709120->8796106884160,8796097676352->8796106851392,8796097643584->8796106818624;false
8796098593856;8796107637824;8796463268459;entries;8796101477440->8796107408448,8796098233408->8796107375680,8796097807424->8796107342912,8796097709120->8796106884160,8796097676352->8796106851392,8796097643584->8796106818624;false
8796097676360;;;;8796098626624->8796107670592,8796101477440->8796107408448,8796098233408->8796107375680,8796097807424->8796107342912,8796097709120->8796106884160,8796097676352->8796106851392,8796097643584->8796106818624;false
8796098626624;8796107670592;8796463301227;entries;8796101477440->8796107408448,8796098233408->8796107375680,8796097807424->8796107342912,8796097709120->8796106884160,8796097676352->8796106851392,8796097643584->8796106818624;false
8796097709128;;;;8796098659392->8796107703360,8796101477440->8796107408448,8796098233408->8796107375680,8796097807424->8796107342912,8796097709120->8796106884160,8796097676352->8796106851392,8796097643584->8796106818624;false
8796098659392;8796107703360;8796463333995;entries;8796101477440->8796107408448,8796098233408->8796107375680,8796097807424->8796107342912,8796097709120->8796106884160,8796097676352->8796106851392,8796097643584->8796106818624;false
8796097741896;;;;8796098692160->8796107736128,8796101477440->8796107408448,8796098233408->8796107375680,8796097807424->8796107342912,8796097709120->8796106884160,8796097676352->8796106851392,8796097643584->8796106818624;false
8796098692160;8796107736128;8796463366763;entries;8796101477440->8796107408448,8796098233408->8796107375680,8796097807424->8796107342912,8796097709120->8796106884160,8796097676352->8796106851392,8796097643584->8796106818624;false
8796097774664;;;;8796098724928->8796107768896,8796101477440->8796107408448,8796098233408->8796107375680,8796097807424->8796107342912,8796097709120->8796106884160,8796097676352->8796106851392,8796097643584->8796106818624;false
8796098724928;8796107768896;8796463399531;entries;8796101477440->8796107408448,8796098233408->8796107375680,8796097807424->8796107342912,8796097709120->8796106884160,8796097676352->8796106851392,8796097643584->8796106818624;false
8796097807432;;;;8796098757696->8796107801664,8796101477440->8796107408448,8796098233408->8796107375680,8796097807424->8796107342912,8796097709120->8796106884160,8796097676352->8796106851392,8796097643584->8796106818624;false
8796098757696;8796107801664;8796463432299;entries;8796101477440->8796107408448,8796098233408->8796107375680,8796097807424->8796107342912,8796097709120->8796106884160,8796097676352->8796106851392,8796097643584->8796106818624;false
8796097840200;;;;8796098790464->8796107834432,8796101477440->8796107408448,8796098233408->8796107375680,8796097807424->8796107342912,8796097709120->8796106884160,8796097676352->8796106851392,8796097643584->8796106818624;false
8796098790464;8796107834432;8796463465067;entries;8796101477440->8796107408448,8796098233408->8796107375680,8796097807424->8796107342912,8796097709120->8796106884160,8796097676352->8796106851392,8796097643584->8796106818624;false
8796097872968;;;;8796098823232->8796107867200,8796101477440->8796107408448,8796098233408->8796107375680,8796097807424->8796107342912,8796097709120->8796106884160,8796097676352->8796106851392,8796097643584->8796106818624;false
8796098823232;8796107867200;8796463497835;entries;8796101477440->8796107408448,8796098233408->8796107375680,8796097807424->8796107342912,8796097709120->8796106884160,8796097676352->8796106851392,8796097643584->8796106818624;false
8796097905736;;;;8796098856000->8796107899968,8796101477440->8796107408448,8796098233408->8796107375680,8796097807424->8796107342912,8796097709120->8796106884160,8796097676352->8796106851392,8796097643584->8796106818624;false
8796098856000;8796107899968;8796463530603;entries;8796101477440->8796107408448,8796098233408->8796107375680,8796097807424->8796107342912,8796097709120->8796106884160,8796097676352->8796106851392,8796097643584->8796106818624;false
8796097938504;;;;8796098888768->8796107932736,8796101477440->8796107408448,8796098233408->8796107375680,8796097807424->8796107342912,8796097709120->8796106884160,8796097676352->8796106851392,8796097643584->8796106818624;false
8796098888768;8796107932736;8796463563371;entries;8796101477440->8796107408448,8796098233408->8796107375680,8796097807424->8796107342912,8796097709120->8796106884160,8796097676352->8796106851392,8796097643584->8796106818624;false
8796097971272;;;;8796098921536->8796107965504,8796101477440->8796107408448,8796098233408->8796107375680,8796097807424->8796107342912,8796097709120->8796106884160,8796097676352->8796106851392,8796097643584->8796106818624;false
8796098921536;8796107965504;8796463596139;entries;8796101477440->8796107408448,8796098233408->8796107375680,8796097807424->8796107342912,8796097709120->8796106884160,8796097676352->8796106851392,8796097643584->8796106818624;false
8796098004040;;;;8796098954304->8796107998272,8796101477440->8796107408448,8796098233408->8796107375680,8796097807424->8796107342912,8796097709120->8796106884160,8796097676352->8796106851392,8796097643584->8796106818624;false
8796098954304;8796107998272;8796463628907;entries;8796101477440->8796107408448,8796098233408->8796107375680,8796097807424->8796107342912,8796097709120->8796106884160,8796097676352->8796106851392,8796097643584->8796106818624;false
8796098036808;;;;8796098987072->8796108031040,8796101477440->8796107408448,8796098233408->8796107375680,8796097807424->8796107342912,8796097709120->8796106884160,8796097676352->8796106851392,8796097643584->8796106818624;false
8796098987072;8796108031040;8796463661675;entries;8796101477440->8796107408448,8796098233408->8796107375680,8796097807424->8796107342912,8796097709120->8796106884160,8796097676352->8796106851392,8796097643584->8796106818624;false
8796098069576;;;;8796099019840->8796108063808,8796101477440->8796107408448,8796098233408->8796107375680,8796097807424->8796107342912,8796097709120->8796106884160,8796097676352->8796106851392,8796097643584->8796106818624;false
8796099019840;8796108063808;8796463694443;entries;8796101477440->8796107408448,8796098233408->8796107375680,8796097807424->8796107342912,8796097709120->8796106884160,8796097676352->8796106851392,8796097643584->8796106818624;false
8796098102344;;;;8796099052608->8796108096576,8796101477440->8796107408448,8796098233408->8796107375680,8796097807424->8796107342912,8796097709120->8796106884160,8796097676352->8796106851392,8796097643584->8796106818624;false
8796099052608;8796108096576;8796463727211;entries;8796101477440->8796107408448,8796098233408->8796107375680,8796097807424->8796107342912,8796097709120->8796106884160,8796097676352->8796106851392,8796097643584->8796106818624;false
8796098135112;;;;8796099085376->8796108129344,8796101477440->8796107408448,8796098233408->8796107375680,8796097807424->8796107342912,8796097709120->8796106884160,8796097676352->8796106851392,8796097643584->8796106818624;false
8796099085376;8796108129344;8796463759979;entries;8796101477440->8796107408448,8796098233408->8796107375680,8796097807424->8796107342912,8796097709120->8796106884160,8796097676352->8796106851392,8796097643584->8796106818624;false
8796098167880;;;;8796099118144->8796108162112,8796101477440->8796107408448,8796098233408->8796107375680,8796097807424->8796107342912,8796097709120->8796106884160,8796097676352->8796106851392,8796097643584->8796106818624;false
8796099118144;8796108162112;8796463792747;entries;8796101477440->8796107408448,8796098233408->8796107375680,8796097807424->8796107342912,8796097709120->8796106884160,8796097676352->8796106851392,8796097643584->8796106818624;false
8796098200648;;;;8796099150912->8796108194880,8796101477440->8796107408448,8796098233408->8796107375680,8796097807424->8796107342912,8796097709120->8796106884160,8796097676352->8796106851392,8796097643584->8796106818624;false
8796099150912;8796108194880;8796463825515;entries;8796101477440->8796107408448,8796098233408->8796107375680,8796097807424->8796107342912,8796097709120->8796106884160,8796097676352->8796106851392,8796097643584->8796106818624;false
8796098233416;;;;8796099183680->8796108227648,8796101477440->8796107408448,8796098233408->8796107375680,8796097807424->8796107342912,8796097709120->8796106884160,8796097676352->8796106851392,8796097643584->8796106818624;false
8796099183680;8796108227648;8796463858283;entries;8796101477440->8796107408448,8796098233408->8796107375680,8796097807424->8796107342912,8796097709120->8796106884160,8796097676352->8796106851392,8796097643584->8796106818624;false
8796098266184;;;;8796099216448->8796108260416,8796101477440->8796107408448,8796098233408->8796107375680,8796097807424->8796107342912,8796097709120->8796106884160,8796097676352->8796106851392,8796097643584->8796106818624;false
8796099216448;8796108260416;8796463891051;entries;8796101477440->8796107408448,8796098233408->8796107375680,8796097807424->8796107342912,8796097709120->8796106884160,8796097676352->8796106851392,8796097643584->8796106818624;false
8796098298952;;;;8796099249216->8796108293184,8796101477440->8796107408448,8796098233408->8796107375680,8796097807424->8796107342912,8796097709120->8796106884160,8796097676352->8796106851392,8796097643584->8796106818624;false
8796099249216;8796108293184;8796463923819;entries;8796101477440->8796107408448,8796098233408->8796107375680,8796097807424->8796107342912,8796097709120->8796106884160,8796097676352->8796106851392,8796097643584->8796106818624;false
8796098331720;;;;8796099281984->8796108325952,8796101477440->8796107408448,8796098233408->8796107375680,8796097807424->8796107342912,8796097709120->8796106884160,8796097676352->8796106851392,8796097643584->8796106818624;false
8796099281984;8796108325952;8796463956587;entries;8796101477440->8796107408448,8796098233408->8796107375680,8796097807424->8796107342912,8796097709120->8796106884160,8796097676352->8796106851392,8796097643584->8796106818624;false
8796098364488;;;;8796099314752->8796108358720,8796101477440->8796107408448,8796098233408->8796107375680,8796097807424->8796107342912,8796097709120->8796106884160,8796097676352->8796106851392,8796097643584->8796106818624;false
8796099314752;8796108358720;8796463989355;entries;8796101477440->8796107408448,8796098233408->8796107375680,8796097807424->8796107342912,8796097709120->8796106884160,8796097676352->8796106851392,8796097643584->8796106818624;false
8796098397256;;;;8796099347520->8796108391488,8796101477440->8796107408448,8796098233408->8796107375680,8796097807424->8796107342912,8796097709120->8796106884160,8796097676352->8796106851392,8796097643584->8796106818624;false
8796099347520;8796108391488;8796464022123;entries;8796101477440->8796107408448,8796098233408->8796107375680,8796097807424->8796107342912,8796097709120->8796106884160,8796097676352->8796106851392,8796097643584->8796106818624;false
8796098430024;;;;8796099380288->8796108424256,8796101477440->8796107408448,8796098233408->8796107375680,8796097807424->8796107342912,8796097709120->8796106884160,8796097676352->8796106851392,8796097643584->8796106818624;false
8796099380288;8796108424256;8796464054891;entries;8796101477440->8796107408448,8796098233408->8796107375680,8796097807424->8796107342912,8796097709120->8796106884160,8796097676352->8796106851392,8796097643584->8796106818624;false
8796098462792;;;;8796099413056->8796108457024,8796101477440->8796107408448,8796098233408->8796107375680,8796097807424->8796107342912,8796097709120->8796106884160,8796097676352->8796106851392,8796097643584->8796106818624;false
8796099413056;8796108457024;8796464087659;entries;8796101477440->8796107408448,8796098233408->8796107375680,8796097807424->8796107342912,8796097709120->8796106884160,8796097676352->8796106851392,8796097643584->8796106818624;false
8796098495560;;;;8796099445824->8796108489792,8796101477440->8796107408448,8796098233408->8796107375680,8796097807424->8796107342912,8796097709120->8796106884160,8796097676352->8796106851392,8796097643584->8796106818624;false
8796099445824;8796108489792;8796464120427;entries;8796101477440->8796107408448,8796098233408->8796107375680,8796097807424->8796107342912,8796097709120->8796106884160,8796097676352->8796106851392,8796097643584->8796106818624;false
8796098528328;;;;8796099478592->8796108522560,8796101477440->8796107408448,8796098233408->8796107375680,8796097807424->8796107342912,8796097709120->8796106884160,8796097676352->8796106851392,8796097643584->8796106818624;false
8796099478592;8796108522560;8796464153195;entries;8796101477440->8796107408448,8796098233408->8796107375680,8796097807424->8796107342912,8796097709120->8796106884160,8796097676352->8796106851392,8796097643584->8796106818624;false
8796098561096;;;;8796099511360->8796108555328,8796101477440->8796107408448,8796098233408->8796107375680,8796097807424->8796107342912,8796097709120->8796106884160,8796097676352->8796106851392,8796097643584->8796106818624;false
8796099511360;8796108555328;8796464185963;entries;8796101477440->8796107408448,8796098233408->8796107375680,8796097807424->8796107342912,8796097709120->8796106884160,8796097676352->8796106851392,8796097643584->8796106818624;false
8796098593864;;;;8796099544128->8796108588096,8796101477440->8796107408448,8796098233408->8796107375680,8796097807424->8796107342912,8796097709120->8796106884160,8796097676352->8796106851392,8796097643584->8796106818624;false
8796099544128;8796108588096;8796464218731;entries;8796101477440->8796107408448,8796098233408->8796107375680,8796097807424->8796107342912,8796097709120->8796106884160,8796097676352->8796106851392,8796097643584->8796106818624;false
8796098626632;;;;8796099576896->8796108620864,8796101477440->8796107408448,8796098233408->8796107375680,8796097807424->8796107342912,8796097709120->8796106884160,8796097676352->8796106851392,8796097643584->8796106818624;false
8796099576896;8796108620864;8796464251499;entries;8796101477440->8796107408448,8796098233408->8796107375680,8796097807424->8796107342912,8796097709120->8796106884160,8796097676352->8796106851392,8796097643584->8796106818624;false
8796098659400;;;;8796099609664->8796108653632,8796101477440->8796107408448,8796098233408->8796107375680,8796097807424->8796107342912,8796097709120->8796106884160,8796097676352->8796106851392,8796097643584->8796106818624;false
8796099609664;8796108653632;8796464284267;entries;8796101477440->8796107408448,8796098233408->8796107375680,8796097807424->8796107342912,8796097709120->8796106884160,8796097676352->8796106851392,8796097643584->8796106818624;false
8796098692168;;;;8796099642432->8796108686400,8796101477440->8796107408448,8796098233408->8796107375680,8796097807424->8796107342912,8796097709120->8796106884160,8796097676352->8796106851392,8796097643584->8796106818624;false
8796099642432;8796108686400;8796464317035;entries;8796101477440->8796107408448,8796098233408->8796107375680,8796097807424->8796107342912,8796097709120->8796106884160,8796097676352->8796106851392,8796097643584->8796106818624;false
8796098724936;;;;8796099675200->8796108719168,8796101477440->8796107408448,8796098233408->8796107375680,8796097807424->8796107342912,8796097709120->8796106884160,8796097676352->8796106851392,8796097643584->8796106818624;false
8796099675200;8796108719168;8796464349803;entries;8796101477440->8796107408448,8796098233408->8796107375680,8796097807424->8796107342912,8796097709120->8796106884160,8796097676352->8796106851392,8796097643584->8796106818624;false
8796098757704;;;;8796099707968->8796108751936,8796101477440->8796107408448,8796098233408->8796107375680,8796097807424->8796107342912,8796097709120->8796106884160,8796097676352->8796106851392,8796097643584->8796106818624;false
8796099707968;8796108751936;8796464382571;entries;8796101477440->8796107408448,8796098233408->8796107375680,8796097807424->8796107342912,8796097709120->8796106884160,8796097676352->8796106851392,8796097643584->8796106818624;false
8796098790472;;;;8796099740736->8796108784704,8796101477440->8796107408448,8796098233408->8796107375680,8796097807424->8796107342912,8796097709120->8796106884160,8796097676352->8796106851392,8796097643584->8796106818624;false
8796099740736;8796108784704;8796464415339;entries;8796101477440->8796107408448,8796098233408->8796107375680,8796097807424->8796107342912,8796097709120->8796106884160,8796097676352->8796106851392,8796097643584->8796106818624;false
8796098823240;;;;8796099773504->8796108817472,8796101477440->8796107408448,8796098233408->8796107375680,8796097807424->8796107342912,8796097709120->8796106884160,8796097676352->8796106851392,8796097643584->8796106818624;false
8796099773504;8796108817472;8796464448107;entries;8796101477440->8796107408448,8796098233408->8796107375680,8796097807424->8796107342912,8796097709120->8796106884160,8796097676352->8796106851392,8796097643584->8796106818624;false
8796098856008;;;;8796099806272->8796108850240,8796101477440->8796107408448,8796098233408->8796107375680,8796097807424->8796107342912,8796097709120->8796106884160,8796097676352->8796106851392,8796097643584->8796106818624;false
8796099806272;8796108850240;8796464480875;entries;8796101477440->8796107408448,8796098233408->8796107375680,8796097807424->8796107342912,8796097709120->8796106884160,8796097676352->8796106851392,8796097643584->8796106818624;false
8796098888776;;;;8796099839040->8796108883008,8796101477440->8796107408448,8796098233408->8796107375680,8796097807424->8796107342912,8796097709120->8796106884160,8796097676352->8796106851392,8796097643584->8796106818624;false
8796099839040;8796108883008;8796464513643;entries;8796101477440->8796107408448,8796098233408->8796107375680,8796097807424->8796107342912,8796097709120->8796106884160,8796097676352->8796106851392,8796097643584->8796106818624;false
8796098921544;;;;8796099871808->8796108915776,8796101477440->8796107408448,8796098233408->8796107375680,8796097807424->8796107342912,8796097709120->8796106884160,8796097676352->8796106851392,8796097643584->8796106818624;false
8796099871808;8796108915776;8796464546411;entries;8796101477440->8796107408448,8796098233408->8796107375680,8796097807424->8796107342912,8796097709120->8796106884160,8796097676352->8796106851392,8796097643584->8796106818624;false
8796098954312;;;;8796099904576->8796108948544,8796101477440->8796107408448,8796098233408->8796107375680,8796097807424->8796107342912,8796097709120->8796106884160,8796097676352->8796106851392,8796097643584->8796106818624;false
8796099904576;8796108948544;8796464579179;entries;8796101477440->8796107408448,8796098233408->8796107375680,8796097807424->8796107342912,8796097709120->8796106884160,8796097676352->8796106851392,8796097643584->8796106818624;false
8796098987080;;;;8796099937344->8796108981312,8796101477440->8796107408448,8796098233408->8796107375680,8796097807424->8796107342912,8796097709120->8796106884160,8796097676352->8796106851392,8796097643584->8796106818624;false
8796099937344;8796108981312;8796464611947;entries;8796101477440->8796107408448,8796098233408->8796107375680,8796097807424->8796107342912,8796097709120->8796106884160,8796097676352->8796106851392,8796097643584->8796106818624;false
8796099019848;;;;8796099970112->8796109014080,8796101477440->8796107408448,8796098233408->8796107375680,8796097807424->8796107342912,8796097709120->8796106884160,8796097676352->8796106851392,8796097643584->8796106818624;false
8796099970112;8796109014080;8796464644715;entries;8796101477440->8796107408448,8796098233408->8796107375680,8796097807424->8796107342912,8796097709120->8796106884160,8796097676352->8796106851392,8796097643584->8796106818624;false
8796099052616;;;;8796100002880->8796109046848,8796101477440->8796107408448,8796098233408->8796107375680,8796097807424->8796107342912,8796097709120->8796106884160,8796097676352->8796106851392,8796097643584->8796106818624;false
8796100002880;8796109046848;8796464677483;entries;8796101477440->8796107408448,8796098233408->8796107375680,8796097807424->8796107342912,8796097709120->8796106884160,8796097676352->8796106851392,8796097643584->8796106818624;false
8796097283144;;;;8796098233408->8796107375680,8796097807424->8796107342912,8796097709120->8796106884160,8796097676352->8796106851392,8796097643584->8796106818624;false
8796098233408;8796107375680;8796464743019;entries;8796097807424->8796107342912,8796097709120->8796106884160,8796097676352->8796106851392,8796097643584->8796106818624;false
8796099085384;;;;8796100035648->8796109145152,8796101510208->8796109112384,8796098266176->8796109079616,8796097807424->8796107342912,8796097709120->8796106884160,8796097676352->8796106851392,8796097643584->8796106818624;false
8796100035648;8796109145152;8796464775787;entries;8796101510208->8796109112384,8796098266176->8796109079616,8796097807424->8796107342912,8796097709120->8796106884160,8796097676352->8796106851392,8796097643584->8796106818624;false
8796099118152;;;;8796100068416->8796109177920,8796101510208->8796109112384,8796098266176->8796109079616,8796097807424->8796107342912,8796097709120->8796106884160,8796097676352->8796106851392,8796097643584->8796106818624;false
8796100068416;8796109177920;8796464808555;entries;8796101510208->8796109112384,8796098266176->8796109079616,8796097807424->8796107342912,8796097709120->8796106884160,8796097676352->8796106851392,8796097643584->8796106818624;false
8796099150920;;;;8796100101184->8796109210688,8796101510208->8796109112384,8796098266176->8796109079616,8796097807424->8796107342912,8796097709120->8796106884160,8796097676352->8796106851392,8796097643584->8796106818624;false
8796100101184;8796109210688;8796464841323;entries;8796101510208->8796109112384,8796098266176->8796109079616,8796097807424->8796107342912,8796097709120->8796106884160,8796097676352->8796106851392,8796097643584->8796106818624;false
8796099183688;;;;8796100133952->8796109243456,8796101510208->8796109112384,8796098266176->8796109079616,8796097807424->8796107342912,8796097709120->8796106884160,8796097676352->8796106851392,8796097643584->8796106818624;false
8796100133952;8796109243456;8796464874091;entries;8796101510208->8796109112384,8796098266176->8796109079616,8796097807424->8796107342912,8796097709120->8796106884160,8796097676352->8796106851392,8796097643584->8796106818624;false
8796099216456;;;;8796100166720->8796109308992,8796101542976->8796109276224,8796098266176->8796109079616,8796097807424->8796107342912,8796097709120->8796106884160,8796097676352->8796106851392,8796097643584->8796106818624;false
8796100166720;8796109308992;8796464939627;entries;8796101542976->8796109276224,8796098266176->8796109079616,8796097807424->8796107342912,8796097709120->8796106884160,8796097676352->8796106851392,8796097643584->8796106818624;false
8796099249224;;;;8796100199488->8796109341760,8796101542976->8796109276224,8796098266176->8796109079616,8796097807424->8796107342912,8796097709120->8796106884160,8796097676352->8796106851392,8796097643584->8796106818624;false
8796100199488;8796109341760;8796464972395;entries;8796101542976->8796109276224,8796098266176->8796109079616,8796097807424->8796107342912,8796097709120->8796106884160,8796097676352->8796106851392,8796097643584->8796106818624;false
8796099281992;;;;8796100232256->8796109374528,8796101542976->8796109276224,8796098266176->8796109079616,8796097807424->8796107342912,8796097709120->8796106884160,8796097676352->8796106851392,8796097643584->8796106818624;false
8796100232256;8796109374528;8796465005163;entries;8796101542976->8796109276224,8796098266176->8796109079616,8796097807424->8796107342912,8796097709120->8796106884160,8796097676352->8796106851392,8796097643584->8796106818624;false
8796099314760;;;;8796100265024->8796109407296,8796101542976->8796109276224,8796098266176->8796109079616,8796097807424->8796107342912,8796097709120->8796106884160,8796097676352->8796106851392,8796097643584->8796106818624;false
8796100265024;8796109407296;8796465037931;entries;8796101542976->8796109276224,8796098266176->8796109079616,8796097807424->8796107342912,8796097709120->8796106884160,8796097676352->8796106851392,8796097643584->8796106818624;false
8796099347528;;;;8796100297792->8796109440064,8796101542976->8796109276224,8796098266176->8796109079616,8796097807424->8796107342912,8796097709120->8796106884160,8796097676352->8796106851392,8796097643584->8796106818624;false
8796100297792;8796109440064;8796465070699;entries;8796101542976->8796109276224,8796098266176->8796109079616,8796097807424->8796107342912,8796097709120->8796106884160,8796097676352->8796106851392,8796097643584->8796106818624;false
8796099380296;;;;8796100330560->8796109505600,8796101575744->8796109472832,8796098266176->8796109079616,8796097807424->8796107342912,8796097709120->8796106884160,8796097676352->8796106851392,8796097643584->8796106818624;false
8796100330560;8796109505600;8796465136235;entries;8796101575744->8796109472832,8796098266176->8796109079616,8796097807424->8796107342912,8796097709120->8796106884160,8796097676352->8796106851392,8796097643584->8796106818624;false
8796099413064;;;;8796100363328->8796109538368,8796101575744->8796109472832,8796098266176->8796109079616,8796097807424->8796107342912,8796097709120->8796106884160,8796097676352->8796106851392,8796097643584->8796106818624;false
8796100363328;8796109538368;8796465169003;entries;8796101575744->8796109472832,8796098266176->8796109079616,8796097807424->8796107342912,8796097709120->8796106884160,8796097676352->8796106851392,8796097643584->8796106818624;false
8796097315912;;;;8796098266176->8796109079616,8796097807424->8796107342912,8796097709120->8796106884160,8796097676352->8796106851392,8796097643584->8796106818624;false
8796098266176;8796109079616;8796465234539;entries;8796097807424->8796107342912,8796097709120->8796106884160,8796097676352->8796106851392,8796097643584->8796106818624;false
8796099445832;;;;8796100396096->8796109636672,8796101608512->8796109603904,8796098298944->8796109571136,8796097807424->8796107342912,8796097709120->8796106884160,8796097676352->8796106851392,8796097643584->8796106818624;false
8796100396096;8796109636672;8796465267307;entries;8796101608512->8796109603904,8796098298944->8796109571136,8796097807424->8796107342912,8796097709120->8796106884160,8796097676352->8796106851392,8796097643584->8796106818624;false
8796099478600;;;;8796100428864->8796109669440,8796101608512->8796109603904,8796098298944->8796109571136,8796097807424->8796107342912,8796097709120->8796106884160,8796097676352->8796106851392,8796097643584->8796106818624;false
8796100428864;8796109669440;8796465300075;entries;8796101608512->8796109603904,8796098298944->8796109571136,8796097807424->8796107342912,8796097709120->8796106884160,8796097676352->8796106851392,8796097643584->8796106818624;false
8796099511368;;;;8796100461632->8796109734976,8796101641280->8796109702208,8796098298944->8796109571136,8796097807424->8796107342912,8796097709120->8796106884160,8796097676352->8796106851392,8796097643584->8796106818624;false
8796100461632;8796109734976;8796465365611;entries;8796101641280->8796109702208,8796098298944->8796109571136,8796097807424->8796107342912,8796097709120->8796106884160,8796097676352->8796106851392,8796097643584->8796106818624;false
8796099544136;;;;8796100494400->8796109767744,8796101641280->8796109702208,8796098298944->8796109571136,8796097807424->8796107342912,8796097709120->8796106884160,8796097676352->8796106851392,8796097643584->8796106818624;false
8796100494400;8796109767744;8796465398379;entries;8796101641280->8796109702208,8796098298944->8796109571136,8796097807424->8796107342912,8796097709120->8796106884160,8796097676352->8796106851392,8796097643584->8796106818624;false
8796099576904;;;;8796100527168->8796109833280,8796101674048->8796109800512,8796098298944->8796109571136,8796097807424->8796107342912,8796097709120->8796106884160,8796097676352->8796106851392,8796097643584->8796106818624;false
8796100527168;8796109833280;8796465463915;entries;8796101674048->8796109800512,8796098298944->8796109571136,8796097807424->8796107342912,8796097709120->8796106884160,8796097676352->8796106851392,8796097643584->8796106818624;false
8796099609672;;;;8796100559936->8796109866048,8796101674048->8796109800512,8796098298944->8796109571136,8796097807424->8796107342912,8796097709120->8796106884160,8796097676352->8796106851392,8796097643584->8796106818624;false
8796100559936;8796109866048;8796465496683;entries;8796101674048->8796109800512,8796098298944->8796109571136,8796097807424->8796107342912,8796097709120->8796106884160,8796097676352->8796106851392,8796097643584->8796106818624;false
8796099642440;;;;8796100592704->8796109931584,8796101706816->8796109898816,8796098298944->8796109571136,8796097807424->8796107342912,8796097709120->8796106884160,8796097676352->8796106851392,8796097643584->8796106818624;false
8796100592704;8796109931584;8796465562219;entries;8796101706816->8796109898816,8796098298944->8796109571136,8796097807424->8796107342912,8796097709120->8796106884160,8796097676352->8796106851392,8796097643584->8796106818624;false
8796099675208;;;;8796100625472->8796109964352,8796101706816->8796109898816,8796098298944->8796109571136,8796097807424->8796107342912,8796097709120->8796106884160,8796097676352->8796106851392,8796097643584->8796106818624;false
8796100625472;8796109964352;8796465594987;entries;8796101706816->8796109898816,8796098298944->8796109571136,8796097807424->8796107342912,8796097709120->8796106884160,8796097676352->8796106851392,8796097643584->8796106818624;false
8796099707976;;;;8796100658240->8796109997120,8796101706816->8796109898816,8796098298944->8796109571136,8796097807424->8796107342912,8796097709120->8796106884160,8796097676352->8796106851392,8796097643584->8796106818624;false
8796100658240;8796109997120;8796465627755;entries;8796101706816->8796109898816,8796098298944->8796109571136,8796097807424->8796107342912,8796097709120->8796106884160,8796097676352->8796106851392,8796097643584->8796106818624;false
8796099740744;;;;8796100691008->8796110029888,8796101706816->8796109898816,8796098298944->8796109571136,8796097807424->8796107342912,8796097709120->8796106884160,8796097676352->8796106851392,8796097643584->8796106818624;false
8796100691008;8796110029888;8796465660523;entries;8796101706816->8796109898816,8796098298944->8796109571136,8796097807424->8796107342912,8796097709120->8796106884160,8796097676352->8796106851392,8796097643584->8796106818624;false
8796097348680;;;;8796098298944->8796109571136,8796097807424->8796107342912,8796097709120->8796106884160,8796097676352->8796106851392,8796097643584->8796106818624;false
8796098298944;8796109571136;8796465726059;entries;8796097807424->8796107342912,8796097709120->8796106884160,8796097676352->8796106851392,8796097643584->8796106818624;false
8796099773512;;;;8796100723776->8796110128192,8796101739584->8796110095424,8796098331712->8796110062656,8796097807424->8796107342912,8796097709120->8796106884160,8796097676352->8796106851392,8796097643584->8796106818624;false
8796100723776;8796110128192;8796465758827;entries;8796101739584->8796110095424,8796098331712->8796110062656,8796097807424->8796107342912,8796097709120->8796106884160,8796097676352->8796106851392,8796097643584->8796106818624;false
8796099806280;;;;8796100756544->8796110160960,8796101739584->8796110095424,8796098331712->8796110062656,8796097807424->8796107342912,8796097709120->8796106884160,8796097676352->8796106851392,8796097643584->8796106818624;false
8796100756544;8796110160960;8796465791595;entries;8796101739584->8796110095424,8796098331712->8796110062656,8796097807424->8796107342912,8796097709120->8796106884160,8796097676352->8796106851392,8796097643584->8796106818624;false
8796099839048;;;;8796100789312->8796110193728,8796101739584->8796110095424,8796098331712->8796110062656,8796097807424->8796107342912,8796097709120->8796106884160,8796097676352->8796106851392,8796097643584->8796106818624;false
8796100789312;8796110193728;8796465824363;entries;8796101739584->8796110095424,8796098331712->8796110062656,8796097807424->8796107342912,8796097709120->8796106884160,8796097676352->8796106851392,8796097643584->8796106818624;false
8796099871816;;;;8796100822080->8796110226496,8796101739584->8796110095424,8796098331712->8796110062656,8796097807424->8796107342912,8796097709120->8796106884160,8796097676352->8796106851392,8796097643584->8796106818624;false
8796100822080;8796110226496;8796465857131;entries;8796101739584->8796110095424,8796098331712->8796110062656,8796097807424->8796107342912,8796097709120->8796106884160,8796097676352->8796106851392,8796097643584->8796106818624;false
8796099904584;;;;8796100854848->8796110259264,8796101739584->8796110095424,8796098331712->8796110062656,8796097807424->8796107342912,8796097709120->8796106884160,8796097676352->8796106851392,8796097643584->8796106818624;false
8796100854848;8796110259264;8796465889899;entries;8796101739584->8796110095424,8796098331712->8796110062656,8796097807424->8796107342912,8796097709120->8796106884160,8796097676352->8796106851392,8796097643584->8796106818624;false
8796099937352;;;;8796100887616->8796110292032,8796101739584->8796110095424,8796098331712->8796110062656,8796097807424->8796107342912,8796097709120->8796106884160,8796097676352->8796106851392,8796097643584->8796106818624;false
8796100887616;8796110292032;8796465922667;entries;8796101739584->8796110095424,8796098331712->8796110062656,8796097807424->8796107342912,8796097709120->8796106884160,8796097676352->8796106851392,8796097643584->8796106818624;false
8796099970120;;;;8796100920384->8796110324800,8796101739584->8796110095424,8796098331712->8796110062656,8796097807424->8796107342912,8796097709120->8796106884160,8796097676352->8796106851392,8796097643584->8796106818624;false
8796100920384;8796110324800;8796465955435;entries;8796101739584->8796110095424,8796098331712->8796110062656,8796097807424->8796107342912,8796097709120->8796106884160,8796097676352->8796106851392,8796097643584->8796106818624;false
8796100002888;;;;8796100953152->8796110357568,8796101739584->8796110095424,8796098331712->8796110062656,8796097807424->8796107342912,8796097709120->8796106884160,8796097676352->8796106851392,8796097643584->8796106818624;false
8796100953152;8796110357568;8796465988203;entries;8796101739584->8796110095424,8796098331712->8796110062656,8796097807424->8796107342912,8796097709120->8796106884160,8796097676352->8796106851392,8796097643584->8796106818624;false
8796100035656;;;;8796100985920->8796110423104,8796101772352->8796110390336,8796098331712->8796110062656,8796097807424->8796107342912,8796097709120->8796106884160,8796097676352->8796106851392,8796097643584->8796106818624;false
8796100985920;8796110423104;8796466053739;entries;8796101772352->8796110390336,8796098331712->8796110062656,8796097807424->8796107342912,8796097709120->8796106884160,8796097676352->8796106851392,8796097643584->8796106818624;false
8796100068424;;;;8796101018688->8796110455872,8796101772352->8796110390336,8796098331712->8796110062656,8796097807424->8796107342912,8796097709120->8796106884160,8796097676352->8796106851392,8796097643584->8796106818624;false
8796101018688;8796110455872;8796466086507;entries;8796101772352->8796110390336,8796098331712->8796110062656,8796097807424->8796107342912,8796097709120->8796106884160,8796097676352->8796106851392,8796097643584->8796106818624;false
8796100101192;;;;8796101051456->8796110488640,8796101772352->8796110390336,8796098331712->8796110062656,8796097807424->8796107342912,8796097709120->8796106884160,8796097676352->8796106851392,8796097643584->8796106818624;false
8796101051456;8796110488640;8796466119275;entries;8796101772352->8796110390336,8796098331712->8796110062656,8796097807424->8796107342912,8796097709120->8796106884160,8796097676352->8796106851392,8796097643584->8796106818624;false
8796100133960;;;;8796101084224->8796110521408,8796101772352->8796110390336,8796098331712->8796110062656,8796097807424->8796107342912,8796097709120->8796106884160,8796097676352->8796106851392,8796097643584->8796106818624;false
8796101084224;8796110521408;8796466152043;entries;8796101772352->8796110390336,8796098331712->8796110062656,8796097807424->8796107342912,8796097709120->8796106884160,8796097676352->8796106851392,8796097643584->8796106818624;false
8796097381448;;;;8796098331712->8796110062656,8796097807424->8796107342912,8796097709120->8796106884160,8796097676352->8796106851392,8796097643584->8796106818624;false
8796098331712;8796110062656;8796466217579;entries;8796097807424->8796107342912,8796097709120->8796106884160,8796097676352->8796106851392,8796097643584->8796106818624;false
8796100166728;;;;8796101116992->8796110619712,8796101805120->8796110586944,8796098364480->8796110554176,8796097807424->8796107342912,8796097709120->8796106884160,8796097676352->8796106851392,8796097643584->8796106818624;false
8796101116992;8796110619712;8796466250347;entries;8796101805120->8796110586944,8796098364480->8796110554176,8796097807424->8796107342912,8796097709120->8796106884160,8796097676352->8796106851392,8796097643584->8796106818624;false
8796100199496;;;;8796101149760->8796110652480,8796101805120->8796110586944,8796098364480->8796110554176,8796097807424->8796107342912,8796097709120->8796106884160,8796097676352->8796106851392,8796097643584->8796106818624;false
8796101149760;8796110652480;8796466283115;entries;8796101805120->8796110586944,8796098364480->8796110554176,8796097807424->8796107342912,8796097709120->8796106884160,8796097676352->8796106851392,8796097643584->8796106818624;false
8796100232264;;;;8796101182528->8796110685248,8796101805120->8796110586944,8796098364480->8796110554176,8796097807424->8796107342912,8796097709120->8796106884160,8796097676352->8796106851392,8796097643584->8796106818624;false
8796101182528;8796110685248;8796466315883;entries;8796101805120->8796110586944,8796098364480->8796110554176,8796097807424->8796107342912,8796097709120->8796106884160,8796097676352->8796106851392,8796097643584->8796106818624;false
8796100265032;;;;8796101215296->8796110718016,8796101805120->8796110586944,8796098364480->8796110554176,8796097807424->8796107342912,8796097709120->8796106884160,8796097676352->8796106851392,8796097643584->8796106818624;false
8796101215296;8796110718016;8796466348651;entries;8796101805120->8796110586944,8796098364480->8796110554176,8796097807424->8796107342912,8796097709120->8796106884160,8796097676352->8796106851392,8796097643584->8796106818624;false
8796100297800;;;;8796101248064->8796110750784,8796101805120->8796110586944,8796098364480->8796110554176,8796097807424->8796107342912,8796097709120->8796106884160,8796097676352->8796106851392,8796097643584->8796106818624;false
8796101248064;8796110750784;8796466381419;entries;8796101805120->8796110586944,8796098364480->8796110554176,8796097807424->8796107342912,8796097709120->8796106884160,8796097676352->8796106851392,8796097643584->8796106818624;false
8796100330568;;;;8796101280832->8796110816320,8796101837888->8796110783552,8796098364480->8796110554176,8796097807424->8796107342912,8796097709120->8796106884160,8796097676352->8796106851392,8796097643584->8796106818624;false
8796101280832;8796110816320;8796466446955;entries;8796101837888->8796110783552,8796098364480->8796110554176,8796097807424->8796107342912,8796097709120->8796106884160,8796097676352->8796106851392,8796097643584->8796106818624;false
8796100363336;;;;8796101313600->8796110849088,8796101837888->8796110783552,8796098364480->8796110554176,8796097807424->8796107342912,8796097709120->8796106884160,8796097676352->8796106851392,8796097643584->8796106818624;false
8796101313600;8796110849088;8796466479723;entries;8796101837888->8796110783552,8796098364480->8796110554176,8796097807424->8796107342912,8796097709120->8796106884160,8796097676352->8796106851392,8796097643584->8796106818624;false
8796100396104;;;;8796101346368->8796110881856,8796101837888->8796110783552,8796098364480->8796110554176,8796097807424->8796107342912,8796097709120->8796106884160,8796097676352->8796106851392,8796097643584->8796106818624;false
8796101346368;8796110881856;8796466512491;entries;8796101837888->8796110783552,8796098364480->8796110554176,8796097807424->8796107342912,8796097709120->8796106884160,8796097676352->8796106851392,8796097643584->8796106818624;false
8796100428872;;;;8796101379136->8796110914624,8796101837888->8796110783552,8796098364480->8796110554176,8796097807424->8796107342912,8796097709120->8796106884160,8796097676352->8796106851392,8796097643584->8796106818624;false
8796101379136;8796110914624;8796466545259;entries;8796101837888->8796110783552,8796098364480->8796110554176,8796097807424->8796107342912,8796097709120->8796106884160,8796097676352->8796106851392,8796097643584->8796106818624;false
8796100461640;;;;8796101411904->8796110947392,8796101837888->8796110783552,8796098364480->8796110554176,8796097807424->8796107342912,8796097709120->8796106884160,8796097676352->8796106851392,8796097643584->8796106818624;false
8796101411904;8796110947392;8796466578027;entries;8796101837888->8796110783552,8796098364480->8796110554176,8796097807424->8796107342912,8796097709120->8796106884160,8796097676352->8796106851392,8796097643584->8796106818624;false
8796100494408;;;;8796101444672->8796110980160,8796101837888->8796110783552,8796098364480->8796110554176,8796097807424->8796107342912,8796097709120->8796106884160,8796097676352->8796106851392,8796097643584->8796106818624;false
8796101444672;8796110980160;8796466610795;entries;8796101837888->8796110783552,8796098364480->8796110554176,8796097807424->8796107342912,8796097709120->8796106884160,8796097676352->8796106851392,8796097643584->8796106818624;false
8796097414216;;;;8796098364480->8796110554176,8796097807424->8796107342912,8796097709120->8796106884160,8796097676352->8796106851392,8796097643584->8796106818624;false
8796098364480;8796110554176;8796466676331;entries;8796097807424->8796107342912,8796097709120->8796106884160,8796097676352->8796106851392,8796097643584->8796106818624;false
8796100527176;;;;8796101968960->8796111078464,8796101870656->8796111045696,8796097840192->8796111012928,8796097709120->8796106884160,8796097676352->8796106851392,8796097643584->8796106818624;false
8796101968960;8796111078464;8796466741867;entries;8796101870656->8796111045696,8796097840192->8796111012928,8796097709120->8796106884160,8796097676352->8796106851392,8796097643584->8796106818624;false
8796100592712;;;;8796102034496->8796111176768,8796101903424->8796111144000,8796097840192->8796111012928,8796097709120->8796106884160,8796097676352->8796106851392,8796097643584->8796106818624;false
8796102034496;8796111176768;8796466872939;entries;8796101903424->8796111144000,8796097840192->8796111012928,8796097709120->8796106884160,8796097676352->8796106851392,8796097643584->8796106818624;false
8796100625480;;;;8796102067264->8796111209536,8796101903424->8796111144000,8796097840192->8796111012928,8796097709120->8796106884160,8796097676352->8796106851392,8796097643584->8796106818624;false
8796102067264;8796111209536;8796466905707;entries;8796101903424->8796111144000,8796097840192->8796111012928,8796097709120->8796106884160,8796097676352->8796106851392,8796097643584->8796106818624;false
8796100658248;;;;8796102100032->8796111275072,8796101936192->8796111242304,8796097840192->8796111012928,8796097709120->8796106884160,8796097676352->8796106851392,8796097643584->8796106818624;false
8796102100032;8796111275072;8796466971243;entries;8796101936192->8796111242304,8796097840192->8796111012928,8796097709120->8796106884160,8796097676352->8796106851392,8796097643584->8796106818624;false
8796100691016;;;;8796102132800->8796111307840,8796101936192->8796111242304,8796097840192->8796111012928,8796097709120->8796106884160,8796097676352->8796106851392,8796097643584->8796106818624;false
8796102132800;8796111307840;8796467004011;entries;8796101936192->8796111242304,8796097840192->8796111012928,8796097709120->8796106884160,8796097676352->8796106851392,8796097643584->8796106818624;false
8796100723784;;;;8796102165568->8796111340608,8796101936192->8796111242304,8796097840192->8796111012928,8796097709120->8796106884160,8796097676352->8796106851392,8796097643584->8796106818624;false
8796102165568;8796111340608;8796467036779;entries;8796101936192->8796111242304,8796097840192->8796111012928,8796097709120->8796106884160,8796097676352->8796106851392,8796097643584->8796106818624;false
8796100756552;;;;8796102198336->8796111373376,8796101936192->8796111242304,8796097840192->8796111012928,8796097709120->8796106884160,8796097676352->8796106851392,8796097643584->8796106818624;false
8796102198336;8796111373376;8796467069547;entries;8796101936192->8796111242304,8796097840192->8796111012928,8796097709120->8796106884160,8796097676352->8796106851392,8796097643584->8796106818624;false
