2022-10-21 05:53:02.667 INFO  (main) [   ] o.e.j.u.log Logging initialized @836ms to org.eclipse.jetty.util.log.Slf4jLog
2022-10-21 05:53:02.879 INFO  (main) [   ] o.e.j.s.Server jetty-9.4.44.v20210927; built: 2021-09-27T23:02:44.612Z; git: 8da83308eeca865e495e53ef315a249d63ba9332; jvm 11.0.17+8-LTS-sapmachine
2022-10-21 05:53:02.888 INFO  (main) [   ] o.e.j.d.p.ScanningAppProvider Deployment monitor [file:///home/trails/IdeaProjects/sap_commerce_2105/hybris/bin/modules/search-and-navigation/solrserver/resources/solr/8.11/server/server/contexts/] at interval 0
2022-10-21 05:53:03.021 INFO  (main) [   ] o.e.j.w.StandardDescriptorProcessor NO JSP Support for /solr, did not find org.apache.jasper.servlet.JspServlet
2022-10-21 05:53:03.028 INFO  (main) [   ] o.e.j.s.session DefaultSessionIdManager workerName=node0
2022-10-21 05:53:03.028 INFO  (main) [   ] o.e.j.s.session No SessionScavenger set, using defaults
2022-10-21 05:53:03.030 INFO  (main) [   ] o.e.j.s.session node0 Scavenging every 600000ms
2022-10-21 05:53:03.062 INFO  (main) [   ] o.a.s.u.c.SSLConfigurations Setting javax.net.ssl.keyStorePassword
2022-10-21 05:53:03.062 INFO  (main) [   ] o.a.s.u.c.SSLConfigurations Setting javax.net.ssl.trustStorePassword
2022-10-21 05:53:03.067 INFO  (main) [   ] o.a.s.s.SolrDispatchFilter Using logger factory org.apache.logging.slf4j.Log4jLoggerFactory
2022-10-21 05:53:03.069 INFO  (main) [   ] o.a.s.s.SolrDispatchFilter  ___      _       Welcome to Apache Solr™ version 8.11.1
2022-10-21 05:53:03.069 INFO  (main) [   ] o.a.s.s.SolrDispatchFilter / __| ___| |_ _   Starting in standalone mode on port 8983
2022-10-21 05:53:03.069 INFO  (main) [   ] o.a.s.s.SolrDispatchFilter \__ \/ _ \ | '_|  Install dir: /home/trails/IdeaProjects/sap_commerce_2105/hybris/bin/modules/search-and-navigation/solrserver/resources/solr/8.11/server
2022-10-21 05:53:03.070 INFO  (main) [   ] o.a.s.s.SolrDispatchFilter |___/\___/_|_|    Start time: 2022-10-21T05:53:03.070032Z
2022-10-21 05:53:03.089 INFO  (main) [   ] o.a.s.c.SolrPaths Using system property solr.solr.home: /home/trails/IdeaProjects/sap_commerce_2105/hybris/config/solr/instances/default
2022-10-21 05:53:03.089 INFO  (main) [   ] o.a.s.c.SolrXmlConfig Loading container configuration from /home/trails/IdeaProjects/sap_commerce_2105/hybris/config/solr/instances/default/solr.xml
2022-10-21 05:53:03.134 INFO  (main) [   ] o.a.s.c.SolrXmlConfig MBean server found: com.sun.jmx.mbeanserver.JmxMBeanServer@33fe57a9, but no JMX reporters were configured - adding default JMX reporter.
2022-10-21 05:53:03.572 INFO  (main) [   ] o.a.s.h.c.HttpShardHandlerFactory Host whitelist initialized: WhitelistHostChecker [whitelistHosts=null, whitelistHostCheckingEnabled=true]
2022-10-21 05:53:03.665 INFO  (main) [   ] o.e.j.u.s.SslContextFactory x509=X509@439b15f2(1,h=[localhost, hybris],a=[/127.0.0.1],w=[]) for Client@3a37a501[provider=null,keyStore=file:///home/trails/IdeaProjects/sap_commerce_2105/hybris/config/solr/instances/default/solr_client.p12,trustStore=file:///home/trails/IdeaProjects/sap_commerce_2105/hybris/config/solr/instances/default/solr.p12]
2022-10-21 05:53:03.698 WARN  (main) [   ] o.e.j.u.s.S.config No Client EndPointIdentificationAlgorithm configured for Client@3a37a501[provider=null,keyStore=file:///home/trails/IdeaProjects/sap_commerce_2105/hybris/config/solr/instances/default/solr_client.p12,trustStore=file:///home/trails/IdeaProjects/sap_commerce_2105/hybris/config/solr/instances/default/solr.p12]
2022-10-21 05:53:03.778 INFO  (main) [   ] o.e.j.u.s.SslContextFactory x509=X509@5740ff5e(1,h=[localhost, hybris],a=[/127.0.0.1],w=[]) for Client@4a901445[provider=null,keyStore=file:///home/trails/IdeaProjects/sap_commerce_2105/hybris/config/solr/instances/default/solr_client.p12,trustStore=file:///home/trails/IdeaProjects/sap_commerce_2105/hybris/config/solr/instances/default/solr.p12]
2022-10-21 05:53:03.781 WARN  (main) [   ] o.e.j.u.s.S.config No Client EndPointIdentificationAlgorithm configured for Client@4a901445[provider=null,keyStore=file:///home/trails/IdeaProjects/sap_commerce_2105/hybris/config/solr/instances/default/solr_client.p12,trustStore=file:///home/trails/IdeaProjects/sap_commerce_2105/hybris/config/solr/instances/default/solr.p12]
2022-10-21 05:53:03.811 INFO  (main) [   ] o.a.s.c.CoreContainer Initializing authorization plugin: solr.RuleBasedAuthorizationPlugin
2022-10-21 05:53:03.818 INFO  (main) [   ] o.a.s.c.CoreContainer Initializing authentication plugin: solr.BasicAuthPlugin
2022-10-21 05:53:03.923 INFO  (main) [   ] o.a.s.c.TransientSolrCoreCacheDefault Allocating transient core cache for max 2147483647 cores with initial capacity of 1024
2022-10-21 05:53:03.929 INFO  (main) [   ] o.a.s.h.a.MetricsHistoryHandler No .system collection, keeping metrics history in memory.
2022-10-21 05:53:03.977 INFO  (main) [   ] o.a.s.m.r.SolrJmxReporter JMX monitoring for 'solr.node' (registry 'solr.node') enabled at server: com.sun.jmx.mbeanserver.JmxMBeanServer@33fe57a9
2022-10-21 05:53:03.977 INFO  (main) [   ] o.a.s.m.r.SolrJmxReporter JMX monitoring for 'solr.jvm' (registry 'solr.jvm') enabled at server: com.sun.jmx.mbeanserver.JmxMBeanServer@33fe57a9
2022-10-21 05:53:03.978 INFO  (main) [   ] o.a.s.m.r.SolrJmxReporter JMX monitoring for 'solr.jetty' (registry 'solr.jetty') enabled at server: com.sun.jmx.mbeanserver.JmxMBeanServer@33fe57a9
2022-10-21 05:53:03.996 INFO  (main) [   ] o.a.s.c.CorePropertiesLocator Found 0 core definitions underneath /home/trails/IdeaProjects/sap_commerce_2105/hybris/data/solr/instances/default
2022-10-21 05:53:04.033 INFO  (main) [   ] o.e.j.s.h.ContextHandler Started o.e.j.w.WebAppContext@54534abf{/solr,file:///home/trails/IdeaProjects/sap_commerce_2105/hybris/bin/modules/search-and-navigation/solrserver/resources/solr/8.11/server/server/solr-webapp/webapp/,AVAILABLE}{/home/trails/IdeaProjects/sap_commerce_2105/hybris/bin/modules/search-and-navigation/solrserver/resources/solr/8.11/server/server/solr-webapp/webapp}
2022-10-21 05:53:04.043 INFO  (main) [   ] o.e.j.u.s.SslContextFactory x509=X509@10850d17(1,h=[solr, solr.local, localhost, 127.0.0.1.xip.io, hybris],a=[/127.0.0.1],w=[127.0.0.1.xip.io]) for Server@34451ed8[provider=null,keyStore=file:///home/trails/IdeaProjects/sap_commerce_2105/hybris/config/solr/instances/default/solr.p12,trustStore=file:///home/trails/IdeaProjects/sap_commerce_2105/hybris/config/solr/instances/default/solr.p12]
2022-10-21 05:53:04.052 INFO  (main) [   ] o.e.j.s.AbstractConnector Started ServerConnector@5cad8b7d{SSL, (ssl, alpn, h2, http/1.1)}{0.0.0.0:8983}
2022-10-21 05:53:04.052 INFO  (main) [   ] o.e.j.s.Server Started @2222ms
2022-10-21 09:47:00.474 INFO  (qtp1930837320-21) [   ] o.a.s.s.HttpSolrCall [admin] webapp=null path=/admin/info/system params={wt=json} status=0 QTime=45
2022-10-21 09:47:00.816 INFO  (ShutdownMonitor) [   ] o.e.j.s.AbstractConnector Stopped ServerConnector@5cad8b7d{SSL, (ssl, alpn, h2, http/1.1)}{0.0.0.0:8983}
2022-10-21 09:47:00.817 INFO  (ShutdownMonitor) [   ] o.e.j.s.session node0 Stopped scavenging
2022-10-21 09:47:00.823 INFO  (ShutdownMonitor) [   ] o.a.s.c.CoreContainer Shutting down CoreContainer instance=956429999
2022-10-21 09:47:00.832 INFO  (ShutdownMonitor) [   ] o.a.s.m.SolrMetricManager Closing metric reporters for registry=solr.node tag=null
2022-10-21 09:47:00.833 INFO  (ShutdownMonitor) [   ] o.a.s.m.r.SolrJmxReporter Closing reporter [org.apache.solr.metrics.reporters.SolrJmxReporter@297c9a9b: rootName = null, domain = solr.node, service url = null, agent id = null] for registry solr.node/com.codahale.metrics.MetricRegistry@a70b8b1
2022-10-21 09:47:00.839 INFO  (ShutdownMonitor) [   ] o.a.s.m.SolrMetricManager Closing metric reporters for registry=solr.jvm tag=null
2022-10-21 09:47:00.839 INFO  (ShutdownMonitor) [   ] o.a.s.m.r.SolrJmxReporter Closing reporter [org.apache.solr.metrics.reporters.SolrJmxReporter@51f18e31: rootName = null, domain = solr.jvm, service url = null, agent id = null] for registry solr.jvm/com.codahale.metrics.MetricRegistry@c6ba0ef
2022-10-21 09:47:00.841 INFO  (ShutdownMonitor) [   ] o.a.s.m.SolrMetricManager Closing metric reporters for registry=solr.jetty tag=null
2022-10-21 09:47:00.841 INFO  (ShutdownMonitor) [   ] o.a.s.m.r.SolrJmxReporter Closing reporter [org.apache.solr.metrics.reporters.SolrJmxReporter@60ed12e8: rootName = null, domain = solr.jetty, service url = null, agent id = null] for registry solr.jetty/com.codahale.metrics.MetricRegistry@2810925b
2022-10-21 09:47:00.863 INFO  (ShutdownMonitor) [   ] o.e.j.s.h.ContextHandler Stopped o.e.j.w.WebAppContext@54534abf{/solr,null,STOPPED}{/home/trails/IdeaProjects/sap_commerce_2105/hybris/bin/modules/search-and-navigation/solrserver/resources/solr/8.11/server/server/solr-webapp/webapp}
