[
    {
        "pk": 3,
        "model": "gcloudc.polymodelbase",
        "fields": {
          "x": 1
        }
      },
      {
        "pk": 3,
        "model": "gcloudc.polymodelleaf",
        "fields": {
          "y": 1
        }
      }
]