<?xml version="1.0" encoding="UTF-8" standalone="no"?>
<!-- Created with Inkscape (http://www.inkscape.org/) -->

<svg
   xmlns:dc="http://purl.org/dc/elements/1.1/"
   xmlns:cc="http://creativecommons.org/ns#"
   xmlns:rdf="http://www.w3.org/1999/02/22-rdf-syntax-ns#"
   xmlns:svg="http://www.w3.org/2000/svg"
   xmlns="http://www.w3.org/2000/svg"
   xmlns:sodipodi="http://sodipodi.sourceforge.net/DTD/sodipodi-0.dtd"
   xmlns:inkscape="http://www.inkscape.org/namespaces/inkscape"
   width="65.962097mm"
   height="65.962593mm"
   viewBox="0 0 65.962097 65.962593"
   version="1.1"
   id="svg104"
   inkscape:version="0.92.4 (5da689c313, 2019-01-14)"
   sodipodi:docname="logokeimling.svg">
  <defs
     id="defs98">
    <clipPath
       id="cp1">
      <path
         transform="matrix(1,0,0,-1,0,595.28)"
         d="M 0,595.28 H 841.89 V 0 H 0 Z"
         id="path112"
         inkscape:connector-curvature="0" />
    </clipPath>
  </defs>
  <sodipodi:namedview
     id="base"
     pagecolor="#ffffff"
     bordercolor="#666666"
     borderopacity="1.0"
     inkscape:pageopacity="0.0"
     inkscape:pageshadow="2"
     inkscape:zoom="0.94316065"
     inkscape:cx="-73.367291"
     inkscape:cy="179.4678"
     inkscape:document-units="mm"
     inkscape:current-layer="g125"
     showgrid="false"
     inkscape:window-width="1920"
     inkscape:window-height="1017"
     inkscape:window-x="-8"
     inkscape:window-y="-8"
     inkscape:window-maximized="1" />
  <metadata
     id="metadata101">
    <rdf:RDF>
      <cc:Work
         rdf:about="">
        <dc:format>image/svg+xml</dc:format>
        <dc:type
           rdf:resource="http://purl.org/dc/dcmitype/StillImage" />
        <dc:title></dc:title>
      </cc:Work>
    </rdf:RDF>
  </metadata>
  <g
     inkscape:label="Ebene 1"
     inkscape:groupmode="layer"
     id="layer1"
     transform="translate(-81.167762,-130.35493)">
    <g
       transform="matrix(0.49112927,0,0,0.49112927,18.643814,22.156537)"
       style="enable-background:new"
       clip-path="url(#cp1)"
       id="g125">
      <path
         transform="matrix(1,0,0,-1,261.6135,287.45933)"
         d="m 0,0 c 0,-37.088 -30.066,-67.154 -67.154,-67.154 -37.088,0 -67.153,30.066 -67.153,67.154 0,37.088 30.065,67.154 67.153,67.154 C -30.066,67.154 0,37.088 0,0"
         id="path115"
         inkscape:connector-curvature="0"
         style="fill:#83b341" />
      <path
         transform="matrix(1,0,0,-1,201.2038,375.04234)"
         d="m 0,0 c 0,4.731 -3.345,27.963 -0.379,42.507 2.896,14.199 14.616,27.368 23.322,40.58 9.167,13.912 8.887,36.854 -4.747,48.141 -12.794,10.592 -33.901,9.223 -47.021,-1.245 -10.306,-8.224 -18.046,-25.768 -10.376,-41.68 7.319,-15.186 21.325,-17.126 31.04,-13.781 9.327,3.212 17.049,12.453 20.47,21.006 2.408,6.02 3.063,22.61 -5.282,26.781 -9.002,4.5 -20.532,1.356 -28.933,-9.686 -11.825,-15.543 -2.892,-30.885 -2.892,-30.885 0,0 -6.777,3.889 -9.31,13.651 -2.937,11.318 2.501,23.796 10.189,29.813 8.68,6.793 25.167,11.304 38.117,0.629 C 23.507,118.158 25.48,99.23 16.323,86.223 0.268,63.418 -9.365,57.664 -10.899,34.126 -11.629,22.937 -10.548,2.206 -10.333,0.916 -10.118,-0.375 0,0 0,0"
         id="path117"
         inkscape:connector-curvature="0"
         style="fill:#ffffff" />
      <path
         transform="matrix(1,0,0,-1,201.2038,375.04234)"
         stroke-miterlimit="10"
         d="m 0,0 c 0,4.731 -3.345,27.963 -0.379,42.507 2.896,14.199 14.616,27.368 23.322,40.58 9.167,13.912 8.887,36.854 -4.747,48.141 -12.794,10.592 -33.901,9.223 -47.021,-1.245 -10.306,-8.224 -18.046,-25.768 -10.376,-41.68 7.319,-15.186 21.325,-17.126 31.04,-13.781 9.327,3.212 17.049,12.453 20.47,21.006 2.408,6.02 3.063,22.61 -5.282,26.781 -9.002,4.5 -20.532,1.356 -28.933,-9.686 -11.825,-15.543 -2.892,-30.885 -2.892,-30.885 0,0 -6.777,3.889 -9.31,13.651 -2.937,11.318 2.501,23.796 10.189,29.813 8.68,6.793 25.167,11.304 38.117,0.629 C 23.507,118.158 25.48,99.23 16.323,86.223 0.268,63.418 -9.365,57.664 -10.899,34.126 -11.629,22.937 -10.548,2.206 -10.333,0.916 -10.118,-0.375 0,0 0,0 Z"
         id="path119"
         inkscape:connector-curvature="0"
         style="fill:none;stroke:#ffffff;stroke-width:1;stroke-linecap:butt;stroke-linejoin:miter;stroke-miterlimit:10" />
      <path
         transform="matrix(1,0,0,-1,197.2426,279.66233)"
         d="m 0,0 c -7.01,-8.549 -15.13,-13.154 -15.13,-13.154 0,0 9.768,-2.53 20.251,10.753 6.868,8.703 4.041,20.396 4.041,20.396 C 9.162,17.995 5.734,6.993 0,0"
         id="path121"
         inkscape:connector-curvature="0"
         style="fill:#83b341" />
      <path
         transform="matrix(1,0,0,-1,197.2426,279.66233)"
         stroke-miterlimit="10"
         d="m 0,0 c -7.01,-8.549 -15.13,-13.154 -15.13,-13.154 0,0 9.768,-2.53 20.251,10.753 6.868,8.703 4.041,20.396 4.041,20.396 C 9.162,17.995 5.734,6.993 0,0 Z"
         id="path123"
         inkscape:connector-curvature="0"
         style="fill:none;stroke:#83b341;stroke-width:1;stroke-linecap:butt;stroke-linejoin:miter;stroke-miterlimit:10" />
    </g>
  </g>
</svg>
