{
    "version": "v1.0.0",
    "entity": {
        "type": "group",
        "role": "other",
        "name": "The postmarketOS team",
        "email": "team@postmarketOS.org",
        "phone": "",
        "description": "We are a group of close to 50 passionate developers who, together with our fantastic community, have been working to bring you postmarketOS since 2017. We develop free and open-source software to extend the life of consumer electronics. We believe that by empowering people to have full control of their devices we promote a healthier and more sustainable society.",
        "webpageUrl": {
            "url": "https://postmarketos.org/team/"
        }
    },
    "projects":
    [{
        "guid": "postmarketos",
        "name": "postmarketOS",
        "description": "postmarketOS is an operating system primarily for smartphones. We choose our software components carefully and work upstream-first to keep devices useful with up-to-date software for years even after the original vendors stopped supporting them (we use e.g. mainline Linux instead of Android-specific forks where possible). We aim to do better than the original software our devices shipped with: we don't ship anti-features such as targeted advertising, and consider user-ownership to be at the foundation of sustainable software (you should be able to modify parts of your system with reasonable effort). postmarketOS is predominantly used by our exciting community of enthusiasts, who have ported the project to more than 500 devices, and of which more than 700 people have contributed to our primary git repository (pmaports.git). All funding will be used to continue expanding and stabilizing postmarketOS, to make it usable for ordinary people while ensuring that it remains easy for power users to modify.",
        "webpageUrl": {
            "url": "https://postmarketos.org/"
        },
        "repositoryUrl": {
            "url": "https://gitlab.postmarketos.org/postmarketOS/pmaports",
            "wellKnown": "https://gitlab.postmarketos.org/postmarketOS/pmaports/-/raw/master/.well-known/funding-manifest-urls"
        },
        "licenses": ["spdx:GPL-3.0-or-later"],
        "tags": [
            "linux",
            "linuxmobile",
            "operating-system",
            "postmarketos",
            "privacy",
            "smartphone"
        ]
    }],
    "funding": {
        "channels": [
            {
                "guid": "opencollective",
                "type": "payment-provider",
                "address": "https://opencollective.com/postmarketOS",
                "description": "Transparent donation platform and fiscal hosting provider."
            }
        ],
        "plans": [{
            "guid": "sponsor",
            "status": "active",
            "name": "Sponsor Us",
            "description": "Help fund the independent developers we contract or one of the full or part time members of the team.",
            "amount": 4100,
            "currency": "EUR",
            "frequency": "monthly",
            "channels": ["opencollective"]
        },
        {
            "guid": "grant-small",
            "status": "active",
            "name": "Small-size grants",
            "description": "Small grants close a gap in the project and its ecosystem, allowing to find upstream solutions to small problems.",
            "amount": 10000,
            "currency": "EUR",
            "frequency": "one-time",
            "channels": ["opencollective"]
        },
        {
            "guid": "grant-big",
            "status": "active",
            "name": "Big-size grants",
            "description": "Big grants allow us to pay developers to do more challenging work towards making postmarketOS usable for everybody (adding or extending important features, fixing stability issues long-term, etc.).",
            "amount": 50000,
            "currency": "EUR",
            "frequency": "one-time",
            "channels": ["opencollective"]
        }],
        "history": [
            {"year": 2024, "income": 13680, "expenses": 3518, "taxes": 0, "currency": "EUR", "description": "Our first year using opencollective to accept donations."}
        ]
    }
}
