<?xml version="1.0" encoding="UTF-8" standalone="no"?>
<!-- Created with enve https://maurycyliebner.github.io -->

<svg xmlns:xlink="http://www.w3.org/1999/xlink" xmlns="http://www.w3.org/2000/svg" viewBox="0 0 102 88">
 <g transform="translate(66.8994 78.9512)">
  <g transform="translate(1.5941 -5.49246)">
   <g transform="rotate(0)">
    <g transform="scale(1 1)">
     <g transform="skewX(0) skewY(0)">
      <g opacity="1" transform="translate(-66.8994 -78.9512)">
       <path stroke="none" stroke-width="1.03484" d="M73.6982 65.1055C73.6982 65.1055 69.9111 75.6699 69.9111 75.6699C69.9111 75.6699 34.2432 75.6699 34.2432 75.6699C34.2432 75.6699 41.499 84.2344 41.499 84.2344C41.499 84.2344 34.2432 92.7969 34.2432 92.7969C34.2432 92.7969 99.5557 92.7969 99.5557 92.7969C99.5557 92.7969 84.7217 67.1035 84.7217 67.1035C84.7217 67.1035 73.6982 65.1055 73.6982 65.1055Z">
        <animate dur="1.66667s" values="#008443;#008443;#00773c;#006a36;#005c2f;#004f28;#004222;#00351b;#002814;#001a0d;#000d07;#000000;#000d07;#001a0d;#002814;#00351b;#004222;#004f28;#005c2f;#006a36;#00773c;#008443;#008443" calcMode="linear" repeatCount="indefinite" attributeName="fill" keyTimes="0;0.1;0.12;0.14;0.16;0.18;0.2;0.22;0.24;0.26;0.28;0.3;0.32;0.34;0.36;0.38;0.4;0.42;0.44;0.46;0.48;0.5;1"/>
       </path>
      </g>
     </g>
    </g>
   </g>
  </g>
 </g>
 <g transform="translate(23.3066 64.5381)">
  <g transform="translate(1.30855 -5.49246)">
   <g transform="rotate(0)">
    <g transform="scale(1 1)">
     <g transform="skewX(0) skewY(0)">
      <g opacity="1" transform="translate(-23.3066 -64.5381)">
       <path stroke="none" stroke-width="1.03484" d="M32.2529 36.2461C32.2529 36.2461 -0.374023 92.7559 -0.374023 92.7559C-0.374023 92.7559 -0.444335 92.7969 -0.444335 92.7969C-0.444335 92.7969 -0.39746 92.7969 -0.39746 92.7969C-0.39746 92.7969 -0.416991 92.8301 -0.416991 92.8301C-0.416991 92.8301 -0.36035 92.7969 -0.36035 92.7969C-0.36035 92.7969 29.251 92.7969 29.251 92.7969C29.251 92.7969 36.5068 84.2344 36.5068 84.2344C36.5068 84.2344 29.251 75.6699 29.251 75.6699C29.251 75.6699 47.0576 44.8125 47.0576 44.8125C47.0576 44.8125 36.042 46.8105 36.042 46.8105C36.042 46.8105 32.2529 36.2461 32.2529 36.2461Z">
        <animate dur="1.66667s" values="#008443;#008443;#00773c;#006a36;#005c2f;#004f28;#004222;#00351b;#002814;#001a0d;#000d07;#000000;#000d07;#001a0d;#002814;#00351b;#004222;#004f28;#005c2f;#006a36;#00773c;#008443;#008443" calcMode="linear" repeatCount="indefinite" attributeName="fill" keyTimes="0;0.5;0.52;0.54;0.56;0.58;0.6;0.62;0.64;0.66;0.68;0.7;0.72;0.74;0.76;0.78;0.8;0.82;0.84;0.86;0.88;0.9;1"/>
       </path>
      </g>
     </g>
    </g>
   </g>
  </g>
 </g>
 <g transform="translate(58.4873 38.7705)">
  <g transform="translate(1.3232 -5.20692)">
   <g transform="rotate(0)">
    <g transform="scale(1 1)">
     <g transform="skewX(0) skewY(0)">
      <g opacity="1" transform="translate(-58.4873 -38.7705)">
       <path stroke="none" stroke-width="1.03484" d="M49.5557 6.19336C49.5557 6.19336 49.5557 6.27539 49.5557 6.27539C49.5557 6.27539 34.749 31.9238 34.749 31.9238C34.749 31.9238 38.5361 42.4883 38.5361 42.4883C38.5361 42.4883 49.5518 40.4922 49.5518 40.4922C49.5518 40.4922 49.5557 40.4863 49.5557 40.4863C49.5557 40.4863 49.581 40.4863 49.581 40.4863C49.581 40.4863 67.415 71.3476 67.415 71.3476C67.415 71.3476 71.2021 60.7812 71.2021 60.7812C71.2021 60.7812 82.2256 62.7812 82.2256 62.7812C82.2256 62.7812 49.583 6.24019 49.583 6.24019C49.583 6.24019 49.583 6.22848 49.583 6.22848C49.583 6.22848 49.5791 6.23433 49.5791 6.23433C49.5791 6.23433 49.5557 6.19336 49.5557 6.19336Z">
        <animate dur="1.66667s" values="#008443;#008443;#00773c;#006a36;#005c2f;#004f28;#004222;#00351b;#002814;#001a0d;#000d07;#000000;#000d07;#001a0d;#002814;#00351b;#004222;#004f28;#005c2f;#006a36;#00773c;#008443;#008443" calcMode="linear" repeatCount="indefinite" attributeName="fill" keyTimes="0;0.3;0.32;0.34;0.36;0.38;0.4;0.42;0.44;0.46;0.48;0.5;0.52;0.54;0.56;0.58;0.6;0.62;0.64;0.66;0.68;0.7;1"/>
       </path>
      </g>
     </g>
    </g>
   </g>
  </g>
 </g>
 <defs/>
</svg>
