<?xml version="1.0" encoding="UTF-8" standalone="no"?>
<!-- Created with Inkscape (http://www.inkscape.org/) -->

<svg
   xmlns:dc="http://purl.org/dc/elements/1.1/"
   xmlns:cc="http://creativecommons.org/ns#"
   xmlns:rdf="http://www.w3.org/1999/02/22-rdf-syntax-ns#"
   xmlns:svg="http://www.w3.org/2000/svg"
   xmlns="http://www.w3.org/2000/svg"
   xmlns:sodipodi="http://sodipodi.sourceforge.net/DTD/sodipodi-0.dtd"
   xmlns:inkscape="http://www.inkscape.org/namespaces/inkscape"
   width="210mm"
   height="297mm"
   viewBox="0 0 210 297"
   version="1.1"
   id="svg8"
   inkscape:export-filename="/tmp/bitmap.png"
   inkscape:export-xdpi="899.93329"
   inkscape:export-ydpi="899.93329"
   inkscape:version="0.92.2 2405546, 2018-03-11"
   sodipodi:docname="postmarketOS-tshirt.svg">
  <defs
     id="defs2" />
  <sodipodi:namedview
     id="base"
     pagecolor="#ffffff"
     bordercolor="#666666"
     borderopacity="1.0"
     inkscape:pageopacity="0.0"
     inkscape:pageshadow="2"
     inkscape:zoom="0.7"
     inkscape:cx="-409.65017"
     inkscape:cy="658.27911"
     inkscape:document-units="mm"
     inkscape:current-layer="layer2"
     showgrid="false"
     inkscape:window-width="1920"
     inkscape:window-height="1011"
     inkscape:window-x="1280"
     inkscape:window-y="0"
     inkscape:window-maximized="1" />
  <metadata
     id="metadata5">
    <rdf:RDF>
      <cc:Work
         rdf:about="">
        <dc:format>image/svg+xml</dc:format>
        <dc:type
           rdf:resource="http://purl.org/dc/dcmitype/StillImage" />
        <dc:title />
      </cc:Work>
    </rdf:RDF>
  </metadata>
  <g
     inkscape:label="logo"
     inkscape:groupmode="layer"
     id="layer1"
     style="display:inline">
    <g
       id="g4586"
       transform="matrix(-1.0239208,0,0,-1.0239208,156.19604,107.36488)">
      <polygon
         id="polygon4576"
         points="29.7,17.5 25.9,27.8 15,26 0,0 65,0 58,8.5 65,17 29.8,17 "
         style="fill:#009900" />
      <g
         id="g4580"
         transform="rotate(120,50,28.867513)">
        <polygon
           id="polygon4578"
           points="58,8.5 65,17 29.8,17 29.7,17.5 25.9,27.8 15,26 0,0 65,0 "
           style="fill:#009900" />
      </g>
      <g
         id="g4584"
         transform="rotate(-120,50,28.867513)">
        <polygon
           id="polygon4582"
           points="58,8.5 65,17 29.8,17 29.7,17.5 25.9,27.8 15,26 0,0 65,0 "
           style="fill:#009900" />
      </g>
    </g>
  </g>
  <g
     inkscape:groupmode="layer"
     id="layer2"
     inkscape:label="text"
     style="display:inline">
    <text
       xml:space="preserve"
       style="font-style:normal;font-variant:normal;font-weight:normal;font-stretch:normal;font-size:5.39853811px;line-height:5.06112957px;font-family:pmos;-inkscape-font-specification:pmos;letter-spacing:0px;word-spacing:0px;fill:#000000;fill-opacity:1;stroke:none;stroke-width:0.20244518px;stroke-linecap:butt;stroke-linejoin:miter;stroke-opacity:1"
       x="46.939358"
       y="123.63646"
       id="text4604"><tspan
         sodipodi:role="line"
         id="tspan4602"
         x="46.939358"
         y="123.63646"
         style="font-style:normal;font-variant:normal;font-weight:normal;font-stretch:normal;font-size:16.19561386px;line-height:5.06113005px;font-family:'DejaVu Sans';-inkscape-font-specification:'DejaVu Sans';stroke-width:0.20244518px">postmarketOS</tspan></text>
  </g>
</svg>
