layer at (0,0) size 785x1098
  RenderView at (0,0) size 785x600
layer at (0,0) size 785x1098
  RenderBlock {HTML} at (0,0) size 785x1098
    RenderBody {BODY} at (8,8) size 769x584
      RenderBlock (floating) {DIV} at (0,0) size 352x964 [border: (1px solid #FF0000)]
        RenderBlock (anonymous) at (1,1) size 350x14
          RenderText {#text} at (0,-1) size 181x15
            text run at (0,-1) width 181: "Plain textarea with little content"
        RenderBlock {DIV} at (1,15) size 352x47 [border: (1px solid #FF0000)]
          RenderText {#text} at (1,31) size 14x15
            text run at (1,31) width 14: "A "
          RenderText {#text} at (215,31) size 14x15
            text run at (215,31) width 14: " B"
        RenderBlock (anonymous) at (1,62) size 350x14
          RenderText {#text} at (0,-1) size 77x15
            text run at (0,-1) width 77: "Plain textarea"
        RenderBlock {DIV} at (1,76) size 352x47 [border: (1px solid #FF0000)]
          RenderText {#text} at (1,31) size 14x15
            text run at (1,31) width 14: "A "
          RenderText {#text} at (215,31) size 14x15
            text run at (215,31) width 14: " B"
        RenderBlock (anonymous) at (1,123) size 350x14
          RenderText {#text} at (0,-1) size 97x15
            text run at (0,-1) width 97: "Disabled textarea"
        RenderBlock {DIV} at (1,137) size 352x47 [border: (1px solid #FF0000)]
          RenderText {#text} at (1,31) size 14x15
            text run at (1,31) width 14: "A "
          RenderText {#text} at (215,31) size 14x15
            text run at (215,31) width 14: " B"
        RenderBlock (anonymous) at (1,184) size 350x14
          RenderText {#text} at (0,-1) size 123x15
            text run at (0,-1) width 123: "style=\"padding:10px\""
        RenderBlock {DIV} at (1,198) size 352x63 [border: (1px solid #FF0000)]
          RenderText {#text} at (1,47) size 14x15
            text run at (1,47) width 14: "A "
          RenderText {#text} at (231,47) size 14x15
            text run at (231,47) width 14: " B"
        RenderBlock (anonymous) at (1,261) size 350x14
          RenderText {#text} at (0,-1) size 116x15
            text run at (0,-1) width 116: "style=\"padding:0px\""
        RenderBlock {DIV} at (1,275) size 352x43 [border: (1px solid #FF0000)]
          RenderText {#text} at (1,27) size 14x15
            text run at (1,27) width 14: "A "
          RenderText {#text} at (211,27) size 14x15
            text run at (211,27) width 14: " B"
        RenderBlock (anonymous) at (1,318) size 350x14
          RenderText {#text} at (0,-1) size 118x15
            text run at (0,-1) width 118: "style=\"margin:10px\""
        RenderBlock {DIV} at (1,332) size 352x67 [border: (1px solid #FF0000)]
          RenderText {#text} at (1,51) size 14x15
            text run at (1,51) width 14: "A "
          RenderText {#text} at (235,51) size 14x15
            text run at (235,51) width 14: " B"
        RenderBlock (anonymous) at (1,399) size 350x14
          RenderText {#text} at (0,-1) size 111x15
            text run at (0,-1) width 111: "style=\"margin:0px\""
        RenderBlock {DIV} at (1,413) size 352x47 [border: (1px solid #FF0000)]
          RenderText {#text} at (1,31) size 14x15
            text run at (1,31) width 14: "A "
          RenderText {#text} at (215,31) size 14x15
            text run at (215,31) width 14: " B"
        RenderBlock (anonymous) at (1,460) size 350x14
          RenderText {#text} at (0,-1) size 37x15
            text run at (0,-1) width 37: "cols=3"
        RenderBlock {DIV} at (1,474) size 352x47 [border: (1px solid #FF0000)]
          RenderText {#text} at (1,31) size 14x15
            text run at (1,31) width 14: "A "
          RenderText {#text} at (62,31) size 14x15
            text run at (62,31) width 14: " B"
        RenderBlock (anonymous) at (1,521) size 350x14
          RenderText {#text} at (0,-1) size 42x15
            text run at (0,-1) width 42: "rows=3"
        RenderBlock {DIV} at (1,535) size 352x65 [border: (1px solid #FF0000)]
          RenderText {#text} at (1,49) size 14x15
            text run at (1,49) width 14: "A "
          RenderText {#text} at (215,49) size 14x15
            text run at (215,49) width 14: " B"
        RenderBlock (anonymous) at (1,600) size 350x14
          RenderText {#text} at (0,-1) size 44x15
            text run at (0,-1) width 44: "cols=10"
        RenderBlock {DIV} at (1,614) size 352x47 [border: (1px solid #FF0000)]
          RenderText {#text} at (1,31) size 14x15
            text run at (1,31) width 14: "A "
          RenderText {#text} at (125,31) size 14x15
            text run at (125,31) width 14: " B"
        RenderBlock (anonymous) at (1,661) size 350x14
          RenderText {#text} at (0,-1) size 49x15
            text run at (0,-1) width 49: "rows=10"
        RenderBlock {DIV} at (1,675) size 352x191 [border: (1px solid #FF0000)]
          RenderText {#text} at (1,175) size 14x15
            text run at (1,175) width 14: "A "
          RenderText {#text} at (215,175) size 14x15
            text run at (215,175) width 14: " B"
        RenderBlock (anonymous) at (1,866) size 350x14
          RenderText {#text} at (0,-1) size 83x15
            text run at (0,-1) width 83: "cols=5 rows=4"
        RenderBlock {DIV} at (1,880) size 352x83 [border: (1px solid #FF0000)]
          RenderText {#text} at (1,67) size 14x15
            text run at (1,67) width 14: "A "
          RenderText {#text} at (80,67) size 14x15
            text run at (80,67) width 14: " B"
      RenderBlock (floating) {DIV} at (352,0) size 352x1090 [border: (1px solid #FF0000)]
        RenderBlock (anonymous) at (1,1) size 350x14
          RenderText {#text} at (0,-1) size 110x15
            text run at (0,-1) width 110: "style=\"width:60px\""
        RenderBlock {DIV} at (1,15) size 352x47 [border: (1px solid #FF0000)]
          RenderText {#text} at (1,31) size 14x15
            text run at (1,31) width 14: "A "
          RenderText {#text} at (74,31) size 14x15
            text run at (74,31) width 14: " B"
        RenderBlock (anonymous) at (1,62) size 350x14
          RenderText {#text} at (0,-1) size 191x15
            text run at (0,-1) width 191: "style=\"width:60px;padding:20px\""
        RenderBlock {DIV} at (1,76) size 352x83 [border: (1px solid #FF0000)]
          RenderText {#text} at (1,67) size 14x15
            text run at (1,67) width 14: "A "
          RenderText {#text} at (74,67) size 14x15
            text run at (74,67) width 14: " B"
        RenderBlock (anonymous) at (1,159) size 350x14
          RenderText {#text} at (0,-1) size 170x15
            text run at (0,-1) width 170: "style=\"width:60px;padding:0\""
        RenderBlock {DIV} at (1,173) size 352x43 [border: (1px solid #FF0000)]
          RenderText {#text} at (1,27) size 14x15
            text run at (1,27) width 14: "A "
          RenderText {#text} at (74,27) size 14x15
            text run at (74,27) width 14: " B"
        RenderBlock (anonymous) at (1,216) size 350x14
          RenderText {#text} at (0,-1) size 113x15
            text run at (0,-1) width 113: "style=\"height:60px\""
        RenderBlock {DIV} at (1,230) size 352x65 [border: (1px solid #FF0000)]
          RenderText {#text} at (1,49) size 14x15
            text run at (1,49) width 14: "A "
          RenderText {#text} at (215,49) size 14x15
            text run at (215,49) width 14: " B"
        RenderBlock (anonymous) at (1,295) size 350x14
          RenderText {#text} at (0,-1) size 181x15
            text run at (0,-1) width 181: "style=\"width:60px;height:60px\""
        RenderBlock {DIV} at (1,309) size 352x65 [border: (1px solid #FF0000)]
          RenderText {#text} at (1,49) size 14x15
            text run at (1,49) width 14: "A "
          RenderText {#text} at (74,49) size 14x15
            text run at (74,49) width 14: " B"
        RenderBlock (anonymous) at (1,374) size 350x14
          RenderText {#text} at (0,-1) size 139x15
            text run at (0,-1) width 139: "style=\"overflow:hidden\""
        RenderBlock {DIV} at (1,388) size 352x47 [border: (1px solid #FF0000)]
          RenderText {#text} at (1,31) size 14x15
            text run at (1,31) width 14: "A "
          RenderText {#text} at (200,31) size 14x15
            text run at (200,31) width 14: " B"
        RenderBlock (anonymous) at (1,435) size 350x14
          RenderText {#text} at (0,-1) size 132x15
            text run at (0,-1) width 132: "style=\"overflow:scroll\""
        RenderBlock {DIV} at (1,449) size 352x62 [border: (1px solid #FF0000)]
          RenderText {#text} at (1,46) size 14x15
            text run at (1,46) width 14: "A "
          RenderText {#text} at (215,46) size 14x15
            text run at (215,46) width 14: " B"
        RenderBlock (anonymous) at (1,511) size 350x14
          RenderText {#text} at (0,-1) size 278x15
            text run at (0,-1) width 278: "style=\"overflow:hidden;width:60px;height:60px\""
        RenderBlock {DIV} at (1,525) size 352x65 [border: (1px solid #FF0000)]
          RenderText {#text} at (1,49) size 14x15
            text run at (1,49) width 14: "A "
          RenderText {#text} at (74,49) size 14x15
            text run at (74,49) width 14: " B"
        RenderBlock (anonymous) at (1,590) size 350x14
          RenderText {#text} at (0,-1) size 271x15
            text run at (0,-1) width 271: "style=\"overflow:scroll;width:60px;height:60px\""
        RenderBlock {DIV} at (1,604) size 352x65 [border: (1px solid #FF0000)]
          RenderText {#text} at (1,49) size 14x15
            text run at (1,49) width 14: "A "
          RenderText {#text} at (74,49) size 14x15
            text run at (74,49) width 14: " B"
        RenderBlock (anonymous) at (1,669) size 350x14
          RenderText {#text} at (0,-1) size 222x15
            text run at (0,-1) width 222: "cols=5 style=\"width:60px;height:60px\""
        RenderBlock {DIV} at (1,683) size 352x65 [border: (1px solid #FF0000)]
          RenderText {#text} at (1,49) size 14x15
            text run at (1,49) width 14: "A "
          RenderText {#text} at (74,49) size 14x15
            text run at (74,49) width 14: " B"
        RenderBlock (anonymous) at (1,748) size 350x14
          RenderText {#text} at (0,-1) size 227x15
            text run at (0,-1) width 227: "rows=4 style=\"width:60px;height:60px\""
        RenderBlock {DIV} at (1,762) size 352x65 [border: (1px solid #FF0000)]
          RenderText {#text} at (1,49) size 14x15
            text run at (1,49) width 14: "A "
          RenderText {#text} at (74,49) size 14x15
            text run at (74,49) width 14: " B"
        RenderBlock (anonymous) at (1,827) size 350x14
          RenderText {#text} at (0,-1) size 268x15
            text run at (0,-1) width 268: "cols=5 rows=4 style=\"width:60px;height:60px\""
        RenderBlock {DIV} at (1,841) size 352x65 [border: (1px solid #FF0000)]
          RenderText {#text} at (1,49) size 14x15
            text run at (1,49) width 14: "A "
          RenderText {#text} at (74,49) size 14x15
            text run at (74,49) width 14: " B"
        RenderBlock (anonymous) at (1,906) size 350x14
          RenderText {#text} at (0,-1) size 65x15
            text run at (0,-1) width 65: "wrap=\"off\""
        RenderBlock {DIV} at (1,920) size 352x47 [border: (1px solid #FF0000)]
          RenderText {#text} at (1,31) size 14x15
            text run at (1,31) width 14: "A "
          RenderText {#text} at (215,31) size 14x15
            text run at (215,31) width 5: " "
            text run at (219,31) width 10: "B"
        RenderBlock (anonymous) at (1,967) size 350x14
          RenderText {#text} at (0,-1) size 73x15
            text run at (0,-1) width 73: "wrap=\"hard\""
        RenderBlock {DIV} at (1,981) size 352x47 [border: (1px solid #FF0000)]
          RenderText {#text} at (1,31) size 14x15
            text run at (1,31) width 14: "A "
          RenderText {#text} at (215,31) size 14x15
            text run at (215,31) width 5: " "
            text run at (219,31) width 10: "B"
        RenderBlock (anonymous) at (1,1028) size 350x14
          RenderText {#text} at (0,-1) size 69x15
            text run at (0,-1) width 69: "wrap=\"soft\""
        RenderBlock {DIV} at (1,1042) size 352x47 [border: (1px solid #FF0000)]
          RenderText {#text} at (1,31) size 14x15
            text run at (1,31) width 14: "A "
          RenderText {#text} at (215,31) size 14x15
            text run at (215,31) width 5: " "
            text run at (219,31) width 10: "B"
layer at (23,24) size 201x42 clip at (24,25) size 199x40
  RenderTextControl {TEXTAREA} at (14,1) size 202x42 [bgcolor=#FFFFFF] [border: (1px solid #000000)]
    RenderBlock {DIV} at (3,3) size 195x18
      RenderText {#text} at (0,0) size 132x17
        text run at (0,0) width 132: "Lorem ipsum dolor"
layer at (23,85) size 201x42 clip at (24,86) size 184x40 scrollHeight 76
  RenderTextControl {TEXTAREA} at (14,1) size 202x42 [bgcolor=#FFFFFF] [border: (1px solid #000000)]
    RenderBlock {DIV} at (3,3) size 180x72
      RenderText {#text} at (0,0) size 173x71
        text run at (0,0) width 132: "Lorem ipsum dolor"
        text run at (132,0) width 4: " "
        text run at (0,18) width 171: "ABCDEFGHIJKLMNOP"
        text run at (0,36) width 115: "QRSTUVWXYZ"
        text run at (115,36) width 4: " "
        text run at (0,54) width 169: "abcdefghijklmnopqrstuv"
        text run at (169,54) width 4: " "
layer at (23,146) size 201x42 clip at (24,147) size 184x40 scrollHeight 76
  RenderTextControl {TEXTAREA} at (14,1) size 202x42 [color=#575757] [bgcolor=#FFFFFF] [border: (1px solid #575757)]
    RenderBlock {DIV} at (3,3) size 180x72
      RenderText {#text} at (0,0) size 173x71
        text run at (0,0) width 132: "Lorem ipsum dolor"
        text run at (132,0) width 4: " "
        text run at (0,18) width 171: "ABCDEFGHIJKLMNOP"
        text run at (0,36) width 115: "QRSTUVWXYZ"
        text run at (115,36) width 4: " "
        text run at (0,54) width 169: "abcdefghijklmnopqrstuv"
        text run at (169,54) width 4: " "
layer at (23,207) size 217x58 clip at (24,208) size 200x56 scrollHeight 92
  RenderTextControl {TEXTAREA} at (14,1) size 218x58 [bgcolor=#FFFFFF] [border: (1px solid #000000)]
    RenderBlock {DIV} at (11,11) size 180x72
      RenderText {#text} at (0,0) size 173x71
        text run at (0,0) width 132: "Lorem ipsum dolor"
        text run at (132,0) width 4: " "
        text run at (0,18) width 171: "ABCDEFGHIJKLMNOP"
        text run at (0,36) width 115: "QRSTUVWXYZ"
        text run at (115,36) width 4: " "
        text run at (0,54) width 169: "abcdefghijklmnopqrstuv"
        text run at (169,54) width 4: " "
layer at (23,284) size 197x38 clip at (24,285) size 180x36 scrollHeight 72
  RenderTextControl {TEXTAREA} at (14,1) size 198x38 [bgcolor=#FFFFFF] [border: (1px solid #000000)]
    RenderBlock {DIV} at (1,1) size 180x72
      RenderText {#text} at (0,0) size 173x71
        text run at (0,0) width 132: "Lorem ipsum dolor"
        text run at (132,0) width 4: " "
        text run at (0,18) width 171: "ABCDEFGHIJKLMNOP"
        text run at (0,36) width 115: "QRSTUVWXYZ"
        text run at (115,36) width 4: " "
        text run at (0,54) width 169: "abcdefghijklmnopqrstuv"
        text run at (169,54) width 4: " "
layer at (33,351) size 201x42 clip at (34,352) size 184x40 scrollHeight 76
  RenderTextControl {TEXTAREA} at (24,11) size 202x42 [bgcolor=#FFFFFF] [border: (1px solid #000000)]
    RenderBlock {DIV} at (3,3) size 180x72
      RenderText {#text} at (0,0) size 173x71
        text run at (0,0) width 132: "Lorem ipsum dolor"
        text run at (132,0) width 4: " "
        text run at (0,18) width 171: "ABCDEFGHIJKLMNOP"
        text run at (0,36) width 115: "QRSTUVWXYZ"
        text run at (115,36) width 4: " "
        text run at (0,54) width 169: "abcdefghijklmnopqrstuv"
        text run at (169,54) width 4: " "
layer at (23,422) size 201x42 clip at (24,423) size 184x40 scrollHeight 76
  RenderTextControl {TEXTAREA} at (14,1) size 202x42 [bgcolor=#FFFFFF] [border: (1px solid #000000)]
    RenderBlock {DIV} at (3,3) size 180x72
      RenderText {#text} at (0,0) size 173x71
        text run at (0,0) width 132: "Lorem ipsum dolor"
        text run at (132,0) width 4: " "
        text run at (0,18) width 171: "ABCDEFGHIJKLMNOP"
        text run at (0,36) width 115: "QRSTUVWXYZ"
        text run at (115,36) width 4: " "
        text run at (0,54) width 169: "abcdefghijklmnopqrstuv"
        text run at (169,54) width 4: " "
layer at (23,483) size 48x42 clip at (24,484) size 31x40 scrollHeight 472
  RenderTextControl {TEXTAREA} at (14,1) size 49x42 [bgcolor=#FFFFFF] [border: (1px solid #000000)]
    RenderBlock {DIV} at (3,3) size 27x468
      RenderText {#text} at (0,0) size 27x467
        text run at (0,0) width 23: "Lor"
        text run at (0,18) width 22: "em"
        text run at (22,18) width 4: " "
        text run at (0,36) width 21: "ips"
        text run at (0,54) width 22: "um"
        text run at (22,54) width 4: " "
        text run at (0,72) width 22: "dol"
        text run at (0,90) width 14: "or"
        text run at (14,90) width 4: " "
        text run at (0,108) width 22: "AB"
        text run at (0,126) width 24: "CD"
        text run at (0,144) width 21: "EF"
        text run at (0,162) width 24: "GH"
        text run at (0,180) width 23: "IJK"
        text run at (0,198) width 22: "LM"
        text run at (0,216) width 24: "NO"
        text run at (0,234) width 23: "PQ"
        text run at (0,252) width 23: "RS"
        text run at (0,270) width 22: "TU"
        text run at (0,288) width 26: "VW"
        text run at (0,306) width 22: "XY"
        text run at (0,324) width 10: "Z"
        text run at (10,324) width 4: " "
        text run at (0,342) width 26: "abc"
        text run at (0,360) width 22: "def"
        text run at (0,378) width 26: "ghij"
        text run at (0,396) width 25: "klm"
        text run at (0,414) width 27: "nop"
        text run at (0,432) width 26: "qrst"
        text run at (0,450) width 17: "uv"
        text run at (17,450) width 4: " "
layer at (23,544) size 201x60 clip at (24,545) size 184x58 scrollHeight 76
  RenderTextControl {TEXTAREA} at (14,1) size 202x60 [bgcolor=#FFFFFF] [border: (1px solid #000000)]
    RenderBlock {DIV} at (3,3) size 180x72
      RenderText {#text} at (0,0) size 173x71
        text run at (0,0) width 132: "Lorem ipsum dolor"
        text run at (132,0) width 4: " "
        text run at (0,18) width 171: "ABCDEFGHIJKLMNOP"
        text run at (0,36) width 115: "QRSTUVWXYZ"
        text run at (115,36) width 4: " "
        text run at (0,54) width 169: "abcdefghijklmnopqrstuv"
        text run at (169,54) width 4: " "
layer at (23,623) size 111x42 clip at (24,624) size 94x40 scrollHeight 148
  RenderTextControl {TEXTAREA} at (14,1) size 112x42 [bgcolor=#FFFFFF] [border: (1px solid #000000)]
    RenderBlock {DIV} at (3,3) size 90x144
      RenderText {#text} at (0,0) size 87x143
        text run at (0,0) width 45: "Lorem"
        text run at (45,0) width 4: " "
        text run at (0,18) width 83: "ipsum dolor"
        text run at (83,18) width 4: " "
        text run at (0,36) width 79: "ABCDEFG"
        text run at (0,54) width 81: "HIJKLMNO"
        text run at (0,72) width 79: "PQRSTUV"
        text run at (0,90) width 47: "WXYZ"
        text run at (47,90) width 4: " "
        text run at (0,108) width 86: "abcdefghijkl"
        text run at (0,126) width 83: "mnopqrstuv"
        text run at (83,126) width 4: " "
layer at (23,684) size 201x186 clip at (24,685) size 199x184
  RenderTextControl {TEXTAREA} at (14,1) size 202x186 [bgcolor=#FFFFFF] [border: (1px solid #000000)]
    RenderBlock {DIV} at (3,3) size 195x72
      RenderText {#text} at (0,0) size 195x71
        text run at (0,0) width 132: "Lorem ipsum dolor"
        text run at (132,0) width 4: " "
        text run at (0,18) width 195: "ABCDEFGHIJKLMNOPQR"
        text run at (0,36) width 91: "STUVWXYZ"
        text run at (91,36) width 4: " "
        text run at (0,54) width 169: "abcdefghijklmnopqrstuv"
        text run at (169,54) width 4: " "
layer at (23,889) size 66x78 clip at (24,890) size 49x76 scrollHeight 274
  RenderTextControl {TEXTAREA} at (14,1) size 67x78 [bgcolor=#FFFFFF] [border: (1px solid #000000)]
    RenderBlock {DIV} at (3,3) size 45x270
      RenderText {#text} at (0,0) size 45x269
        text run at (0,0) width 45: "Lorem"
        text run at (45,0) width 0: " "
        text run at (0,18) width 43: "ipsum"
        text run at (43,18) width 2: " "
        text run at (0,36) width 36: "dolor"
        text run at (36,36) width 4: " "
        text run at (0,54) width 34: "ABC"
        text run at (0,72) width 45: "DEFG"
        text run at (0,90) width 44: "HIJKL"
        text run at (0,108) width 37: "MNO"
        text run at (0,126) width 35: "PQR"
        text run at (0,144) width 44: "STUV"
        text run at (0,162) width 37: "WXY"
        text run at (0,180) width 10: "Z"
        text run at (10,180) width 4: " "
        text run at (0,198) width 44: "abcde"
        text run at (0,216) width 42: "fghijkl"
        text run at (0,234) width 40: "mnop"
        text run at (0,252) width 43: "qrstuv"
        text run at (43,252) width 2: " "
layer at (375,24) size 60x42 clip at (376,25) size 43x40 scrollHeight 346
  RenderTextControl {TEXTAREA} at (14,1) size 61x42 [bgcolor=#FFFFFF] [border: (1px solid #000000)]
    RenderBlock {DIV} at (3,3) size 39x342
      RenderText {#text} at (0,0) size 39x341
        text run at (0,0) width 32: "Lore"
        text run at (0,18) width 13: "m"
        text run at (13,18) width 4: " "
        text run at (0,36) width 30: "ipsu"
        text run at (0,54) width 13: "m"
        text run at (13,54) width 4: " "
        text run at (0,72) width 36: "dolor"
        text run at (36,72) width 3: " "
        text run at (0,90) width 34: "ABC"
        text run at (0,108) width 33: "DEF"
        text run at (0,126) width 36: "GHIJ"
        text run at (0,144) width 33: "KLM"
        text run at (0,162) width 35: "NOP"
        text run at (0,180) width 35: "QRS"
        text run at (0,198) width 33: "TUV"
        text run at (0,216) width 37: "WXY"
        text run at (0,234) width 10: "Z"
        text run at (10,234) width 4: " "
        text run at (0,252) width 35: "abcd"
        text run at (0,270) width 39: "efghij"
        text run at (0,288) width 34: "klmn"
        text run at (0,306) width 32: "opqr"
        text run at (0,324) width 29: "stuv"
        text run at (29,324) width 4: " "
layer at (375,85) size 60x78 clip at (376,86) size 43x76 scrollHeight 1264
  RenderTextControl {TEXTAREA} at (14,1) size 61x78 [bgcolor=#FFFFFF] [border: (1px solid #000000)]
    RenderBlock {DIV} at (21,21) size 3x1224
      RenderText {#text} at (0,0) size 15x1223
        text run at (0,0) width 9: "L"
        text run at (0,18) width 9: "o"
        text run at (0,36) width 5: "r"
        text run at (0,54) width 9: "e"
        text run at (0,72) width 13: "m"
        text run at (0,90) width 3: " "
        text run at (0,108) width 4: "i"
        text run at (0,126) width 9: "p"
        text run at (0,144) width 8: "s"
        text run at (0,162) width 9: "u"
        text run at (0,180) width 13: "m"
        text run at (0,198) width 3: " "
        text run at (0,216) width 9: "d"
        text run at (0,234) width 9: "o"
        text run at (0,252) width 4: "l"
        text run at (0,270) width 9: "o"
        text run at (0,288) width 5: "r"
        text run at (0,306) width 3: " "
        text run at (0,324) width 11: "A"
        text run at (0,342) width 11: "B"
        text run at (0,360) width 12: "C"
        text run at (0,378) width 12: "D"
        text run at (0,396) width 11: "E"
        text run at (0,414) width 10: "F"
        text run at (0,432) width 12: "G"
        text run at (0,450) width 12: "H"
        text run at (0,468) width 4: "I"
        text run at (0,486) width 8: "J"
        text run at (0,504) width 11: "K"
        text run at (0,522) width 9: "L"
        text run at (0,540) width 13: "M"
        text run at (0,558) width 12: "N"
        text run at (0,576) width 12: "O"
        text run at (0,594) width 11: "P"
        text run at (0,612) width 12: "Q"
        text run at (0,630) width 12: "R"
        text run at (0,648) width 11: "S"
        text run at (0,666) width 10: "T"
        text run at (0,684) width 12: "U"
        text run at (0,702) width 11: "V"
        text run at (0,720) width 15: "W"
        text run at (0,738) width 11: "X"
        text run at (0,756) width 11: "Y"
        text run at (0,774) width 10: "Z"
        text run at (0,792) width 3: " "
        text run at (0,810) width 9: "a"
        text run at (0,828) width 9: "b"
        text run at (0,846) width 8: "c"
        text run at (0,864) width 9: "d"
        text run at (0,882) width 9: "e"
        text run at (0,900) width 4: "f"
        text run at (0,918) width 9: "g"
        text run at (0,936) width 9: "h"
        text run at (0,954) width 4: "i"
        text run at (0,972) width 4: "j"
        text run at (0,990) width 8: "k"
        text run at (0,1008) width 4: "l"
        text run at (0,1026) width 13: "m"
        text run at (0,1044) width 9: "n"
        text run at (0,1062) width 9: "o"
        text run at (0,1080) width 9: "p"
        text run at (0,1098) width 9: "q"
        text run at (0,1116) width 5: "r"
        text run at (0,1134) width 8: "s"
        text run at (0,1152) width 4: "t"
        text run at (0,1170) width 9: "u"
        text run at (0,1188) width 8: "v"
        text run at (0,1206) width 3: " "
layer at (375,182) size 60x38 clip at (376,183) size 43x36 scrollHeight 324
  RenderTextControl {TEXTAREA} at (14,1) size 61x38 [bgcolor=#FFFFFF] [border: (1px solid #000000)]
    RenderBlock {DIV} at (1,1) size 43x324
      RenderText {#text} at (0,0) size 43x323
        text run at (0,0) width 32: "Lore"
        text run at (0,18) width 13: "m"
        text run at (13,18) width 4: " "
        text run at (0,36) width 43: "ipsum"
        text run at (43,36) width 0: " "
        text run at (0,54) width 36: "dolor"
        text run at (36,54) width 4: " "
        text run at (0,72) width 34: "ABC"
        text run at (0,90) width 33: "DEF"
        text run at (0,108) width 36: "GHIJ"
        text run at (0,126) width 33: "KLM"
        text run at (0,144) width 35: "NOP"
        text run at (0,162) width 35: "QRS"
        text run at (0,180) width 33: "TUV"
        text run at (0,198) width 37: "WXY"
        text run at (0,216) width 10: "Z"
        text run at (10,216) width 4: " "
        text run at (0,234) width 35: "abcd"
        text run at (0,252) width 39: "efghij"
        text run at (0,270) width 43: "klmno"
        text run at (0,288) width 35: "pqrst"
        text run at (0,306) width 17: "uv"
        text run at (17,306) width 4: " "
layer at (375,239) size 201x60 clip at (376,240) size 184x58 scrollHeight 76
  RenderTextControl {TEXTAREA} at (14,1) size 202x60 [bgcolor=#FFFFFF] [border: (1px solid #000000)]
    RenderBlock {DIV} at (3,3) size 180x72
      RenderText {#text} at (0,0) size 173x71
        text run at (0,0) width 132: "Lorem ipsum dolor"
        text run at (132,0) width 4: " "
        text run at (0,18) width 171: "ABCDEFGHIJKLMNOP"
        text run at (0,36) width 115: "QRSTUVWXYZ"
        text run at (115,36) width 4: " "
        text run at (0,54) width 169: "abcdefghijklmnopqrstuv"
        text run at (169,54) width 4: " "
layer at (375,318) size 60x60 clip at (376,319) size 43x58 scrollHeight 346
  RenderTextControl {TEXTAREA} at (14,1) size 61x60 [bgcolor=#FFFFFF] [border: (1px solid #000000)]
    RenderBlock {DIV} at (3,3) size 39x342
      RenderText {#text} at (0,0) size 39x341
        text run at (0,0) width 32: "Lore"
        text run at (0,18) width 13: "m"
        text run at (13,18) width 4: " "
        text run at (0,36) width 30: "ipsu"
        text run at (0,54) width 13: "m"
        text run at (13,54) width 4: " "
        text run at (0,72) width 36: "dolor"
        text run at (36,72) width 3: " "
        text run at (0,90) width 34: "ABC"
        text run at (0,108) width 33: "DEF"
        text run at (0,126) width 36: "GHIJ"
        text run at (0,144) width 33: "KLM"
        text run at (0,162) width 35: "NOP"
        text run at (0,180) width 35: "QRS"
        text run at (0,198) width 33: "TUV"
        text run at (0,216) width 37: "WXY"
        text run at (0,234) width 10: "Z"
        text run at (10,234) width 4: " "
        text run at (0,252) width 35: "abcd"
        text run at (0,270) width 39: "efghij"
        text run at (0,288) width 34: "klmn"
        text run at (0,306) width 32: "opqr"
        text run at (0,324) width 29: "stuv"
        text run at (29,324) width 4: " "
layer at (375,397) size 186x42 clip at (376,398) size 184x40 scrollHeight 76
  RenderTextControl {TEXTAREA} at (14,1) size 187x42 [bgcolor=#FFFFFF] [border: (1px solid #000000)]
    RenderBlock {DIV} at (3,3) size 180x72
      RenderText {#text} at (0,0) size 173x71
        text run at (0,0) width 132: "Lorem ipsum dolor"
        text run at (132,0) width 4: " "
        text run at (0,18) width 171: "ABCDEFGHIJKLMNOP"
        text run at (0,36) width 115: "QRSTUVWXYZ"
        text run at (115,36) width 4: " "
        text run at (0,54) width 169: "abcdefghijklmnopqrstuv"
        text run at (169,54) width 4: " "
layer at (375,458) size 201x57 clip at (376,459) size 184x40 scrollHeight 76
  RenderTextControl {TEXTAREA} at (14,1) size 202x57 [bgcolor=#FFFFFF] [border: (1px solid #000000)]
    RenderBlock {DIV} at (3,3) size 180x72
      RenderText {#text} at (0,0) size 173x71
        text run at (0,0) width 132: "Lorem ipsum dolor"
        text run at (132,0) width 4: " "
        text run at (0,18) width 171: "ABCDEFGHIJKLMNOP"
        text run at (0,36) width 115: "QRSTUVWXYZ"
        text run at (115,36) width 4: " "
        text run at (0,54) width 169: "abcdefghijklmnopqrstuv"
        text run at (169,54) width 4: " "
layer at (375,534) size 60x60 clip at (376,535) size 58x58 scrollHeight 238
  RenderTextControl {TEXTAREA} at (14,1) size 61x60 [bgcolor=#FFFFFF] [border: (1px solid #000000)]
    RenderBlock {DIV} at (3,3) size 54x234
      RenderText {#text} at (0,0) size 53x233
        text run at (0,0) width 45: "Lorem"
        text run at (45,0) width 4: " "
        text run at (0,18) width 43: "ipsum"
        text run at (43,18) width 4: " "
        text run at (0,36) width 36: "dolor"
        text run at (36,36) width 4: " "
        text run at (0,54) width 46: "ABCD"
        text run at (0,72) width 49: "EFGHI"
        text run at (0,90) width 53: "JKLMN"
        text run at (0,108) width 47: "OPQR"
        text run at (0,126) width 44: "STUV"
        text run at (0,144) width 47: "WXYZ"
        text run at (47,144) width 4: " "
        text run at (0,162) width 48: "abcdef"
        text run at (0,180) width 51: "ghijklm"
        text run at (0,198) width 53: "nopqrst"
        text run at (0,216) width 17: "uv"
        text run at (17,216) width 4: " "
layer at (375,613) size 60x60 clip at (376,614) size 43x43 scrollHeight 346
  RenderTextControl {TEXTAREA} at (14,1) size 61x60 [bgcolor=#FFFFFF] [border: (1px solid #000000)]
    RenderBlock {DIV} at (3,3) size 39x342
      RenderText {#text} at (0,0) size 39x341
        text run at (0,0) width 32: "Lore"
        text run at (0,18) width 13: "m"
        text run at (13,18) width 4: " "
        text run at (0,36) width 30: "ipsu"
        text run at (0,54) width 13: "m"
        text run at (13,54) width 4: " "
        text run at (0,72) width 36: "dolor"
        text run at (36,72) width 3: " "
        text run at (0,90) width 34: "ABC"
        text run at (0,108) width 33: "DEF"
        text run at (0,126) width 36: "GHIJ"
        text run at (0,144) width 33: "KLM"
        text run at (0,162) width 35: "NOP"
        text run at (0,180) width 35: "QRS"
        text run at (0,198) width 33: "TUV"
        text run at (0,216) width 37: "WXY"
        text run at (0,234) width 10: "Z"
        text run at (10,234) width 4: " "
        text run at (0,252) width 35: "abcd"
        text run at (0,270) width 39: "efghij"
        text run at (0,288) width 34: "klmn"
        text run at (0,306) width 32: "opqr"
        text run at (0,324) width 29: "stuv"
        text run at (29,324) width 4: " "
layer at (375,692) size 60x60 clip at (376,693) size 43x58 scrollHeight 346
  RenderTextControl {TEXTAREA} at (14,1) size 61x60 [bgcolor=#FFFFFF] [border: (1px solid #000000)]
    RenderBlock {DIV} at (3,3) size 39x342
      RenderText {#text} at (0,0) size 39x341
        text run at (0,0) width 32: "Lore"
        text run at (0,18) width 13: "m"
        text run at (13,18) width 4: " "
        text run at (0,36) width 30: "ipsu"
        text run at (0,54) width 13: "m"
        text run at (13,54) width 4: " "
        text run at (0,72) width 36: "dolor"
        text run at (36,72) width 3: " "
        text run at (0,90) width 34: "ABC"
        text run at (0,108) width 33: "DEF"
        text run at (0,126) width 36: "GHIJ"
        text run at (0,144) width 33: "KLM"
        text run at (0,162) width 35: "NOP"
        text run at (0,180) width 35: "QRS"
        text run at (0,198) width 33: "TUV"
        text run at (0,216) width 37: "WXY"
        text run at (0,234) width 10: "Z"
        text run at (10,234) width 4: " "
        text run at (0,252) width 35: "abcd"
        text run at (0,270) width 39: "efghij"
        text run at (0,288) width 34: "klmn"
        text run at (0,306) width 32: "opqr"
        text run at (0,324) width 29: "stuv"
        text run at (29,324) width 4: " "
layer at (375,771) size 60x60 clip at (376,772) size 43x58 scrollHeight 346
  RenderTextControl {TEXTAREA} at (14,1) size 61x60 [bgcolor=#FFFFFF] [border: (1px solid #000000)]
    RenderBlock {DIV} at (3,3) size 39x342
      RenderText {#text} at (0,0) size 39x341
        text run at (0,0) width 32: "Lore"
        text run at (0,18) width 13: "m"
        text run at (13,18) width 4: " "
        text run at (0,36) width 30: "ipsu"
        text run at (0,54) width 13: "m"
        text run at (13,54) width 4: " "
        text run at (0,72) width 36: "dolor"
        text run at (36,72) width 3: " "
        text run at (0,90) width 34: "ABC"
        text run at (0,108) width 33: "DEF"
        text run at (0,126) width 36: "GHIJ"
        text run at (0,144) width 33: "KLM"
        text run at (0,162) width 35: "NOP"
        text run at (0,180) width 35: "QRS"
        text run at (0,198) width 33: "TUV"
        text run at (0,216) width 37: "WXY"
        text run at (0,234) width 10: "Z"
        text run at (10,234) width 4: " "
        text run at (0,252) width 35: "abcd"
        text run at (0,270) width 39: "efghij"
        text run at (0,288) width 34: "klmn"
        text run at (0,306) width 32: "opqr"
        text run at (0,324) width 29: "stuv"
        text run at (29,324) width 4: " "
layer at (375,850) size 60x60 clip at (376,851) size 43x58 scrollHeight 346
  RenderTextControl {TEXTAREA} at (14,1) size 61x60 [bgcolor=#FFFFFF] [border: (1px solid #000000)]
    RenderBlock {DIV} at (3,3) size 39x342
      RenderText {#text} at (0,0) size 39x341
        text run at (0,0) width 32: "Lore"
        text run at (0,18) width 13: "m"
        text run at (13,18) width 4: " "
        text run at (0,36) width 30: "ipsu"
        text run at (0,54) width 13: "m"
        text run at (13,54) width 4: " "
        text run at (0,72) width 36: "dolor"
        text run at (36,72) width 3: " "
        text run at (0,90) width 34: "ABC"
        text run at (0,108) width 33: "DEF"
        text run at (0,126) width 36: "GHIJ"
        text run at (0,144) width 33: "KLM"
        text run at (0,162) width 35: "NOP"
        text run at (0,180) width 35: "QRS"
        text run at (0,198) width 33: "TUV"
        text run at (0,216) width 37: "WXY"
        text run at (0,234) width 10: "Z"
        text run at (10,234) width 4: " "
        text run at (0,252) width 35: "abcd"
        text run at (0,270) width 39: "efghij"
        text run at (0,288) width 34: "klmn"
        text run at (0,306) width 32: "opqr"
        text run at (0,324) width 29: "stuv"
        text run at (29,324) width 4: " "
layer at (375,929) size 201x42 clip at (376,930) size 184x25 scrollWidth 245 scrollHeight 292
  RenderTextControl {TEXTAREA} at (14,1) size 202x42 [bgcolor=#FFFFFF] [border: (1px solid #000000)]
    RenderBlock {DIV} at (3,3) size 180x288
      RenderText {#text} at (0,0) size 243x269
        text run at (0,0) width 4: " "
        text run at (4,0) width 0: " "
        text run at (0,18) width 243: "This is a text area with wrap=\"soft\""
        text run at (243,18) width 0: " "
        text run at (0,36) width 243: "This is a text area with wrap=\"soft\""
        text run at (243,36) width 0: " "
        text run at (0,54) width 243: "This is a text area with wrap=\"soft\""
        text run at (243,54) width 0: " "
        text run at (0,72) width 243: "This is a text area with wrap=\"soft\""
        text run at (243,72) width 0: " "
        text run at (0,90) width 243: "This is a text area with wrap=\"soft\""
        text run at (243,90) width 0: " "
        text run at (0,108) width 243: "This is a text area with wrap=\"soft\""
        text run at (243,108) width 0: " "
        text run at (0,126) width 243: "This is a text area with wrap=\"soft\""
        text run at (243,126) width 0: " "
        text run at (0,144) width 243: "This is a text area with wrap=\"soft\""
        text run at (243,144) width 0: " "
        text run at (0,162) width 243: "This is a text area with wrap=\"soft\""
        text run at (243,162) width 0: " "
        text run at (0,180) width 243: "This is a text area with wrap=\"soft\""
        text run at (243,180) width 0: " "
        text run at (0,198) width 243: "This is a text area with wrap=\"soft\""
        text run at (243,198) width 0: " "
        text run at (0,216) width 243: "This is a text area with wrap=\"soft\""
        text run at (243,216) width 0: " "
        text run at (0,234) width 243: "This is a text area with wrap=\"soft\""
        text run at (243,234) width 0: " "
        text run at (0,252) width 243: "This is a text area with wrap=\"soft\""
        text run at (243,252) width 0: " "
      RenderBR {BR} at (0,270) size 0x17
layer at (375,990) size 201x42 clip at (376,991) size 184x40 scrollHeight 544
  RenderTextControl {TEXTAREA} at (14,1) size 202x42 [bgcolor=#FFFFFF] [border: (1px solid #000000)]
    RenderBlock {DIV} at (3,3) size 180x540
      RenderText {#text} at (0,0) size 162x521
        text run at (0,0) width 4: " "
        text run at (4,0) width 0: " "
        text run at (0,18) width 158: "This is a text area with"
        text run at (158,18) width 4: " "
        text run at (0,36) width 81: "wrap=\"soft\""
        text run at (81,36) width 0: " "
        text run at (0,54) width 158: "This is a text area with"
        text run at (158,54) width 4: " "
        text run at (0,72) width 81: "wrap=\"soft\""
        text run at (81,72) width 0: " "
        text run at (0,90) width 158: "This is a text area with"
        text run at (158,90) width 4: " "
        text run at (0,108) width 81: "wrap=\"soft\""
        text run at (81,108) width 0: " "
        text run at (0,126) width 158: "This is a text area with"
        text run at (158,126) width 4: " "
        text run at (0,144) width 81: "wrap=\"soft\""
        text run at (81,144) width 0: " "
        text run at (0,162) width 158: "This is a text area with"
        text run at (158,162) width 4: " "
        text run at (0,180) width 81: "wrap=\"soft\""
        text run at (81,180) width 0: " "
        text run at (0,198) width 158: "This is a text area with"
        text run at (158,198) width 4: " "
        text run at (0,216) width 81: "wrap=\"soft\""
        text run at (81,216) width 0: " "
        text run at (0,234) width 158: "This is a text area with"
        text run at (158,234) width 4: " "
        text run at (0,252) width 81: "wrap=\"soft\""
        text run at (81,252) width 0: " "
        text run at (0,270) width 158: "This is a text area with"
        text run at (158,270) width 4: " "
        text run at (0,288) width 81: "wrap=\"soft\""
        text run at (81,288) width 0: " "
        text run at (0,306) width 158: "This is a text area with"
        text run at (158,306) width 4: " "
        text run at (0,324) width 81: "wrap=\"soft\""
        text run at (81,324) width 0: " "
        text run at (0,342) width 158: "This is a text area with"
        text run at (158,342) width 4: " "
        text run at (0,360) width 81: "wrap=\"soft\""
        text run at (81,360) width 0: " "
        text run at (0,378) width 158: "This is a text area with"
        text run at (158,378) width 4: " "
        text run at (0,396) width 81: "wrap=\"soft\""
        text run at (81,396) width 0: " "
        text run at (0,414) width 158: "This is a text area with"
        text run at (158,414) width 4: " "
        text run at (0,432) width 81: "wrap=\"soft\""
        text run at (81,432) width 0: " "
        text run at (0,450) width 158: "This is a text area with"
        text run at (158,450) width 4: " "
        text run at (0,468) width 81: "wrap=\"soft\""
        text run at (81,468) width 0: " "
        text run at (0,486) width 158: "This is a text area with"
        text run at (158,486) width 4: " "
        text run at (0,504) width 81: "wrap=\"soft\""
        text run at (81,504) width 0: " "
      RenderBR {BR} at (0,522) size 0x17
layer at (375,1051) size 201x42 clip at (376,1052) size 184x40 scrollHeight 544
  RenderTextControl {TEXTAREA} at (14,1) size 202x42 [bgcolor=#FFFFFF] [border: (1px solid #000000)]
    RenderBlock {DIV} at (3,3) size 180x540
      RenderText {#text} at (0,0) size 162x521
        text run at (0,0) width 4: " "
        text run at (4,0) width 0: " "
        text run at (0,18) width 158: "This is a text area with"
        text run at (158,18) width 4: " "
        text run at (0,36) width 81: "wrap=\"soft\""
        text run at (81,36) width 0: " "
        text run at (0,54) width 158: "This is a text area with"
        text run at (158,54) width 4: " "
        text run at (0,72) width 81: "wrap=\"soft\""
        text run at (81,72) width 0: " "
        text run at (0,90) width 158: "This is a text area with"
        text run at (158,90) width 4: " "
        text run at (0,108) width 81: "wrap=\"soft\""
        text run at (81,108) width 0: " "
        text run at (0,126) width 158: "This is a text area with"
        text run at (158,126) width 4: " "
        text run at (0,144) width 81: "wrap=\"soft\""
        text run at (81,144) width 0: " "
        text run at (0,162) width 158: "This is a text area with"
        text run at (158,162) width 4: " "
        text run at (0,180) width 81: "wrap=\"soft\""
        text run at (81,180) width 0: " "
        text run at (0,198) width 158: "This is a text area with"
        text run at (158,198) width 4: " "
        text run at (0,216) width 81: "wrap=\"soft\""
        text run at (81,216) width 0: " "
        text run at (0,234) width 158: "This is a text area with"
        text run at (158,234) width 4: " "
        text run at (0,252) width 81: "wrap=\"soft\""
        text run at (81,252) width 0: " "
        text run at (0,270) width 158: "This is a text area with"
        text run at (158,270) width 4: " "
        text run at (0,288) width 81: "wrap=\"soft\""
        text run at (81,288) width 0: " "
        text run at (0,306) width 158: "This is a text area with"
        text run at (158,306) width 4: " "
        text run at (0,324) width 81: "wrap=\"soft\""
        text run at (81,324) width 0: " "
        text run at (0,342) width 158: "This is a text area with"
        text run at (158,342) width 4: " "
        text run at (0,360) width 81: "wrap=\"soft\""
        text run at (81,360) width 0: " "
        text run at (0,378) width 158: "This is a text area with"
        text run at (158,378) width 4: " "
        text run at (0,396) width 81: "wrap=\"soft\""
        text run at (81,396) width 0: " "
        text run at (0,414) width 158: "This is a text area with"
        text run at (158,414) width 4: " "
        text run at (0,432) width 81: "wrap=\"soft\""
        text run at (81,432) width 0: " "
        text run at (0,450) width 158: "This is a text area with"
        text run at (158,450) width 4: " "
        text run at (0,468) width 81: "wrap=\"soft\""
        text run at (81,468) width 0: " "
        text run at (0,486) width 158: "This is a text area with"
        text run at (158,486) width 4: " "
        text run at (0,504) width 81: "wrap=\"soft\""
        text run at (81,504) width 0: " "
      RenderBR {BR} at (0,522) size 0x17
