The tests in this directory were imported from the W3C repository.
Do NOT modify these tests directly in WebKit.
Instead, create a pull request on the WPT github:
	https://github.com/web-platform-tests/wpt

Then run the Tools/Scripts/import-w3c-tests in WebKit to reimport

Do NOT modify or remove this file.

------------------------------------------------------------------------
Properties requiring vendor prefixes:
None
Property values requiring vendor prefixes:
None
------------------------------------------------------------------------
List of files:
/LayoutTests/imported/w3c/web-platform-tests/css/motion/animation/offset-anchor-composition.html
/LayoutTests/imported/w3c/web-platform-tests/css/motion/animation/offset-anchor-interpolation.html
/LayoutTests/imported/w3c/web-platform-tests/css/motion/animation/offset-distance-composition.html
/LayoutTests/imported/w3c/web-platform-tests/css/motion/animation/offset-distance-interpolation.html
/LayoutTests/imported/w3c/web-platform-tests/css/motion/animation/offset-interpolation.html
/LayoutTests/imported/w3c/web-platform-tests/css/motion/animation/offset-path-composition.html
/LayoutTests/imported/w3c/web-platform-tests/css/motion/animation/offset-path-interpolation-001.html
/LayoutTests/imported/w3c/web-platform-tests/css/motion/animation/offset-path-interpolation-002.html
/LayoutTests/imported/w3c/web-platform-tests/css/motion/animation/offset-path-interpolation-003.html
/LayoutTests/imported/w3c/web-platform-tests/css/motion/animation/offset-path-interpolation-004.html
/LayoutTests/imported/w3c/web-platform-tests/css/motion/animation/offset-path-interpolation-005.html
/LayoutTests/imported/w3c/web-platform-tests/css/motion/animation/offset-path-interpolation-006.html
/LayoutTests/imported/w3c/web-platform-tests/css/motion/animation/offset-position-composition.html
/LayoutTests/imported/w3c/web-platform-tests/css/motion/animation/offset-position-interpolation.html
/LayoutTests/imported/w3c/web-platform-tests/css/motion/animation/offset-rotate-composition.html
/LayoutTests/imported/w3c/web-platform-tests/css/motion/animation/offset-rotate-interpolation.html
