layer at (0,0) size 800x600
  RenderView at (0,0) size 800x600
layer at (0,0) size 800x298
  RenderBlock {HTML} at (0,0) size 800x298
    RenderBody {BODY} at (8,16) size 784x274
      RenderBlock {P} at (0,0) size 784x20
        RenderInline {A} at (0,0) size 305x19 [color=#0000EE]
          RenderText {#text} at (0,0) size 305x19
            text run at (0,0) width 305: "https://bugs.webkit.org/show_bug.cgi?id=26095"
      RenderBlock {P} at (0,36) size 784x20
        RenderText {#text} at (0,0) size 387x19
          text run at (0,0) width 387: "Tests that a 3D transform on a generated node does not crash."
      RenderBlock {DIV} at (0,72) size 202x202 [border: (1px solid #000000)]
layer at (9,89) size 200x200
  RenderBlock (generated) at (1,1) size 200x200
    RenderText at (0,0) size 65x19
      text run at (0,0) width 65: "Generated"
