The tests in this directory were imported from the W3C repository.
Do NOT modify these tests directly in WebKit.
Instead, create a pull request on the WPT github:
	https://github.com/web-platform-tests/wpt

Then run the Tools/Scripts/import-w3c-tests in WebKit to reimport

Do NOT modify or remove this file.

------------------------------------------------------------------------
Properties requiring vendor prefixes:
backdrop-filter
Property values requiring vendor prefixes:
None
------------------------------------------------------------------------
List of files:
/LayoutTests/imported/w3c/web-platform-tests/css/css-transforms/2d-rotate-001-expected.html
/LayoutTests/imported/w3c/web-platform-tests/css/css-transforms/2d-rotate-001.html
/LayoutTests/imported/w3c/web-platform-tests/css/css-transforms/2d-rotate-js.html
/LayoutTests/imported/w3c/web-platform-tests/css/css-transforms/2d-rotate-notref-expected-mismatch.html
/LayoutTests/imported/w3c/web-platform-tests/css/css-transforms/2d-rotate-notref.html
/LayoutTests/imported/w3c/web-platform-tests/css/css-transforms/2d-rotate-ref-expected-mismatch.html
/LayoutTests/imported/w3c/web-platform-tests/css/css-transforms/2d-rotate-ref.html
/LayoutTests/imported/w3c/web-platform-tests/css/css-transforms/3d-rendering-context-and-abspos-expected.html
/LayoutTests/imported/w3c/web-platform-tests/css/css-transforms/3d-rendering-context-and-abspos.html
/LayoutTests/imported/w3c/web-platform-tests/css/css-transforms/3d-rendering-context-and-fixpos-expected.html
/LayoutTests/imported/w3c/web-platform-tests/css/css-transforms/3d-rendering-context-and-fixpos.html
/LayoutTests/imported/w3c/web-platform-tests/css/css-transforms/3d-rendering-context-and-inline-expected.html
/LayoutTests/imported/w3c/web-platform-tests/css/css-transforms/3d-rendering-context-and-inline.html
/LayoutTests/imported/w3c/web-platform-tests/css/css-transforms/3d-rendering-context-and-z-ordering-001-expected.html
/LayoutTests/imported/w3c/web-platform-tests/css/css-transforms/3d-rendering-context-and-z-ordering-001.html
/LayoutTests/imported/w3c/web-platform-tests/css/css-transforms/3d-rendering-context-and-z-ordering-002-expected.html
/LayoutTests/imported/w3c/web-platform-tests/css/css-transforms/3d-rendering-context-and-z-ordering-002.html
/LayoutTests/imported/w3c/web-platform-tests/css/css-transforms/3d-rendering-context-and-z-ordering-003-expected.html
/LayoutTests/imported/w3c/web-platform-tests/css/css-transforms/3d-rendering-context-and-z-ordering-003.html
/LayoutTests/imported/w3c/web-platform-tests/css/css-transforms/3d-rendering-context-behavior.html
/LayoutTests/imported/w3c/web-platform-tests/css/css-transforms/3d-scene-with-iframe-001-expected.html
/LayoutTests/imported/w3c/web-platform-tests/css/css-transforms/3d-scene-with-iframe-001-ref.html
/LayoutTests/imported/w3c/web-platform-tests/css/css-transforms/3d-scene-with-iframe-001.html
/LayoutTests/imported/w3c/web-platform-tests/css/css-transforms/3dtransform-and-filter-no-perspective-001-expected.html
/LayoutTests/imported/w3c/web-platform-tests/css/css-transforms/3dtransform-and-filter-no-perspective-001-ref.html
/LayoutTests/imported/w3c/web-platform-tests/css/css-transforms/3dtransform-and-filter-no-perspective-001.html
/LayoutTests/imported/w3c/web-platform-tests/css/css-transforms/3dtransform-and-position-sticky-001-expected.html
/LayoutTests/imported/w3c/web-platform-tests/css/css-transforms/3dtransform-and-position-sticky-001.html
/LayoutTests/imported/w3c/web-platform-tests/css/css-transforms/3dtransform-and-position-sticky-002-expected.html
/LayoutTests/imported/w3c/web-platform-tests/css/css-transforms/3dtransform-and-position-sticky-002.html
/LayoutTests/imported/w3c/web-platform-tests/css/css-transforms/3dtransform-and-position-sticky-ref.html
/LayoutTests/imported/w3c/web-platform-tests/css/css-transforms/META.yml
/LayoutTests/imported/w3c/web-platform-tests/css/css-transforms/add-child-in-empty-layer-expected.html
/LayoutTests/imported/w3c/web-platform-tests/css/css-transforms/add-child-in-empty-layer-ref.html
/LayoutTests/imported/w3c/web-platform-tests/css/css-transforms/add-child-in-empty-layer.html
/LayoutTests/imported/w3c/web-platform-tests/css/css-transforms/backface-visibility-001-expected.html
/LayoutTests/imported/w3c/web-platform-tests/css/css-transforms/backface-visibility-001.html
/LayoutTests/imported/w3c/web-platform-tests/css/css-transforms/backface-visibility-001.ref.html
/LayoutTests/imported/w3c/web-platform-tests/css/css-transforms/backface-visibility-hidden-001-expected.html
/LayoutTests/imported/w3c/web-platform-tests/css/css-transforms/backface-visibility-hidden-001.html
/LayoutTests/imported/w3c/web-platform-tests/css/css-transforms/backface-visibility-hidden-002-ref.html
/LayoutTests/imported/w3c/web-platform-tests/css/css-transforms/backface-visibility-hidden-002.tentative-expected.html
/LayoutTests/imported/w3c/web-platform-tests/css/css-transforms/backface-visibility-hidden-002.tentative.html
/LayoutTests/imported/w3c/web-platform-tests/css/css-transforms/backface-visibility-hidden-003-ref.html
/LayoutTests/imported/w3c/web-platform-tests/css/css-transforms/backface-visibility-hidden-003.tentative-expected.html
/LayoutTests/imported/w3c/web-platform-tests/css/css-transforms/backface-visibility-hidden-003.tentative.html
/LayoutTests/imported/w3c/web-platform-tests/css/css-transforms/backface-visibility-hidden-004-ref.html
/LayoutTests/imported/w3c/web-platform-tests/css/css-transforms/backface-visibility-hidden-004.tentative-expected.html
/LayoutTests/imported/w3c/web-platform-tests/css/css-transforms/backface-visibility-hidden-004.tentative.html
/LayoutTests/imported/w3c/web-platform-tests/css/css-transforms/backface-visibility-hidden-005-ref.html
/LayoutTests/imported/w3c/web-platform-tests/css/css-transforms/backface-visibility-hidden-005.tentative-expected.html
/LayoutTests/imported/w3c/web-platform-tests/css/css-transforms/backface-visibility-hidden-005.tentative.html
/LayoutTests/imported/w3c/web-platform-tests/css/css-transforms/backface-visibility-hidden-006-expected.html
/LayoutTests/imported/w3c/web-platform-tests/css/css-transforms/backface-visibility-hidden-006-ref.html
/LayoutTests/imported/w3c/web-platform-tests/css/css-transforms/backface-visibility-hidden-006.html
/LayoutTests/imported/w3c/web-platform-tests/css/css-transforms/backface-visibility-hidden-animated-001-expected.html
/LayoutTests/imported/w3c/web-platform-tests/css/css-transforms/backface-visibility-hidden-animated-001.html
/LayoutTests/imported/w3c/web-platform-tests/css/css-transforms/backface-visibility-hidden-animated-002-expected.html
/LayoutTests/imported/w3c/web-platform-tests/css/css-transforms/backface-visibility-hidden-animated-002.html
/LayoutTests/imported/w3c/web-platform-tests/css/css-transforms/backface-visibility-hidden-animated-ref.html
/LayoutTests/imported/w3c/web-platform-tests/css/css-transforms/backface-visibility-hidden-child-translate-expected.xht
/LayoutTests/imported/w3c/web-platform-tests/css/css-transforms/backface-visibility-hidden-child-translate.html
/LayoutTests/imported/w3c/web-platform-tests/css/css-transforms/backface-visibility-hidden-child-will-change-transform-expected.xht
/LayoutTests/imported/w3c/web-platform-tests/css/css-transforms/backface-visibility-hidden-child-will-change-transform.html
/LayoutTests/imported/w3c/web-platform-tests/css/css-transforms/backface-visibility-with-sibling-001-expected.html
/LayoutTests/imported/w3c/web-platform-tests/css/css-transforms/backface-visibility-with-sibling-001.html
/LayoutTests/imported/w3c/web-platform-tests/css/css-transforms/change-perspective-property-expected.html
/LayoutTests/imported/w3c/web-platform-tests/css/css-transforms/change-perspective-property.html
/LayoutTests/imported/w3c/web-platform-tests/css/css-transforms/change-scale-wide-range-expected.html
/LayoutTests/imported/w3c/web-platform-tests/css/css-transforms/change-scale-wide-range-ref.html
/LayoutTests/imported/w3c/web-platform-tests/css/css-transforms/change-scale-wide-range.html
/LayoutTests/imported/w3c/web-platform-tests/css/css-transforms/change-transform-origin-property-expected.html
/LayoutTests/imported/w3c/web-platform-tests/css/css-transforms/change-transform-origin-property.html
/LayoutTests/imported/w3c/web-platform-tests/css/css-transforms/composited-under-rotateY-180deg-clip-expected.html
/LayoutTests/imported/w3c/web-platform-tests/css/css-transforms/composited-under-rotateY-180deg-clip-perspective-expected.html
/LayoutTests/imported/w3c/web-platform-tests/css/css-transforms/composited-under-rotateY-180deg-clip-perspective-ref.html
/LayoutTests/imported/w3c/web-platform-tests/css/css-transforms/composited-under-rotateY-180deg-clip-perspective.html
/LayoutTests/imported/w3c/web-platform-tests/css/css-transforms/composited-under-rotateY-180deg-clip-ref.html
/LayoutTests/imported/w3c/web-platform-tests/css/css-transforms/composited-under-rotateY-180deg-clip.html
/LayoutTests/imported/w3c/web-platform-tests/css/css-transforms/composited-under-rotateY-180deg-expected.html
/LayoutTests/imported/w3c/web-platform-tests/css/css-transforms/composited-under-rotateY-180deg-ref.html
/LayoutTests/imported/w3c/web-platform-tests/css/css-transforms/composited-under-rotateY-180deg.html
/LayoutTests/imported/w3c/web-platform-tests/css/css-transforms/containing-block-dynamic-1-ref.html
/LayoutTests/imported/w3c/web-platform-tests/css/css-transforms/css-rotate-2d-3d-001-expected.html
/LayoutTests/imported/w3c/web-platform-tests/css/css-transforms/css-rotate-2d-3d-001-ref.html
/LayoutTests/imported/w3c/web-platform-tests/css/css-transforms/css-rotate-2d-3d-001.html
/LayoutTests/imported/w3c/web-platform-tests/css/css-transforms/css-scale-nested-001-expected.html
/LayoutTests/imported/w3c/web-platform-tests/css/css-transforms/css-scale-nested-001.html
/LayoutTests/imported/w3c/web-platform-tests/css/css-transforms/css-skew-001-expected.html
/LayoutTests/imported/w3c/web-platform-tests/css/css-transforms/css-skew-001-ref.html
/LayoutTests/imported/w3c/web-platform-tests/css/css-transforms/css-skew-001.html
/LayoutTests/imported/w3c/web-platform-tests/css/css-transforms/css-skew-002-expected.html
/LayoutTests/imported/w3c/web-platform-tests/css/css-transforms/css-skew-002-ref.html
/LayoutTests/imported/w3c/web-platform-tests/css/css-transforms/css-skew-002.html
/LayoutTests/imported/w3c/web-platform-tests/css/css-transforms/css-transform-3d-rotate3d-X-negative-expected.html
/LayoutTests/imported/w3c/web-platform-tests/css/css-transforms/css-transform-3d-rotate3d-X-negative.html
/LayoutTests/imported/w3c/web-platform-tests/css/css-transforms/css-transform-3d-rotate3d-X-positive-expected.html
/LayoutTests/imported/w3c/web-platform-tests/css/css-transforms/css-transform-3d-rotate3d-X-positive.html
/LayoutTests/imported/w3c/web-platform-tests/css/css-transforms/css-transform-3d-rotate3d-Y-negative-expected.html
/LayoutTests/imported/w3c/web-platform-tests/css/css-transforms/css-transform-3d-rotate3d-Y-negative.html
/LayoutTests/imported/w3c/web-platform-tests/css/css-transforms/css-transform-3d-rotate3d-Y-positive-expected.html
/LayoutTests/imported/w3c/web-platform-tests/css/css-transforms/css-transform-3d-rotate3d-Y-positive.html
/LayoutTests/imported/w3c/web-platform-tests/css/css-transforms/css-transform-3d-rotate3d-Z-negative-expected.html
/LayoutTests/imported/w3c/web-platform-tests/css/css-transforms/css-transform-3d-rotate3d-Z-negative.html
/LayoutTests/imported/w3c/web-platform-tests/css/css-transforms/css-transform-3d-rotate3d-Z-positive-expected.html
/LayoutTests/imported/w3c/web-platform-tests/css/css-transforms/css-transform-3d-rotate3d-Z-positive.html
/LayoutTests/imported/w3c/web-platform-tests/css/css-transforms/css-transform-3d-rotateX-negative-expected.html
/LayoutTests/imported/w3c/web-platform-tests/css/css-transforms/css-transform-3d-rotateX-negative.html
/LayoutTests/imported/w3c/web-platform-tests/css/css-transforms/css-transform-3d-rotateX-positive-expected.html
/LayoutTests/imported/w3c/web-platform-tests/css/css-transforms/css-transform-3d-rotateX-positive.html
/LayoutTests/imported/w3c/web-platform-tests/css/css-transforms/css-transform-3d-rotateY-negative-expected.html
/LayoutTests/imported/w3c/web-platform-tests/css/css-transforms/css-transform-3d-rotateY-negative.html
/LayoutTests/imported/w3c/web-platform-tests/css/css-transforms/css-transform-3d-rotateY-positive-expected.html
/LayoutTests/imported/w3c/web-platform-tests/css/css-transforms/css-transform-3d-rotateY-positive.html
/LayoutTests/imported/w3c/web-platform-tests/css/css-transforms/css-transform-3d-rotateZ-negative-expected.html
/LayoutTests/imported/w3c/web-platform-tests/css/css-transforms/css-transform-3d-rotateZ-negative.html
/LayoutTests/imported/w3c/web-platform-tests/css/css-transforms/css-transform-3d-rotateZ-positive-expected.html
/LayoutTests/imported/w3c/web-platform-tests/css/css-transforms/css-transform-3d-rotateZ-positive.html
/LayoutTests/imported/w3c/web-platform-tests/css/css-transforms/css-transform-3d-transform-style-expected.html
/LayoutTests/imported/w3c/web-platform-tests/css/css-transforms/css-transform-3d-transform-style.html
/LayoutTests/imported/w3c/web-platform-tests/css/css-transforms/css-transform-animate-translate-implied-y-expected.html
/LayoutTests/imported/w3c/web-platform-tests/css/css-transforms/css-transform-animate-translate-implied-y-ref.html
/LayoutTests/imported/w3c/web-platform-tests/css/css-transforms/css-transform-animate-translate-implied-y.html
/LayoutTests/imported/w3c/web-platform-tests/css/css-transforms/css-transform-inherit-rotate.html
/LayoutTests/imported/w3c/web-platform-tests/css/css-transforms/css-transform-inherit-scale-expected.html
/LayoutTests/imported/w3c/web-platform-tests/css/css-transforms/css-transform-inherit-scale.html
/LayoutTests/imported/w3c/web-platform-tests/css/css-transforms/css-transform-property-existence.html
/LayoutTests/imported/w3c/web-platform-tests/css/css-transforms/css-transform-scale-002-expected.html
/LayoutTests/imported/w3c/web-platform-tests/css/css-transforms/css-transform-scale-002.html
/LayoutTests/imported/w3c/web-platform-tests/css/css-transforms/css-transform-style-evaluation-validation.html
/LayoutTests/imported/w3c/web-platform-tests/css/css-transforms/css-transforms-3d-on-anonymous-block-001-expected.html
/LayoutTests/imported/w3c/web-platform-tests/css/css-transforms/css-transforms-3d-on-anonymous-block-001.html
/LayoutTests/imported/w3c/web-platform-tests/css/css-transforms/css-transforms-transformlist-expected.html
/LayoutTests/imported/w3c/web-platform-tests/css/css-transforms/css-transforms-transformlist.html
/LayoutTests/imported/w3c/web-platform-tests/css/css-transforms/css3-transform-perspective-expected.html
/LayoutTests/imported/w3c/web-platform-tests/css/css-transforms/css3-transform-perspective.html
/LayoutTests/imported/w3c/web-platform-tests/css/css-transforms/css3-transform-rotateY-expected.html
/LayoutTests/imported/w3c/web-platform-tests/css/css-transforms/css3-transform-rotateY-ref.html
/LayoutTests/imported/w3c/web-platform-tests/css/css-transforms/css3-transform-rotateY.html
/LayoutTests/imported/w3c/web-platform-tests/css/css-transforms/css3-transform-scale-002-expected.html
/LayoutTests/imported/w3c/web-platform-tests/css/css-transforms/css3-transform-scale-002.html
/LayoutTests/imported/w3c/web-platform-tests/css/css-transforms/css3-transform-scale-expected.html
/LayoutTests/imported/w3c/web-platform-tests/css/css-transforms/css3-transform-scale.html
/LayoutTests/imported/w3c/web-platform-tests/css/css-transforms/dynamic-fixed-pos-cb-change-expected.html
/LayoutTests/imported/w3c/web-platform-tests/css/css-transforms/dynamic-fixed-pos-cb-change-ref.html
/LayoutTests/imported/w3c/web-platform-tests/css/css-transforms/dynamic-fixed-pos-cb-change.html
/LayoutTests/imported/w3c/web-platform-tests/css/css-transforms/fractional-scale-gradient-bg-obscure-red-bg-expected.html
/LayoutTests/imported/w3c/web-platform-tests/css/css-transforms/fractional-scale-gradient-bg-obscure-red-bg-ref.html
/LayoutTests/imported/w3c/web-platform-tests/css/css-transforms/fractional-scale-gradient-bg-obscure-red-bg.html
/LayoutTests/imported/w3c/web-platform-tests/css/css-transforms/huge-length-tiny-scale-expected.html
/LayoutTests/imported/w3c/web-platform-tests/css/css-transforms/huge-length-tiny-scale-ref.html
/LayoutTests/imported/w3c/web-platform-tests/css/css-transforms/huge-length-tiny-scale.html
/LayoutTests/imported/w3c/web-platform-tests/css/css-transforms/inheritance.html
/LayoutTests/imported/w3c/web-platform-tests/css/css-transforms/inline-with-filter-and-hidden-backface.html
/LayoutTests/imported/w3c/web-platform-tests/css/css-transforms/large-matrix-crash.html
/LayoutTests/imported/w3c/web-platform-tests/css/css-transforms/paint-order-with-transform-change-expected.html
/LayoutTests/imported/w3c/web-platform-tests/css/css-transforms/paint-order-with-transform-change-ref.html
/LayoutTests/imported/w3c/web-platform-tests/css/css-transforms/paint-order-with-transform-change.html
/LayoutTests/imported/w3c/web-platform-tests/css/css-transforms/perspective-children-only-abspos-expected.html
/LayoutTests/imported/w3c/web-platform-tests/css/css-transforms/perspective-children-only-abspos.html
/LayoutTests/imported/w3c/web-platform-tests/css/css-transforms/perspective-children-only-fixpos-expected.html
/LayoutTests/imported/w3c/web-platform-tests/css/css-transforms/perspective-children-only-fixpos.html
/LayoutTests/imported/w3c/web-platform-tests/css/css-transforms/perspective-children-only-inline-expected.html
/LayoutTests/imported/w3c/web-platform-tests/css/css-transforms/perspective-children-only-inline.html
/LayoutTests/imported/w3c/web-platform-tests/css/css-transforms/perspective-containing-block-dynamic-1a-expected.html
/LayoutTests/imported/w3c/web-platform-tests/css/css-transforms/perspective-containing-block-dynamic-1a.html
/LayoutTests/imported/w3c/web-platform-tests/css/css-transforms/perspective-containing-block-dynamic-1b-expected.html
/LayoutTests/imported/w3c/web-platform-tests/css/css-transforms/perspective-containing-block-dynamic-1b.html
/LayoutTests/imported/w3c/web-platform-tests/css/css-transforms/perspective-origin-001-expected.xht
/LayoutTests/imported/w3c/web-platform-tests/css/css-transforms/perspective-origin-001.html
/LayoutTests/imported/w3c/web-platform-tests/css/css-transforms/perspective-origin-002-expected.xht
/LayoutTests/imported/w3c/web-platform-tests/css/css-transforms/perspective-origin-002.html
/LayoutTests/imported/w3c/web-platform-tests/css/css-transforms/perspective-origin-003-expected.xht
/LayoutTests/imported/w3c/web-platform-tests/css/css-transforms/perspective-origin-003.html
/LayoutTests/imported/w3c/web-platform-tests/css/css-transforms/perspective-origin-004-expected.xht
/LayoutTests/imported/w3c/web-platform-tests/css/css-transforms/perspective-origin-004.html
/LayoutTests/imported/w3c/web-platform-tests/css/css-transforms/perspective-origin-005-expected.xht
/LayoutTests/imported/w3c/web-platform-tests/css/css-transforms/perspective-origin-005.html
/LayoutTests/imported/w3c/web-platform-tests/css/css-transforms/perspective-origin-006-expected.xht
/LayoutTests/imported/w3c/web-platform-tests/css/css-transforms/perspective-origin-006.html
/LayoutTests/imported/w3c/web-platform-tests/css/css-transforms/perspective-origin-x-expected.html
/LayoutTests/imported/w3c/web-platform-tests/css/css-transforms/perspective-origin-x.html
/LayoutTests/imported/w3c/web-platform-tests/css/css-transforms/perspective-origin-xy-expected.html
/LayoutTests/imported/w3c/web-platform-tests/css/css-transforms/perspective-origin-xy.html
/LayoutTests/imported/w3c/web-platform-tests/css/css-transforms/perspective-split-by-zero-w-expected.html
/LayoutTests/imported/w3c/web-platform-tests/css/css-transforms/perspective-split-by-zero-w-ref.html
/LayoutTests/imported/w3c/web-platform-tests/css/css-transforms/perspective-split-by-zero-w.html
/LayoutTests/imported/w3c/web-platform-tests/css/css-transforms/perspective-svg-001-expected.html
/LayoutTests/imported/w3c/web-platform-tests/css/css-transforms/perspective-svg-001-ref.html
/LayoutTests/imported/w3c/web-platform-tests/css/css-transforms/perspective-svg-001.html
/LayoutTests/imported/w3c/web-platform-tests/css/css-transforms/perspective-transforms-equivalence-expected.html
/LayoutTests/imported/w3c/web-platform-tests/css/css-transforms/perspective-transforms-equivalence-ref.html
/LayoutTests/imported/w3c/web-platform-tests/css/css-transforms/perspective-transforms-equivalence.html
/LayoutTests/imported/w3c/web-platform-tests/css/css-transforms/perspective-translateZ-0-expected.html
/LayoutTests/imported/w3c/web-platform-tests/css/css-transforms/perspective-translateZ-0.html
/LayoutTests/imported/w3c/web-platform-tests/css/css-transforms/perspective-translateZ-negative-expected.html
/LayoutTests/imported/w3c/web-platform-tests/css/css-transforms/perspective-translateZ-negative.html
/LayoutTests/imported/w3c/web-platform-tests/css/css-transforms/perspective-translateZ-positive-expected.html
/LayoutTests/imported/w3c/web-platform-tests/css/css-transforms/perspective-translateZ-positive.html
/LayoutTests/imported/w3c/web-platform-tests/css/css-transforms/perspective-untransformable-no-stacking-context-expected.html
/LayoutTests/imported/w3c/web-platform-tests/css/css-transforms/perspective-untransformable-no-stacking-context-ref.html
/LayoutTests/imported/w3c/web-platform-tests/css/css-transforms/perspective-untransformable-no-stacking-context.html
/LayoutTests/imported/w3c/web-platform-tests/css/css-transforms/perspective-zero-2-expected.html
/LayoutTests/imported/w3c/web-platform-tests/css/css-transforms/perspective-zero-2-ref.html
/LayoutTests/imported/w3c/web-platform-tests/css/css-transforms/perspective-zero-2.html
/LayoutTests/imported/w3c/web-platform-tests/css/css-transforms/perspective-zero-3-expected.html
/LayoutTests/imported/w3c/web-platform-tests/css/css-transforms/perspective-zero-3.html
/LayoutTests/imported/w3c/web-platform-tests/css/css-transforms/perspective-zero-expected.html
/LayoutTests/imported/w3c/web-platform-tests/css/css-transforms/perspective-zero.html
/LayoutTests/imported/w3c/web-platform-tests/css/css-transforms/preserve-3d-flat-grouping-properties-containing-block-inline-ref.html
/LayoutTests/imported/w3c/web-platform-tests/css/css-transforms/preserve-3d-flat-grouping-properties-containing-block-inline.tentative-expected.html
/LayoutTests/imported/w3c/web-platform-tests/css/css-transforms/preserve-3d-flat-grouping-properties-containing-block-inline.tentative.html
/LayoutTests/imported/w3c/web-platform-tests/css/css-transforms/preserve-3d-flat-grouping-properties-containing-block.html
/LayoutTests/imported/w3c/web-platform-tests/css/css-transforms/preserve-3d-flat-grouping-properties.html
/LayoutTests/imported/w3c/web-platform-tests/css/css-transforms/preserve3d-and-filter-no-perspective-expected.html
/LayoutTests/imported/w3c/web-platform-tests/css/css-transforms/preserve3d-and-filter-no-perspective-ref.html
/LayoutTests/imported/w3c/web-platform-tests/css/css-transforms/preserve3d-and-filter-no-perspective.html
/LayoutTests/imported/w3c/web-platform-tests/css/css-transforms/preserve3d-and-filter-with-perspective-expected.html
/LayoutTests/imported/w3c/web-platform-tests/css/css-transforms/preserve3d-and-filter-with-perspective-ref.html
/LayoutTests/imported/w3c/web-platform-tests/css/css-transforms/preserve3d-and-filter-with-perspective.html
/LayoutTests/imported/w3c/web-platform-tests/css/css-transforms/preserve3d-and-flattening-001-expected.html
/LayoutTests/imported/w3c/web-platform-tests/css/css-transforms/preserve3d-and-flattening-001-ref.html
/LayoutTests/imported/w3c/web-platform-tests/css/css-transforms/preserve3d-and-flattening-001.html
/LayoutTests/imported/w3c/web-platform-tests/css/css-transforms/preserve3d-and-flattening-002-expected.html
/LayoutTests/imported/w3c/web-platform-tests/css/css-transforms/preserve3d-and-flattening-002-ref.html
/LayoutTests/imported/w3c/web-platform-tests/css/css-transforms/preserve3d-and-flattening-002.html
/LayoutTests/imported/w3c/web-platform-tests/css/css-transforms/preserve3d-and-flattening-003-expected.html
/LayoutTests/imported/w3c/web-platform-tests/css/css-transforms/preserve3d-and-flattening-003.html
/LayoutTests/imported/w3c/web-platform-tests/css/css-transforms/preserve3d-and-flattening-z-order-001-expected.html
/LayoutTests/imported/w3c/web-platform-tests/css/css-transforms/preserve3d-and-flattening-z-order-001.html
/LayoutTests/imported/w3c/web-platform-tests/css/css-transforms/preserve3d-and-flattening-z-order-002-expected.html
/LayoutTests/imported/w3c/web-platform-tests/css/css-transforms/preserve3d-and-flattening-z-order-002.html
/LayoutTests/imported/w3c/web-platform-tests/css/css-transforms/preserve3d-and-flattening-z-order-003-expected.html
/LayoutTests/imported/w3c/web-platform-tests/css/css-transforms/preserve3d-and-flattening-z-order-003.html
/LayoutTests/imported/w3c/web-platform-tests/css/css-transforms/preserve3d-and-flattening-z-order-004-expected.html
/LayoutTests/imported/w3c/web-platform-tests/css/css-transforms/preserve3d-and-flattening-z-order-004.html
/LayoutTests/imported/w3c/web-platform-tests/css/css-transforms/preserve3d-and-flattening-z-order-005-expected.html
/LayoutTests/imported/w3c/web-platform-tests/css/css-transforms/preserve3d-and-flattening-z-order-005.html
/LayoutTests/imported/w3c/web-platform-tests/css/css-transforms/preserve3d-and-flattening-z-order-006-expected.html
/LayoutTests/imported/w3c/web-platform-tests/css/css-transforms/preserve3d-and-flattening-z-order-006.html
/LayoutTests/imported/w3c/web-platform-tests/css/css-transforms/preserve3d-and-flattening-z-order-007-expected.html
/LayoutTests/imported/w3c/web-platform-tests/css/css-transforms/preserve3d-and-flattening-z-order-007.html
/LayoutTests/imported/w3c/web-platform-tests/css/css-transforms/preserve3d-and-flattening-z-order-008-expected.html
/LayoutTests/imported/w3c/web-platform-tests/css/css-transforms/preserve3d-and-flattening-z-order-008.html
/LayoutTests/imported/w3c/web-platform-tests/css/css-transforms/preserve3d-button-expected.html
/LayoutTests/imported/w3c/web-platform-tests/css/css-transforms/preserve3d-button-ref.html
/LayoutTests/imported/w3c/web-platform-tests/css/css-transforms/preserve3d-button.html
/LayoutTests/imported/w3c/web-platform-tests/css/css-transforms/preserve3d-nested-perspective-expected.html
/LayoutTests/imported/w3c/web-platform-tests/css/css-transforms/preserve3d-nested-perspective-ref.html
/LayoutTests/imported/w3c/web-platform-tests/css/css-transforms/preserve3d-nested-perspective.html
/LayoutTests/imported/w3c/web-platform-tests/css/css-transforms/preserve3d-overflow-percent-expected-mismatch.html
/LayoutTests/imported/w3c/web-platform-tests/css/css-transforms/preserve3d-overflow-percent.html
/LayoutTests/imported/w3c/web-platform-tests/css/css-transforms/rotate-180-degrees-001.html
/LayoutTests/imported/w3c/web-platform-tests/css/css-transforms/rotate-270-degrees-001.html
/LayoutTests/imported/w3c/web-platform-tests/css/css-transforms/rotate-90-degrees-001.html
/LayoutTests/imported/w3c/web-platform-tests/css/css-transforms/rotateY-180deg-with-overflow-scroll-expected.html
/LayoutTests/imported/w3c/web-platform-tests/css/css-transforms/rotateY-180deg-with-overflow-scroll-ref.html
/LayoutTests/imported/w3c/web-platform-tests/css/css-transforms/rotateY-180deg-with-overflow-scroll.html
/LayoutTests/imported/w3c/web-platform-tests/css/css-transforms/rotateY-expected.html
/LayoutTests/imported/w3c/web-platform-tests/css/css-transforms/rotateY.html
/LayoutTests/imported/w3c/web-platform-tests/css/css-transforms/rotate_45deg-expected.html
/LayoutTests/imported/w3c/web-platform-tests/css/css-transforms/rotate_45deg-ref.html
/LayoutTests/imported/w3c/web-platform-tests/css/css-transforms/rotate_45deg.html
/LayoutTests/imported/w3c/web-platform-tests/css/css-transforms/rotate_x_45deg-expected.html
/LayoutTests/imported/w3c/web-platform-tests/css/css-transforms/rotate_x_45deg-ref.html
/LayoutTests/imported/w3c/web-platform-tests/css/css-transforms/rotate_x_45deg.html
/LayoutTests/imported/w3c/web-platform-tests/css/css-transforms/rotate_y_45deg-expected.html
/LayoutTests/imported/w3c/web-platform-tests/css/css-transforms/rotate_y_45deg-ref.html
/LayoutTests/imported/w3c/web-platform-tests/css/css-transforms/rotate_y_45deg.html
/LayoutTests/imported/w3c/web-platform-tests/css/css-transforms/rotated-clip-under-opacity-expected.html
/LayoutTests/imported/w3c/web-platform-tests/css/css-transforms/rotated-clip-under-opacity.html
/LayoutTests/imported/w3c/web-platform-tests/css/css-transforms/scale-optional-second-001-expected.html
/LayoutTests/imported/w3c/web-platform-tests/css/css-transforms/scale-optional-second-001.html
/LayoutTests/imported/w3c/web-platform-tests/css/css-transforms/scale-transform-overlap-expected.html
/LayoutTests/imported/w3c/web-platform-tests/css/css-transforms/scale-transform-overlap-ref.html
/LayoutTests/imported/w3c/web-platform-tests/css/css-transforms/scale-transform-overlap.html
/LayoutTests/imported/w3c/web-platform-tests/css/css-transforms/scale-zero-001-expected.html
/LayoutTests/imported/w3c/web-platform-tests/css/css-transforms/scale-zero-001.html
/LayoutTests/imported/w3c/web-platform-tests/css/css-transforms/scalex-expected.html
/LayoutTests/imported/w3c/web-platform-tests/css/css-transforms/scalex-ref.html
/LayoutTests/imported/w3c/web-platform-tests/css/css-transforms/scalex.html
/LayoutTests/imported/w3c/web-platform-tests/css/css-transforms/scaley-expected.html
/LayoutTests/imported/w3c/web-platform-tests/css/css-transforms/scaley-ref.html
/LayoutTests/imported/w3c/web-platform-tests/css/css-transforms/scaley.html
/LayoutTests/imported/w3c/web-platform-tests/css/css-transforms/scroll-preserve-3d.html
/LayoutTests/imported/w3c/web-platform-tests/css/css-transforms/scrollable-hidden-3d-transform-z-expected.html
/LayoutTests/imported/w3c/web-platform-tests/css/css-transforms/scrollable-hidden-3d-transform-z-ref.html
/LayoutTests/imported/w3c/web-platform-tests/css/css-transforms/scrollable-hidden-3d-transform-z.html
/LayoutTests/imported/w3c/web-platform-tests/css/css-transforms/scrollable-scroll-3d-transform-z-expected.html
/LayoutTests/imported/w3c/web-platform-tests/css/css-transforms/scrollable-scroll-3d-transform-z-ref.html
/LayoutTests/imported/w3c/web-platform-tests/css/css-transforms/scrollable-scroll-3d-transform-z.html
/LayoutTests/imported/w3c/web-platform-tests/css/css-transforms/size-change-under-backface-visibility-hidden-expected.html
/LayoutTests/imported/w3c/web-platform-tests/css/css-transforms/size-change-under-backface-visibility-hidden-ref.html
/LayoutTests/imported/w3c/web-platform-tests/css/css-transforms/size-change-under-backface-visibility-hidden.html
/LayoutTests/imported/w3c/web-platform-tests/css/css-transforms/skew-test1-expected.html
/LayoutTests/imported/w3c/web-platform-tests/css/css-transforms/skew-test1.html
/LayoutTests/imported/w3c/web-platform-tests/css/css-transforms/subpixel-perspective-backface-hidden-expected.html
/LayoutTests/imported/w3c/web-platform-tests/css/css-transforms/subpixel-perspective-backface-hidden-ref.html
/LayoutTests/imported/w3c/web-platform-tests/css/css-transforms/subpixel-perspective-backface-hidden.html
/LayoutTests/imported/w3c/web-platform-tests/css/css-transforms/subpixel-perspective-translate-z-0-expected.html
/LayoutTests/imported/w3c/web-platform-tests/css/css-transforms/subpixel-perspective-translate-z-0-ref.html
/LayoutTests/imported/w3c/web-platform-tests/css/css-transforms/subpixel-perspective-translate-z-0.html
/LayoutTests/imported/w3c/web-platform-tests/css/css-transforms/subpixel-transform-changes-001-expected.html
/LayoutTests/imported/w3c/web-platform-tests/css/css-transforms/subpixel-transform-changes-001.html
/LayoutTests/imported/w3c/web-platform-tests/css/css-transforms/subpixel-transform-changes-002-expected.html
/LayoutTests/imported/w3c/web-platform-tests/css/css-transforms/subpixel-transform-changes-002.html
/LayoutTests/imported/w3c/web-platform-tests/css/css-transforms/subpixel-transform-changes-003-expected.html
/LayoutTests/imported/w3c/web-platform-tests/css/css-transforms/subpixel-transform-changes-003.html
/LayoutTests/imported/w3c/web-platform-tests/css/css-transforms/subpixel-transform-changes-004-expected.html
/LayoutTests/imported/w3c/web-platform-tests/css/css-transforms/subpixel-transform-changes-004.html
/LayoutTests/imported/w3c/web-platform-tests/css/css-transforms/text-perspective-001.html
/LayoutTests/imported/w3c/web-platform-tests/css/css-transforms/transform-2d-getComputedStyle-001.html
/LayoutTests/imported/w3c/web-platform-tests/css/css-transforms/transform-3d-fixed-under-fixed-opacity-crash.html
/LayoutTests/imported/w3c/web-platform-tests/css/css-transforms/transform-3d-rotateY-stair-above-001-expected.xht
/LayoutTests/imported/w3c/web-platform-tests/css/css-transforms/transform-3d-rotateY-stair-above-001.xht
/LayoutTests/imported/w3c/web-platform-tests/css/css-transforms/transform-3d-rotateY-stair-below-001-expected.xht
/LayoutTests/imported/w3c/web-platform-tests/css/css-transforms/transform-3d-rotateY-stair-below-001.xht
/LayoutTests/imported/w3c/web-platform-tests/css/css-transforms/transform-3d-scales-different-x-y-dynamic-001-expected.html
/LayoutTests/imported/w3c/web-platform-tests/css/css-transforms/transform-3d-scales-different-x-y-dynamic-001-ref.html
/LayoutTests/imported/w3c/web-platform-tests/css/css-transforms/transform-3d-scales-different-x-y-dynamic-001.html
/LayoutTests/imported/w3c/web-platform-tests/css/css-transforms/transform-3d-scales-different-x-y-dynamic-002-expected.html
/LayoutTests/imported/w3c/web-platform-tests/css/css-transforms/transform-3d-scales-different-x-y-dynamic-002-ref.html
/LayoutTests/imported/w3c/web-platform-tests/css/css-transforms/transform-3d-scales-different-x-y-dynamic-002.html
/LayoutTests/imported/w3c/web-platform-tests/css/css-transforms/transform-abspos-001-expected.html
/LayoutTests/imported/w3c/web-platform-tests/css/css-transforms/transform-abspos-001.html
/LayoutTests/imported/w3c/web-platform-tests/css/css-transforms/transform-abspos-002-expected.html
/LayoutTests/imported/w3c/web-platform-tests/css/css-transforms/transform-abspos-002.html
/LayoutTests/imported/w3c/web-platform-tests/css/css-transforms/transform-abspos-003-expected.html
/LayoutTests/imported/w3c/web-platform-tests/css/css-transforms/transform-abspos-003.html
/LayoutTests/imported/w3c/web-platform-tests/css/css-transforms/transform-abspos-004-expected.html
/LayoutTests/imported/w3c/web-platform-tests/css/css-transforms/transform-abspos-004.html
/LayoutTests/imported/w3c/web-platform-tests/css/css-transforms/transform-abspos-005-expected-mismatch.html
/LayoutTests/imported/w3c/web-platform-tests/css/css-transforms/transform-abspos-005.html
/LayoutTests/imported/w3c/web-platform-tests/css/css-transforms/transform-abspos-006-expected.html
/LayoutTests/imported/w3c/web-platform-tests/css/css-transforms/transform-abspos-006.html
/LayoutTests/imported/w3c/web-platform-tests/css/css-transforms/transform-abspos-007-expected.html
/LayoutTests/imported/w3c/web-platform-tests/css/css-transforms/transform-abspos-007.html
/LayoutTests/imported/w3c/web-platform-tests/css/css-transforms/transform-abspos-ref.html
/LayoutTests/imported/w3c/web-platform-tests/css/css-transforms/transform-and-individual-transform-properties-computed-style.html
/LayoutTests/imported/w3c/web-platform-tests/css/css-transforms/transform-applies-to-001-expected.xht
/LayoutTests/imported/w3c/web-platform-tests/css/css-transforms/transform-applies-to-001.xht
/LayoutTests/imported/w3c/web-platform-tests/css/css-transforms/transform-applies-to-002-expected.xht
/LayoutTests/imported/w3c/web-platform-tests/css/css-transforms/transform-applies-to-002.xht
/LayoutTests/imported/w3c/web-platform-tests/css/css-transforms/transform-background-001-expected.html
/LayoutTests/imported/w3c/web-platform-tests/css/css-transforms/transform-background-001.html
/LayoutTests/imported/w3c/web-platform-tests/css/css-transforms/transform-background-002-expected.html
/LayoutTests/imported/w3c/web-platform-tests/css/css-transforms/transform-background-002.html
/LayoutTests/imported/w3c/web-platform-tests/css/css-transforms/transform-background-003-expected.html
/LayoutTests/imported/w3c/web-platform-tests/css/css-transforms/transform-background-003.html
/LayoutTests/imported/w3c/web-platform-tests/css/css-transforms/transform-background-004-expected.html
/LayoutTests/imported/w3c/web-platform-tests/css/css-transforms/transform-background-004.html
/LayoutTests/imported/w3c/web-platform-tests/css/css-transforms/transform-background-005-expected.html
/LayoutTests/imported/w3c/web-platform-tests/css/css-transforms/transform-background-005.html
/LayoutTests/imported/w3c/web-platform-tests/css/css-transforms/transform-background-006-expected.html
/LayoutTests/imported/w3c/web-platform-tests/css/css-transforms/transform-background-006-notref.html
/LayoutTests/imported/w3c/web-platform-tests/css/css-transforms/transform-background-006.html
/LayoutTests/imported/w3c/web-platform-tests/css/css-transforms/transform-background-007-expected.html
/LayoutTests/imported/w3c/web-platform-tests/css/css-transforms/transform-background-007.html
/LayoutTests/imported/w3c/web-platform-tests/css/css-transforms/transform-background-008-expected.html
/LayoutTests/imported/w3c/web-platform-tests/css/css-transforms/transform-background-008.html
/LayoutTests/imported/w3c/web-platform-tests/css/css-transforms/transform-blank-ref.html
/LayoutTests/imported/w3c/web-platform-tests/css/css-transforms/transform-compound-001-expected.html
/LayoutTests/imported/w3c/web-platform-tests/css/css-transforms/transform-compound-001.html
/LayoutTests/imported/w3c/web-platform-tests/css/css-transforms/transform-compound-ref.html
/LayoutTests/imported/w3c/web-platform-tests/css/css-transforms/transform-containing-block-dynamic-1a-expected.html
/LayoutTests/imported/w3c/web-platform-tests/css/css-transforms/transform-containing-block-dynamic-1a.html
/LayoutTests/imported/w3c/web-platform-tests/css/css-transforms/transform-containing-block-dynamic-1b-expected.html
/LayoutTests/imported/w3c/web-platform-tests/css/css-transforms/transform-containing-block-dynamic-1b.html
/LayoutTests/imported/w3c/web-platform-tests/css/css-transforms/transform-descendant-001-expected.html
/LayoutTests/imported/w3c/web-platform-tests/css/css-transforms/transform-descendant-001.html
/LayoutTests/imported/w3c/web-platform-tests/css/css-transforms/transform-descendant-ref.html
/LayoutTests/imported/w3c/web-platform-tests/css/css-transforms/transform-display-001-expected.html
/LayoutTests/imported/w3c/web-platform-tests/css/css-transforms/transform-display-001.html
/LayoutTests/imported/w3c/web-platform-tests/css/css-transforms/transform-display-002-expected.html
/LayoutTests/imported/w3c/web-platform-tests/css/css-transforms/transform-display-002.html
/LayoutTests/imported/w3c/web-platform-tests/css/css-transforms/transform-display-003-expected.html
/LayoutTests/imported/w3c/web-platform-tests/css/css-transforms/transform-display-003.html
/LayoutTests/imported/w3c/web-platform-tests/css/css-transforms/transform-display-004-expected.html
/LayoutTests/imported/w3c/web-platform-tests/css/css-transforms/transform-display-004.html
/LayoutTests/imported/w3c/web-platform-tests/css/css-transforms/transform-display-notref.html
/LayoutTests/imported/w3c/web-platform-tests/css/css-transforms/transform-display-ref.html
/LayoutTests/imported/w3c/web-platform-tests/css/css-transforms/transform-fixed-bg-001-expected.html
/LayoutTests/imported/w3c/web-platform-tests/css/css-transforms/transform-fixed-bg-001.html
/LayoutTests/imported/w3c/web-platform-tests/css/css-transforms/transform-fixed-bg-002-expected.html
/LayoutTests/imported/w3c/web-platform-tests/css/css-transforms/transform-fixed-bg-002.html
/LayoutTests/imported/w3c/web-platform-tests/css/css-transforms/transform-fixed-bg-003-expected.html
/LayoutTests/imported/w3c/web-platform-tests/css/css-transforms/transform-fixed-bg-003.html
/LayoutTests/imported/w3c/web-platform-tests/css/css-transforms/transform-fixed-bg-004-expected.html
/LayoutTests/imported/w3c/web-platform-tests/css/css-transforms/transform-fixed-bg-004.html
/LayoutTests/imported/w3c/web-platform-tests/css/css-transforms/transform-fixed-bg-005-expected.html
/LayoutTests/imported/w3c/web-platform-tests/css/css-transforms/transform-fixed-bg-005.html
/LayoutTests/imported/w3c/web-platform-tests/css/css-transforms/transform-fixed-bg-006-expected.html
/LayoutTests/imported/w3c/web-platform-tests/css/css-transforms/transform-fixed-bg-006.html
/LayoutTests/imported/w3c/web-platform-tests/css/css-transforms/transform-fixed-bg-007-expected.html
/LayoutTests/imported/w3c/web-platform-tests/css/css-transforms/transform-fixed-bg-007.html
/LayoutTests/imported/w3c/web-platform-tests/css/css-transforms/transform-fixed-bg-008.tentative-expected.html
/LayoutTests/imported/w3c/web-platform-tests/css/css-transforms/transform-fixed-bg-008.tentative.html
/LayoutTests/imported/w3c/web-platform-tests/css/css-transforms/transform-fixed-bg-ref.html
/LayoutTests/imported/w3c/web-platform-tests/css/css-transforms/transform-flattening-001.html
/LayoutTests/imported/w3c/web-platform-tests/css/css-transforms/transform-generated-001-expected.html
/LayoutTests/imported/w3c/web-platform-tests/css/css-transforms/transform-generated-001-notref.html
/LayoutTests/imported/w3c/web-platform-tests/css/css-transforms/transform-generated-001-ref.html
/LayoutTests/imported/w3c/web-platform-tests/css/css-transforms/transform-generated-001.html
/LayoutTests/imported/w3c/web-platform-tests/css/css-transforms/transform-generated-002-expected.html
/LayoutTests/imported/w3c/web-platform-tests/css/css-transforms/transform-generated-002-notref.html
/LayoutTests/imported/w3c/web-platform-tests/css/css-transforms/transform-generated-002-ref.html
/LayoutTests/imported/w3c/web-platform-tests/css/css-transforms/transform-generated-002.html
/LayoutTests/imported/w3c/web-platform-tests/css/css-transforms/transform-getBoundingClientRect-001.html
/LayoutTests/imported/w3c/web-platform-tests/css/css-transforms/transform-hit-testing.html
/LayoutTests/imported/w3c/web-platform-tests/css/css-transforms/transform-iframe-001-expected.html
/LayoutTests/imported/w3c/web-platform-tests/css/css-transforms/transform-iframe-001.html
/LayoutTests/imported/w3c/web-platform-tests/css/css-transforms/transform-iframe-ref.html
/LayoutTests/imported/w3c/web-platform-tests/css/css-transforms/transform-image-001-expected.html
/LayoutTests/imported/w3c/web-platform-tests/css/css-transforms/transform-image-001.html
/LayoutTests/imported/w3c/web-platform-tests/css/css-transforms/transform-image-ref.html
/LayoutTests/imported/w3c/web-platform-tests/css/css-transforms/transform-inherit-001-expected.html
/LayoutTests/imported/w3c/web-platform-tests/css/css-transforms/transform-inherit-001.html
/LayoutTests/imported/w3c/web-platform-tests/css/css-transforms/transform-inherit-002-expected.html
/LayoutTests/imported/w3c/web-platform-tests/css/css-transforms/transform-inherit-002.html
/LayoutTests/imported/w3c/web-platform-tests/css/css-transforms/transform-inherit-origin-001-expected.html
/LayoutTests/imported/w3c/web-platform-tests/css/css-transforms/transform-inherit-origin-001.html
/LayoutTests/imported/w3c/web-platform-tests/css/css-transforms/transform-inherit-origin-002-expected.html
/LayoutTests/imported/w3c/web-platform-tests/css/css-transforms/transform-inherit-origin-002.html
/LayoutTests/imported/w3c/web-platform-tests/css/css-transforms/transform-inherit-origin-ref.html
/LayoutTests/imported/w3c/web-platform-tests/css/css-transforms/transform-inherit-ref.html
/LayoutTests/imported/w3c/web-platform-tests/css/css-transforms/transform-inline-001-expected.html
/LayoutTests/imported/w3c/web-platform-tests/css/css-transforms/transform-inline-001.html
/LayoutTests/imported/w3c/web-platform-tests/css/css-transforms/transform-inline-notref.html
/LayoutTests/imported/w3c/web-platform-tests/css/css-transforms/transform-inline-ref.html
/LayoutTests/imported/w3c/web-platform-tests/css/css-transforms/transform-input-001-expected.html
/LayoutTests/imported/w3c/web-platform-tests/css/css-transforms/transform-input-001-ref.html
/LayoutTests/imported/w3c/web-platform-tests/css/css-transforms/transform-input-001.html
/LayoutTests/imported/w3c/web-platform-tests/css/css-transforms/transform-input-002-expected.html
/LayoutTests/imported/w3c/web-platform-tests/css/css-transforms/transform-input-002-ref.html
/LayoutTests/imported/w3c/web-platform-tests/css/css-transforms/transform-input-002.html
/LayoutTests/imported/w3c/web-platform-tests/css/css-transforms/transform-input-003-expected.html
/LayoutTests/imported/w3c/web-platform-tests/css/css-transforms/transform-input-003-ref.html
/LayoutTests/imported/w3c/web-platform-tests/css/css-transforms/transform-input-003.html
/LayoutTests/imported/w3c/web-platform-tests/css/css-transforms/transform-input-004-expected.html
/LayoutTests/imported/w3c/web-platform-tests/css/css-transforms/transform-input-004-ref.html
/LayoutTests/imported/w3c/web-platform-tests/css/css-transforms/transform-input-004.html
/LayoutTests/imported/w3c/web-platform-tests/css/css-transforms/transform-input-005-expected.html
/LayoutTests/imported/w3c/web-platform-tests/css/css-transforms/transform-input-005-ref.html
/LayoutTests/imported/w3c/web-platform-tests/css/css-transforms/transform-input-005.html
/LayoutTests/imported/w3c/web-platform-tests/css/css-transforms/transform-input-006-expected.html
/LayoutTests/imported/w3c/web-platform-tests/css/css-transforms/transform-input-006-ref.html
/LayoutTests/imported/w3c/web-platform-tests/css/css-transforms/transform-input-006.html
/LayoutTests/imported/w3c/web-platform-tests/css/css-transforms/transform-input-007-expected.html
/LayoutTests/imported/w3c/web-platform-tests/css/css-transforms/transform-input-007-ref.html
/LayoutTests/imported/w3c/web-platform-tests/css/css-transforms/transform-input-007.html
/LayoutTests/imported/w3c/web-platform-tests/css/css-transforms/transform-input-008-expected.html
/LayoutTests/imported/w3c/web-platform-tests/css/css-transforms/transform-input-008-ref.html
/LayoutTests/imported/w3c/web-platform-tests/css/css-transforms/transform-input-008.html
/LayoutTests/imported/w3c/web-platform-tests/css/css-transforms/transform-input-009-expected.html
/LayoutTests/imported/w3c/web-platform-tests/css/css-transforms/transform-input-009-ref.html
/LayoutTests/imported/w3c/web-platform-tests/css/css-transforms/transform-input-009.html
/LayoutTests/imported/w3c/web-platform-tests/css/css-transforms/transform-input-010-expected.html
/LayoutTests/imported/w3c/web-platform-tests/css/css-transforms/transform-input-010-ref.html
/LayoutTests/imported/w3c/web-platform-tests/css/css-transforms/transform-input-010.html
/LayoutTests/imported/w3c/web-platform-tests/css/css-transforms/transform-input-011-expected.html
/LayoutTests/imported/w3c/web-platform-tests/css/css-transforms/transform-input-011-ref.html
/LayoutTests/imported/w3c/web-platform-tests/css/css-transforms/transform-input-011.html
/LayoutTests/imported/w3c/web-platform-tests/css/css-transforms/transform-input-012-expected.html
/LayoutTests/imported/w3c/web-platform-tests/css/css-transforms/transform-input-012-ref.html
/LayoutTests/imported/w3c/web-platform-tests/css/css-transforms/transform-input-012.html
/LayoutTests/imported/w3c/web-platform-tests/css/css-transforms/transform-input-013-expected.html
/LayoutTests/imported/w3c/web-platform-tests/css/css-transforms/transform-input-013-ref.html
/LayoutTests/imported/w3c/web-platform-tests/css/css-transforms/transform-input-013.html
/LayoutTests/imported/w3c/web-platform-tests/css/css-transforms/transform-input-014-expected.html
/LayoutTests/imported/w3c/web-platform-tests/css/css-transforms/transform-input-014-ref.html
/LayoutTests/imported/w3c/web-platform-tests/css/css-transforms/transform-input-014.html
/LayoutTests/imported/w3c/web-platform-tests/css/css-transforms/transform-input-015-expected.html
/LayoutTests/imported/w3c/web-platform-tests/css/css-transforms/transform-input-015-ref.html
/LayoutTests/imported/w3c/web-platform-tests/css/css-transforms/transform-input-015.html
/LayoutTests/imported/w3c/web-platform-tests/css/css-transforms/transform-input-016-expected.html
/LayoutTests/imported/w3c/web-platform-tests/css/css-transforms/transform-input-016-ref.html
/LayoutTests/imported/w3c/web-platform-tests/css/css-transforms/transform-input-016.html
/LayoutTests/imported/w3c/web-platform-tests/css/css-transforms/transform-input-017-expected.html
/LayoutTests/imported/w3c/web-platform-tests/css/css-transforms/transform-input-017-ref.html
/LayoutTests/imported/w3c/web-platform-tests/css/css-transforms/transform-input-017.html
/LayoutTests/imported/w3c/web-platform-tests/css/css-transforms/transform-input-018-expected.html
/LayoutTests/imported/w3c/web-platform-tests/css/css-transforms/transform-input-018-ref.html
/LayoutTests/imported/w3c/web-platform-tests/css/css-transforms/transform-input-018.html
/LayoutTests/imported/w3c/web-platform-tests/css/css-transforms/transform-input-019-expected.html
/LayoutTests/imported/w3c/web-platform-tests/css/css-transforms/transform-input-019-ref.html
/LayoutTests/imported/w3c/web-platform-tests/css/css-transforms/transform-input-019.html
/LayoutTests/imported/w3c/web-platform-tests/css/css-transforms/transform-lime-square-ref.html
/LayoutTests/imported/w3c/web-platform-tests/css/css-transforms/transform-matrix-001-expected.html
/LayoutTests/imported/w3c/web-platform-tests/css/css-transforms/transform-matrix-001-ref.html
/LayoutTests/imported/w3c/web-platform-tests/css/css-transforms/transform-matrix-001.html
/LayoutTests/imported/w3c/web-platform-tests/css/css-transforms/transform-matrix-002-expected.html
/LayoutTests/imported/w3c/web-platform-tests/css/css-transforms/transform-matrix-002-ref.html
/LayoutTests/imported/w3c/web-platform-tests/css/css-transforms/transform-matrix-002.html
/LayoutTests/imported/w3c/web-platform-tests/css/css-transforms/transform-matrix-003-expected.html
/LayoutTests/imported/w3c/web-platform-tests/css/css-transforms/transform-matrix-003-ref.html
/LayoutTests/imported/w3c/web-platform-tests/css/css-transforms/transform-matrix-003.html
/LayoutTests/imported/w3c/web-platform-tests/css/css-transforms/transform-matrix-004-expected.html
/LayoutTests/imported/w3c/web-platform-tests/css/css-transforms/transform-matrix-004-ref.html
/LayoutTests/imported/w3c/web-platform-tests/css/css-transforms/transform-matrix-004.html
/LayoutTests/imported/w3c/web-platform-tests/css/css-transforms/transform-matrix-005-expected.html
/LayoutTests/imported/w3c/web-platform-tests/css/css-transforms/transform-matrix-005-notref.html
/LayoutTests/imported/w3c/web-platform-tests/css/css-transforms/transform-matrix-005-ref.html
/LayoutTests/imported/w3c/web-platform-tests/css/css-transforms/transform-matrix-005.html
/LayoutTests/imported/w3c/web-platform-tests/css/css-transforms/transform-matrix-006-expected.html
/LayoutTests/imported/w3c/web-platform-tests/css/css-transforms/transform-matrix-006-ref.html
/LayoutTests/imported/w3c/web-platform-tests/css/css-transforms/transform-matrix-006.html
/LayoutTests/imported/w3c/web-platform-tests/css/css-transforms/transform-matrix-007-expected.html
/LayoutTests/imported/w3c/web-platform-tests/css/css-transforms/transform-matrix-007-ref.html
/LayoutTests/imported/w3c/web-platform-tests/css/css-transforms/transform-matrix-007.html
/LayoutTests/imported/w3c/web-platform-tests/css/css-transforms/transform-matrix-008-expected.html
/LayoutTests/imported/w3c/web-platform-tests/css/css-transforms/transform-matrix-008-notref.html
/LayoutTests/imported/w3c/web-platform-tests/css/css-transforms/transform-matrix-008-ref.html
/LayoutTests/imported/w3c/web-platform-tests/css/css-transforms/transform-matrix-008.html
/LayoutTests/imported/w3c/web-platform-tests/css/css-transforms/transform-origin-001-expected-mismatch.html
/LayoutTests/imported/w3c/web-platform-tests/css/css-transforms/transform-origin-001.html
/LayoutTests/imported/w3c/web-platform-tests/css/css-transforms/transform-origin-002-expected-mismatch.html
/LayoutTests/imported/w3c/web-platform-tests/css/css-transforms/transform-origin-002.html
/LayoutTests/imported/w3c/web-platform-tests/css/css-transforms/transform-origin-003-expected.html
/LayoutTests/imported/w3c/web-platform-tests/css/css-transforms/transform-origin-003.html
/LayoutTests/imported/w3c/web-platform-tests/css/css-transforms/transform-origin-004-expected.html
/LayoutTests/imported/w3c/web-platform-tests/css/css-transforms/transform-origin-004.html
/LayoutTests/imported/w3c/web-platform-tests/css/css-transforms/transform-origin-005-expected.html
/LayoutTests/imported/w3c/web-platform-tests/css/css-transforms/transform-origin-005.html
/LayoutTests/imported/w3c/web-platform-tests/css/css-transforms/transform-origin-006-expected.html
/LayoutTests/imported/w3c/web-platform-tests/css/css-transforms/transform-origin-006.html
/LayoutTests/imported/w3c/web-platform-tests/css/css-transforms/transform-origin-007-expected.html
/LayoutTests/imported/w3c/web-platform-tests/css/css-transforms/transform-origin-007-ref.html
/LayoutTests/imported/w3c/web-platform-tests/css/css-transforms/transform-origin-007.html
/LayoutTests/imported/w3c/web-platform-tests/css/css-transforms/transform-origin-008-expected.html
/LayoutTests/imported/w3c/web-platform-tests/css/css-transforms/transform-origin-008.html
/LayoutTests/imported/w3c/web-platform-tests/css/css-transforms/transform-origin-009-expected.html
/LayoutTests/imported/w3c/web-platform-tests/css/css-transforms/transform-origin-009.html
/LayoutTests/imported/w3c/web-platform-tests/css/css-transforms/transform-origin-01-expected.html
/LayoutTests/imported/w3c/web-platform-tests/css/css-transforms/transform-origin-01.html
/LayoutTests/imported/w3c/web-platform-tests/css/css-transforms/transform-origin-010-expected.html
/LayoutTests/imported/w3c/web-platform-tests/css/css-transforms/transform-origin-010.html
/LayoutTests/imported/w3c/web-platform-tests/css/css-transforms/transform-origin-011-expected.html
/LayoutTests/imported/w3c/web-platform-tests/css/css-transforms/transform-origin-011.html
/LayoutTests/imported/w3c/web-platform-tests/css/css-transforms/transform-origin-012-expected.html
/LayoutTests/imported/w3c/web-platform-tests/css/css-transforms/transform-origin-012.html
/LayoutTests/imported/w3c/web-platform-tests/css/css-transforms/transform-origin-013-expected.html
/LayoutTests/imported/w3c/web-platform-tests/css/css-transforms/transform-origin-013-ref.html
/LayoutTests/imported/w3c/web-platform-tests/css/css-transforms/transform-origin-013.html
/LayoutTests/imported/w3c/web-platform-tests/css/css-transforms/transform-origin-014.html
/LayoutTests/imported/w3c/web-platform-tests/css/css-transforms/transform-origin-expected.html
/LayoutTests/imported/w3c/web-platform-tests/css/css-transforms/transform-origin-in-shadow.html
/LayoutTests/imported/w3c/web-platform-tests/css/css-transforms/transform-origin-name-001-expected.html
/LayoutTests/imported/w3c/web-platform-tests/css/css-transforms/transform-origin-name-001.html
/LayoutTests/imported/w3c/web-platform-tests/css/css-transforms/transform-origin-name-002-expected.html
/LayoutTests/imported/w3c/web-platform-tests/css/css-transforms/transform-origin-name-002.html
/LayoutTests/imported/w3c/web-platform-tests/css/css-transforms/transform-origin-name-003-expected.html
/LayoutTests/imported/w3c/web-platform-tests/css/css-transforms/transform-origin-name-003.html
/LayoutTests/imported/w3c/web-platform-tests/css/css-transforms/transform-origin-name-004-expected.html
/LayoutTests/imported/w3c/web-platform-tests/css/css-transforms/transform-origin-name-004.html
/LayoutTests/imported/w3c/web-platform-tests/css/css-transforms/transform-origin-name-005-expected.html
/LayoutTests/imported/w3c/web-platform-tests/css/css-transforms/transform-origin-name-005.html
/LayoutTests/imported/w3c/web-platform-tests/css/css-transforms/transform-origin-name-006-expected.html
/LayoutTests/imported/w3c/web-platform-tests/css/css-transforms/transform-origin-name-006.html
/LayoutTests/imported/w3c/web-platform-tests/css/css-transforms/transform-origin-name-007-expected.html
/LayoutTests/imported/w3c/web-platform-tests/css/css-transforms/transform-origin-name-007.html
/LayoutTests/imported/w3c/web-platform-tests/css/css-transforms/transform-origin-name-notref.html
/LayoutTests/imported/w3c/web-platform-tests/css/css-transforms/transform-origin.html
/LayoutTests/imported/w3c/web-platform-tests/css/css-transforms/transform-overflow-001-expected.html
/LayoutTests/imported/w3c/web-platform-tests/css/css-transforms/transform-overflow-001-ref.html
/LayoutTests/imported/w3c/web-platform-tests/css/css-transforms/transform-overflow-001.html
/LayoutTests/imported/w3c/web-platform-tests/css/css-transforms/transform-overflow-002-expected.html
/LayoutTests/imported/w3c/web-platform-tests/css/css-transforms/transform-overflow-002-ref.html
/LayoutTests/imported/w3c/web-platform-tests/css/css-transforms/transform-overflow-002.html
/LayoutTests/imported/w3c/web-platform-tests/css/css-transforms/transform-percent-001-expected.html
/LayoutTests/imported/w3c/web-platform-tests/css/css-transforms/transform-percent-001.html
/LayoutTests/imported/w3c/web-platform-tests/css/css-transforms/transform-percent-002-expected.html
/LayoutTests/imported/w3c/web-platform-tests/css/css-transforms/transform-percent-002.html
/LayoutTests/imported/w3c/web-platform-tests/css/css-transforms/transform-percent-003-expected.html
/LayoutTests/imported/w3c/web-platform-tests/css/css-transforms/transform-percent-003.html
/LayoutTests/imported/w3c/web-platform-tests/css/css-transforms/transform-percent-004-expected.html
/LayoutTests/imported/w3c/web-platform-tests/css/css-transforms/transform-percent-004.html
/LayoutTests/imported/w3c/web-platform-tests/css/css-transforms/transform-percent-005-expected.html
/LayoutTests/imported/w3c/web-platform-tests/css/css-transforms/transform-percent-005.html
/LayoutTests/imported/w3c/web-platform-tests/css/css-transforms/transform-percent-006-expected.html
/LayoutTests/imported/w3c/web-platform-tests/css/css-transforms/transform-percent-006.html
/LayoutTests/imported/w3c/web-platform-tests/css/css-transforms/transform-percent-007-expected.html
/LayoutTests/imported/w3c/web-platform-tests/css/css-transforms/transform-percent-007.html
/LayoutTests/imported/w3c/web-platform-tests/css/css-transforms/transform-percent-008-expected.html
/LayoutTests/imported/w3c/web-platform-tests/css/css-transforms/transform-percent-008.html
/LayoutTests/imported/w3c/web-platform-tests/css/css-transforms/transform-percent-009.html
/LayoutTests/imported/w3c/web-platform-tests/css/css-transforms/transform-percent-010-expected.html
/LayoutTests/imported/w3c/web-platform-tests/css/css-transforms/transform-percent-010.html
/LayoutTests/imported/w3c/web-platform-tests/css/css-transforms/transform-percent-notref.html
/LayoutTests/imported/w3c/web-platform-tests/css/css-transforms/transform-percent-ref.html
/LayoutTests/imported/w3c/web-platform-tests/css/css-transforms/transform-propagate-inherit-boolean-001-expected.html
/LayoutTests/imported/w3c/web-platform-tests/css/css-transforms/transform-propagate-inherit-boolean-001.html
/LayoutTests/imported/w3c/web-platform-tests/css/css-transforms/transform-propagate-inherit-boolean-ref.html
/LayoutTests/imported/w3c/web-platform-tests/css/css-transforms/transform-root-bg-001-expected.html
/LayoutTests/imported/w3c/web-platform-tests/css/css-transforms/transform-root-bg-001-ref.html
/LayoutTests/imported/w3c/web-platform-tests/css/css-transforms/transform-root-bg-001.html
/LayoutTests/imported/w3c/web-platform-tests/css/css-transforms/transform-root-bg-002-expected.html
/LayoutTests/imported/w3c/web-platform-tests/css/css-transforms/transform-root-bg-002.html
/LayoutTests/imported/w3c/web-platform-tests/css/css-transforms/transform-root-bg-003-expected.html
/LayoutTests/imported/w3c/web-platform-tests/css/css-transforms/transform-root-bg-003.html
/LayoutTests/imported/w3c/web-platform-tests/css/css-transforms/transform-root-bg-004-expected.html
/LayoutTests/imported/w3c/web-platform-tests/css/css-transforms/transform-root-bg-004-ref.html
/LayoutTests/imported/w3c/web-platform-tests/css/css-transforms/transform-root-bg-004.html
/LayoutTests/imported/w3c/web-platform-tests/css/css-transforms/transform-rotate-001-expected.html
/LayoutTests/imported/w3c/web-platform-tests/css/css-transforms/transform-rotate-001-notref.html
/LayoutTests/imported/w3c/web-platform-tests/css/css-transforms/transform-rotate-001-ref.html
/LayoutTests/imported/w3c/web-platform-tests/css/css-transforms/transform-rotate-001.html
/LayoutTests/imported/w3c/web-platform-tests/css/css-transforms/transform-rotate-002-expected.html
/LayoutTests/imported/w3c/web-platform-tests/css/css-transforms/transform-rotate-002.html
/LayoutTests/imported/w3c/web-platform-tests/css/css-transforms/transform-rotate-003-expected.html
/LayoutTests/imported/w3c/web-platform-tests/css/css-transforms/transform-rotate-003.html
/LayoutTests/imported/w3c/web-platform-tests/css/css-transforms/transform-rotate-004-expected.html
/LayoutTests/imported/w3c/web-platform-tests/css/css-transforms/transform-rotate-004.html
/LayoutTests/imported/w3c/web-platform-tests/css/css-transforms/transform-rotate-005-expected.html
/LayoutTests/imported/w3c/web-platform-tests/css/css-transforms/transform-rotate-005.html
/LayoutTests/imported/w3c/web-platform-tests/css/css-transforms/transform-rotate-006-expected.html
/LayoutTests/imported/w3c/web-platform-tests/css/css-transforms/transform-rotate-006.html
/LayoutTests/imported/w3c/web-platform-tests/css/css-transforms/transform-rotate-007-expected.html
/LayoutTests/imported/w3c/web-platform-tests/css/css-transforms/transform-rotate-007-notref.html
/LayoutTests/imported/w3c/web-platform-tests/css/css-transforms/transform-rotate-007-ref.html
/LayoutTests/imported/w3c/web-platform-tests/css/css-transforms/transform-rotate-007.html
/LayoutTests/imported/w3c/web-platform-tests/css/css-transforms/transform-rounding-001-expected.html
/LayoutTests/imported/w3c/web-platform-tests/css/css-transforms/transform-rounding-001.html
/LayoutTests/imported/w3c/web-platform-tests/css/css-transforms/transform-rounding-ref.html
/LayoutTests/imported/w3c/web-platform-tests/css/css-transforms/transform-scale-001-expected.html
/LayoutTests/imported/w3c/web-platform-tests/css/css-transforms/transform-scale-001.html
/LayoutTests/imported/w3c/web-platform-tests/css/css-transforms/transform-scale-002-expected.html
/LayoutTests/imported/w3c/web-platform-tests/css/css-transforms/transform-scale-002.html
/LayoutTests/imported/w3c/web-platform-tests/css/css-transforms/transform-scale-hittest.html
/LayoutTests/imported/w3c/web-platform-tests/css/css-transforms/transform-scale-percent-001-expected.html
/LayoutTests/imported/w3c/web-platform-tests/css/css-transforms/transform-scale-percent-001.html
/LayoutTests/imported/w3c/web-platform-tests/css/css-transforms/transform-scale-percent-ref.html
/LayoutTests/imported/w3c/web-platform-tests/css/css-transforms/transform-scale-ref.html
/LayoutTests/imported/w3c/web-platform-tests/css/css-transforms/transform-scale-test-expected.html
/LayoutTests/imported/w3c/web-platform-tests/css/css-transforms/transform-scale-test.html
/LayoutTests/imported/w3c/web-platform-tests/css/css-transforms/transform-scalex-001-expected.html
/LayoutTests/imported/w3c/web-platform-tests/css/css-transforms/transform-scalex-001.html
/LayoutTests/imported/w3c/web-platform-tests/css/css-transforms/transform-scalex-ref.html
/LayoutTests/imported/w3c/web-platform-tests/css/css-transforms/transform-scaley-001-expected.html
/LayoutTests/imported/w3c/web-platform-tests/css/css-transforms/transform-scaley-001.html
/LayoutTests/imported/w3c/web-platform-tests/css/css-transforms/transform-scaley-ref.html
/LayoutTests/imported/w3c/web-platform-tests/css/css-transforms/transform-singular-001-expected.html
/LayoutTests/imported/w3c/web-platform-tests/css/css-transforms/transform-singular-001.html
/LayoutTests/imported/w3c/web-platform-tests/css/css-transforms/transform-singular-ref.html
/LayoutTests/imported/w3c/web-platform-tests/css/css-transforms/transform-stacking-001-expected.html
/LayoutTests/imported/w3c/web-platform-tests/css/css-transforms/transform-stacking-001.html
/LayoutTests/imported/w3c/web-platform-tests/css/css-transforms/transform-stacking-002-expected.html
/LayoutTests/imported/w3c/web-platform-tests/css/css-transforms/transform-stacking-002.html
/LayoutTests/imported/w3c/web-platform-tests/css/css-transforms/transform-stacking-003-expected.html
/LayoutTests/imported/w3c/web-platform-tests/css/css-transforms/transform-stacking-003.html
/LayoutTests/imported/w3c/web-platform-tests/css/css-transforms/transform-stacking-004-expected.html
/LayoutTests/imported/w3c/web-platform-tests/css/css-transforms/transform-stacking-004.html
/LayoutTests/imported/w3c/web-platform-tests/css/css-transforms/transform-stresstest-001-expected.html
/LayoutTests/imported/w3c/web-platform-tests/css/css-transforms/transform-stresstest-001.html
/LayoutTests/imported/w3c/web-platform-tests/css/css-transforms/transform-stresstest-ref.html
/LayoutTests/imported/w3c/web-platform-tests/css/css-transforms/transform-table-001-expected.html
/LayoutTests/imported/w3c/web-platform-tests/css/css-transforms/transform-table-001-notref.html
/LayoutTests/imported/w3c/web-platform-tests/css/css-transforms/transform-table-001-ref.html
/LayoutTests/imported/w3c/web-platform-tests/css/css-transforms/transform-table-001.html
/LayoutTests/imported/w3c/web-platform-tests/css/css-transforms/transform-table-002-expected.html
/LayoutTests/imported/w3c/web-platform-tests/css/css-transforms/transform-table-002-notref.html
/LayoutTests/imported/w3c/web-platform-tests/css/css-transforms/transform-table-002.html
/LayoutTests/imported/w3c/web-platform-tests/css/css-transforms/transform-table-003-expected.html
/LayoutTests/imported/w3c/web-platform-tests/css/css-transforms/transform-table-003.html
/LayoutTests/imported/w3c/web-platform-tests/css/css-transforms/transform-table-004-expected.html
/LayoutTests/imported/w3c/web-platform-tests/css/css-transforms/transform-table-004-notref.html
/LayoutTests/imported/w3c/web-platform-tests/css/css-transforms/transform-table-004-ref.html
/LayoutTests/imported/w3c/web-platform-tests/css/css-transforms/transform-table-004.html
/LayoutTests/imported/w3c/web-platform-tests/css/css-transforms/transform-table-005-expected.html
/LayoutTests/imported/w3c/web-platform-tests/css/css-transforms/transform-table-005-notref.html
/LayoutTests/imported/w3c/web-platform-tests/css/css-transforms/transform-table-005.html
/LayoutTests/imported/w3c/web-platform-tests/css/css-transforms/transform-table-006-expected.html
/LayoutTests/imported/w3c/web-platform-tests/css/css-transforms/transform-table-006.html
/LayoutTests/imported/w3c/web-platform-tests/css/css-transforms/transform-table-007-expected.html
/LayoutTests/imported/w3c/web-platform-tests/css/css-transforms/transform-table-007.html
/LayoutTests/imported/w3c/web-platform-tests/css/css-transforms/transform-table-008-expected.html
/LayoutTests/imported/w3c/web-platform-tests/css/css-transforms/transform-table-008.html
/LayoutTests/imported/w3c/web-platform-tests/css/css-transforms/transform-table-009-expected.html
/LayoutTests/imported/w3c/web-platform-tests/css/css-transforms/transform-table-009-notref.html
/LayoutTests/imported/w3c/web-platform-tests/css/css-transforms/transform-table-009-ref.html
/LayoutTests/imported/w3c/web-platform-tests/css/css-transforms/transform-table-009.html
/LayoutTests/imported/w3c/web-platform-tests/css/css-transforms/transform-table-010-expected.html
/LayoutTests/imported/w3c/web-platform-tests/css/css-transforms/transform-table-010-notref.html
/LayoutTests/imported/w3c/web-platform-tests/css/css-transforms/transform-table-010.html
/LayoutTests/imported/w3c/web-platform-tests/css/css-transforms/transform-table-011-expected.html
/LayoutTests/imported/w3c/web-platform-tests/css/css-transforms/transform-table-011-notref.html
/LayoutTests/imported/w3c/web-platform-tests/css/css-transforms/transform-table-011.html
/LayoutTests/imported/w3c/web-platform-tests/css/css-transforms/transform-transformable-inline-block-expected.html
/LayoutTests/imported/w3c/web-platform-tests/css/css-transforms/transform-transformable-inline-block-ref.html
/LayoutTests/imported/w3c/web-platform-tests/css/css-transforms/transform-transformable-inline-block.html
/LayoutTests/imported/w3c/web-platform-tests/css/css-transforms/transform-transformable-inline-table-expected.html
/LayoutTests/imported/w3c/web-platform-tests/css/css-transforms/transform-transformable-inline-table-ref.html
/LayoutTests/imported/w3c/web-platform-tests/css/css-transforms/transform-transformable-inline-table.html
/LayoutTests/imported/w3c/web-platform-tests/css/css-transforms/transform-transformable-list-item-expected.html
/LayoutTests/imported/w3c/web-platform-tests/css/css-transforms/transform-transformable-list-item-ref.html
/LayoutTests/imported/w3c/web-platform-tests/css/css-transforms/transform-transformable-list-item.html
/LayoutTests/imported/w3c/web-platform-tests/css/css-transforms/transform-transformable-table-caption-expected.html
/LayoutTests/imported/w3c/web-platform-tests/css/css-transforms/transform-transformable-table-caption-ref.html
/LayoutTests/imported/w3c/web-platform-tests/css/css-transforms/transform-transformable-table-caption.html
/LayoutTests/imported/w3c/web-platform-tests/css/css-transforms/transform-transformable-table-cell-expected.html
/LayoutTests/imported/w3c/web-platform-tests/css/css-transforms/transform-transformable-table-cell-ref.html
/LayoutTests/imported/w3c/web-platform-tests/css/css-transforms/transform-transformable-table-cell.html
/LayoutTests/imported/w3c/web-platform-tests/css/css-transforms/transform-transformable-table-expected.html
/LayoutTests/imported/w3c/web-platform-tests/css/css-transforms/transform-transformable-table-footer-group-expected.html
/LayoutTests/imported/w3c/web-platform-tests/css/css-transforms/transform-transformable-table-footer-group-ref.html
/LayoutTests/imported/w3c/web-platform-tests/css/css-transforms/transform-transformable-table-footer-group.html
/LayoutTests/imported/w3c/web-platform-tests/css/css-transforms/transform-transformable-table-header-group-expected.html
/LayoutTests/imported/w3c/web-platform-tests/css/css-transforms/transform-transformable-table-header-group-ref.html
/LayoutTests/imported/w3c/web-platform-tests/css/css-transforms/transform-transformable-table-header-group.html
/LayoutTests/imported/w3c/web-platform-tests/css/css-transforms/transform-transformable-table-ref.html
/LayoutTests/imported/w3c/web-platform-tests/css/css-transforms/transform-transformable-table-row-expected.html
/LayoutTests/imported/w3c/web-platform-tests/css/css-transforms/transform-transformable-table-row-group-expected.html
/LayoutTests/imported/w3c/web-platform-tests/css/css-transforms/transform-transformable-table-row-group-ref.html
/LayoutTests/imported/w3c/web-platform-tests/css/css-transforms/transform-transformable-table-row-group.html
/LayoutTests/imported/w3c/web-platform-tests/css/css-transforms/transform-transformable-table-row-ref.html
/LayoutTests/imported/w3c/web-platform-tests/css/css-transforms/transform-transformable-table-row.html
/LayoutTests/imported/w3c/web-platform-tests/css/css-transforms/transform-transformable-table.html
/LayoutTests/imported/w3c/web-platform-tests/css/css-transforms/transform-transformed-caption-contains-fixed-position-expected.html
/LayoutTests/imported/w3c/web-platform-tests/css/css-transforms/transform-transformed-caption-contains-fixed-position-ref.html
/LayoutTests/imported/w3c/web-platform-tests/css/css-transforms/transform-transformed-caption-contains-fixed-position.html
/LayoutTests/imported/w3c/web-platform-tests/css/css-transforms/transform-transformed-tbody-contains-fixed-position-expected.html
/LayoutTests/imported/w3c/web-platform-tests/css/css-transforms/transform-transformed-tbody-contains-fixed-position-ref.html
/LayoutTests/imported/w3c/web-platform-tests/css/css-transforms/transform-transformed-tbody-contains-fixed-position.html
/LayoutTests/imported/w3c/web-platform-tests/css/css-transforms/transform-transformed-td-contains-fixed-position-expected.html
/LayoutTests/imported/w3c/web-platform-tests/css/css-transforms/transform-transformed-td-contains-fixed-position-ref.html
/LayoutTests/imported/w3c/web-platform-tests/css/css-transforms/transform-transformed-td-contains-fixed-position.html
/LayoutTests/imported/w3c/web-platform-tests/css/css-transforms/transform-transformed-tfoot-contains-fixed-position-expected.html
/LayoutTests/imported/w3c/web-platform-tests/css/css-transforms/transform-transformed-tfoot-contains-fixed-position-ref.html
/LayoutTests/imported/w3c/web-platform-tests/css/css-transforms/transform-transformed-tfoot-contains-fixed-position.html
/LayoutTests/imported/w3c/web-platform-tests/css/css-transforms/transform-transformed-th-contains-fixed-position-expected.html
/LayoutTests/imported/w3c/web-platform-tests/css/css-transforms/transform-transformed-th-contains-fixed-position-ref.html
/LayoutTests/imported/w3c/web-platform-tests/css/css-transforms/transform-transformed-th-contains-fixed-position.html
/LayoutTests/imported/w3c/web-platform-tests/css/css-transforms/transform-transformed-thead-contains-fixed-position-expected.html
/LayoutTests/imported/w3c/web-platform-tests/css/css-transforms/transform-transformed-thead-contains-fixed-position-ref.html
/LayoutTests/imported/w3c/web-platform-tests/css/css-transforms/transform-transformed-thead-contains-fixed-position.html
/LayoutTests/imported/w3c/web-platform-tests/css/css-transforms/transform-transformed-tr-contains-fixed-position-expected.html
/LayoutTests/imported/w3c/web-platform-tests/css/css-transforms/transform-transformed-tr-contains-fixed-position-ref.html
/LayoutTests/imported/w3c/web-platform-tests/css/css-transforms/transform-transformed-tr-contains-fixed-position.html
/LayoutTests/imported/w3c/web-platform-tests/css/css-transforms/transform-transformed-tr-percent-height-child-expected.html
/LayoutTests/imported/w3c/web-platform-tests/css/css-transforms/transform-transformed-tr-percent-height-child-ref.html
/LayoutTests/imported/w3c/web-platform-tests/css/css-transforms/transform-transformed-tr-percent-height-child.html
/LayoutTests/imported/w3c/web-platform-tests/css/css-transforms/transform-translate-001-expected.html
/LayoutTests/imported/w3c/web-platform-tests/css/css-transforms/transform-translate-001.html
/LayoutTests/imported/w3c/web-platform-tests/css/css-transforms/transform-translate-002-expected.html
/LayoutTests/imported/w3c/web-platform-tests/css/css-transforms/transform-translate-002.html
/LayoutTests/imported/w3c/web-platform-tests/css/css-transforms/transform-translate-003-expected.html
/LayoutTests/imported/w3c/web-platform-tests/css/css-transforms/transform-translate-003.html
/LayoutTests/imported/w3c/web-platform-tests/css/css-transforms/transform-translate-004-expected.html
/LayoutTests/imported/w3c/web-platform-tests/css/css-transforms/transform-translate-004.html
/LayoutTests/imported/w3c/web-platform-tests/css/css-transforms/transform-translate-005-expected.html
/LayoutTests/imported/w3c/web-platform-tests/css/css-transforms/transform-translate-005.html
/LayoutTests/imported/w3c/web-platform-tests/css/css-transforms/transform-translate-background-001-expected.html
/LayoutTests/imported/w3c/web-platform-tests/css/css-transforms/transform-translate-background-001-ref.html
/LayoutTests/imported/w3c/web-platform-tests/css/css-transforms/transform-translate-background-001.html
/LayoutTests/imported/w3c/web-platform-tests/css/css-transforms/transform-translate-background-002-expected.html
/LayoutTests/imported/w3c/web-platform-tests/css/css-transforms/transform-translate-background-002.html
/LayoutTests/imported/w3c/web-platform-tests/css/css-transforms/transform-translate-ref.html
/LayoutTests/imported/w3c/web-platform-tests/css/css-transforms/transform-translatex-001-expected.html
/LayoutTests/imported/w3c/web-platform-tests/css/css-transforms/transform-translatex-001.html
/LayoutTests/imported/w3c/web-platform-tests/css/css-transforms/transform-translatex-002-expected.html
/LayoutTests/imported/w3c/web-platform-tests/css/css-transforms/transform-translatex-002.html
/LayoutTests/imported/w3c/web-platform-tests/css/css-transforms/transform-translatex-003-expected.html
/LayoutTests/imported/w3c/web-platform-tests/css/css-transforms/transform-translatex-003.html
/LayoutTests/imported/w3c/web-platform-tests/css/css-transforms/transform-translatex-004-expected.html
/LayoutTests/imported/w3c/web-platform-tests/css/css-transforms/transform-translatex-004.html
/LayoutTests/imported/w3c/web-platform-tests/css/css-transforms/transform-translatex-005-expected.html
/LayoutTests/imported/w3c/web-platform-tests/css/css-transforms/transform-translatex-005.html
/LayoutTests/imported/w3c/web-platform-tests/css/css-transforms/transform-translatex-006-expected.html
/LayoutTests/imported/w3c/web-platform-tests/css/css-transforms/transform-translatex-006.html
/LayoutTests/imported/w3c/web-platform-tests/css/css-transforms/transform-translatex-ref.html
/LayoutTests/imported/w3c/web-platform-tests/css/css-transforms/transform-translatey-001-expected.html
/LayoutTests/imported/w3c/web-platform-tests/css/css-transforms/transform-translatey-001.html
/LayoutTests/imported/w3c/web-platform-tests/css/css-transforms/transform-translatey-002-expected.html
/LayoutTests/imported/w3c/web-platform-tests/css/css-transforms/transform-translatey-002.html
/LayoutTests/imported/w3c/web-platform-tests/css/css-transforms/transform-translatey-003-expected.html
/LayoutTests/imported/w3c/web-platform-tests/css/css-transforms/transform-translatey-003.html
/LayoutTests/imported/w3c/web-platform-tests/css/css-transforms/transform-translatey-004-expected.html
/LayoutTests/imported/w3c/web-platform-tests/css/css-transforms/transform-translatey-004.html
/LayoutTests/imported/w3c/web-platform-tests/css/css-transforms/transform-translatey-005-expected.html
/LayoutTests/imported/w3c/web-platform-tests/css/css-transforms/transform-translatey-005.html
/LayoutTests/imported/w3c/web-platform-tests/css/css-transforms/transform-translatey-ref.html
/LayoutTests/imported/w3c/web-platform-tests/css/css-transforms/transform3d-backface-visibility-001-expected.html
/LayoutTests/imported/w3c/web-platform-tests/css/css-transforms/transform3d-backface-visibility-001.html
/LayoutTests/imported/w3c/web-platform-tests/css/css-transforms/transform3d-backface-visibility-002-expected.html
/LayoutTests/imported/w3c/web-platform-tests/css/css-transforms/transform3d-backface-visibility-002.html
/LayoutTests/imported/w3c/web-platform-tests/css/css-transforms/transform3d-backface-visibility-003-expected.html
/LayoutTests/imported/w3c/web-platform-tests/css/css-transforms/transform3d-backface-visibility-003.html
/LayoutTests/imported/w3c/web-platform-tests/css/css-transforms/transform3d-backface-visibility-004-expected.html
/LayoutTests/imported/w3c/web-platform-tests/css/css-transforms/transform3d-backface-visibility-004.html
/LayoutTests/imported/w3c/web-platform-tests/css/css-transforms/transform3d-backface-visibility-005-expected.html
/LayoutTests/imported/w3c/web-platform-tests/css/css-transforms/transform3d-backface-visibility-005.html
/LayoutTests/imported/w3c/web-platform-tests/css/css-transforms/transform3d-backface-visibility-006-expected.html
/LayoutTests/imported/w3c/web-platform-tests/css/css-transforms/transform3d-backface-visibility-006.html
/LayoutTests/imported/w3c/web-platform-tests/css/css-transforms/transform3d-backface-visibility-007-expected.html
/LayoutTests/imported/w3c/web-platform-tests/css/css-transforms/transform3d-backface-visibility-007.html
/LayoutTests/imported/w3c/web-platform-tests/css/css-transforms/transform3d-backface-visibility-008-expected.xht
/LayoutTests/imported/w3c/web-platform-tests/css/css-transforms/transform3d-backface-visibility-008.html
/LayoutTests/imported/w3c/web-platform-tests/css/css-transforms/transform3d-image-scale-001-expected.html
/LayoutTests/imported/w3c/web-platform-tests/css/css-transforms/transform3d-image-scale-001.html
/LayoutTests/imported/w3c/web-platform-tests/css/css-transforms/transform3d-image-scale-002-expected.html
/LayoutTests/imported/w3c/web-platform-tests/css/css-transforms/transform3d-image-scale-002.html
/LayoutTests/imported/w3c/web-platform-tests/css/css-transforms/transform3d-matrix3d-001-expected.html
/LayoutTests/imported/w3c/web-platform-tests/css/css-transforms/transform3d-matrix3d-001-ref.html
/LayoutTests/imported/w3c/web-platform-tests/css/css-transforms/transform3d-matrix3d-001.html
/LayoutTests/imported/w3c/web-platform-tests/css/css-transforms/transform3d-matrix3d-002-expected.html
/LayoutTests/imported/w3c/web-platform-tests/css/css-transforms/transform3d-matrix3d-002-ref.html
/LayoutTests/imported/w3c/web-platform-tests/css/css-transforms/transform3d-matrix3d-002.html
/LayoutTests/imported/w3c/web-platform-tests/css/css-transforms/transform3d-matrix3d-003-expected.html
/LayoutTests/imported/w3c/web-platform-tests/css/css-transforms/transform3d-matrix3d-003-ref.html
/LayoutTests/imported/w3c/web-platform-tests/css/css-transforms/transform3d-matrix3d-003.html
/LayoutTests/imported/w3c/web-platform-tests/css/css-transforms/transform3d-matrix3d-004-expected.html
/LayoutTests/imported/w3c/web-platform-tests/css/css-transforms/transform3d-matrix3d-004-ref.html
/LayoutTests/imported/w3c/web-platform-tests/css/css-transforms/transform3d-matrix3d-004.html
/LayoutTests/imported/w3c/web-platform-tests/css/css-transforms/transform3d-matrix3d-005-expected.html
/LayoutTests/imported/w3c/web-platform-tests/css/css-transforms/transform3d-matrix3d-005-ref.html
/LayoutTests/imported/w3c/web-platform-tests/css/css-transforms/transform3d-matrix3d-005.html
/LayoutTests/imported/w3c/web-platform-tests/css/css-transforms/transform3d-perspective-001-expected.html
/LayoutTests/imported/w3c/web-platform-tests/css/css-transforms/transform3d-perspective-001-ref.html
/LayoutTests/imported/w3c/web-platform-tests/css/css-transforms/transform3d-perspective-001.html
/LayoutTests/imported/w3c/web-platform-tests/css/css-transforms/transform3d-perspective-002-expected.html
/LayoutTests/imported/w3c/web-platform-tests/css/css-transforms/transform3d-perspective-002.html
/LayoutTests/imported/w3c/web-platform-tests/css/css-transforms/transform3d-perspective-003-expected.html
/LayoutTests/imported/w3c/web-platform-tests/css/css-transforms/transform3d-perspective-003.html
/LayoutTests/imported/w3c/web-platform-tests/css/css-transforms/transform3d-perspective-004-expected.html
/LayoutTests/imported/w3c/web-platform-tests/css/css-transforms/transform3d-perspective-004.html
/LayoutTests/imported/w3c/web-platform-tests/css/css-transforms/transform3d-perspective-005-expected.html
/LayoutTests/imported/w3c/web-platform-tests/css/css-transforms/transform3d-perspective-005.html
/LayoutTests/imported/w3c/web-platform-tests/css/css-transforms/transform3d-perspective-006-expected.html
/LayoutTests/imported/w3c/web-platform-tests/css/css-transforms/transform3d-perspective-006.html
/LayoutTests/imported/w3c/web-platform-tests/css/css-transforms/transform3d-perspective-007-expected.html
/LayoutTests/imported/w3c/web-platform-tests/css/css-transforms/transform3d-perspective-007.html
/LayoutTests/imported/w3c/web-platform-tests/css/css-transforms/transform3d-perspective-008-expected.html
/LayoutTests/imported/w3c/web-platform-tests/css/css-transforms/transform3d-perspective-008.html
/LayoutTests/imported/w3c/web-platform-tests/css/css-transforms/transform3d-perspective-009-expected.html
/LayoutTests/imported/w3c/web-platform-tests/css/css-transforms/transform3d-perspective-009-ref.html
/LayoutTests/imported/w3c/web-platform-tests/css/css-transforms/transform3d-perspective-009.html
/LayoutTests/imported/w3c/web-platform-tests/css/css-transforms/transform3d-perspective-origin-001-expected.html
/LayoutTests/imported/w3c/web-platform-tests/css/css-transforms/transform3d-perspective-origin-001.html
/LayoutTests/imported/w3c/web-platform-tests/css/css-transforms/transform3d-perspective-origin-ref-expected-mismatch.html
/LayoutTests/imported/w3c/web-platform-tests/css/css-transforms/transform3d-perspective-origin-ref.html
/LayoutTests/imported/w3c/web-platform-tests/css/css-transforms/transform3d-preserve3d-001-expected.html
/LayoutTests/imported/w3c/web-platform-tests/css/css-transforms/transform3d-preserve3d-001-ref.html
/LayoutTests/imported/w3c/web-platform-tests/css/css-transforms/transform3d-preserve3d-001.html
/LayoutTests/imported/w3c/web-platform-tests/css/css-transforms/transform3d-preserve3d-002-expected.html
/LayoutTests/imported/w3c/web-platform-tests/css/css-transforms/transform3d-preserve3d-002.html
/LayoutTests/imported/w3c/web-platform-tests/css/css-transforms/transform3d-preserve3d-003-expected.html
/LayoutTests/imported/w3c/web-platform-tests/css/css-transforms/transform3d-preserve3d-003.html
/LayoutTests/imported/w3c/web-platform-tests/css/css-transforms/transform3d-preserve3d-004-expected.html
/LayoutTests/imported/w3c/web-platform-tests/css/css-transforms/transform3d-preserve3d-004.html
/LayoutTests/imported/w3c/web-platform-tests/css/css-transforms/transform3d-preserve3d-005-expected.html
/LayoutTests/imported/w3c/web-platform-tests/css/css-transforms/transform3d-preserve3d-005.html
/LayoutTests/imported/w3c/web-platform-tests/css/css-transforms/transform3d-preserve3d-006-expected.html
/LayoutTests/imported/w3c/web-platform-tests/css/css-transforms/transform3d-preserve3d-006.html
/LayoutTests/imported/w3c/web-platform-tests/css/css-transforms/transform3d-preserve3d-007-expected.html
/LayoutTests/imported/w3c/web-platform-tests/css/css-transforms/transform3d-preserve3d-007.html
/LayoutTests/imported/w3c/web-platform-tests/css/css-transforms/transform3d-preserve3d-008-expected.html
/LayoutTests/imported/w3c/web-platform-tests/css/css-transforms/transform3d-preserve3d-008.html
/LayoutTests/imported/w3c/web-platform-tests/css/css-transforms/transform3d-preserve3d-009-expected.html
/LayoutTests/imported/w3c/web-platform-tests/css/css-transforms/transform3d-preserve3d-009.html
/LayoutTests/imported/w3c/web-platform-tests/css/css-transforms/transform3d-preserve3d-010-expected.html
/LayoutTests/imported/w3c/web-platform-tests/css/css-transforms/transform3d-preserve3d-010.html
/LayoutTests/imported/w3c/web-platform-tests/css/css-transforms/transform3d-preserve3d-011-expected.html
/LayoutTests/imported/w3c/web-platform-tests/css/css-transforms/transform3d-preserve3d-011.html
/LayoutTests/imported/w3c/web-platform-tests/css/css-transforms/transform3d-preserve3d-012-expected.html
/LayoutTests/imported/w3c/web-platform-tests/css/css-transforms/transform3d-preserve3d-012.html
/LayoutTests/imported/w3c/web-platform-tests/css/css-transforms/transform3d-preserve3d-013-expected.html
/LayoutTests/imported/w3c/web-platform-tests/css/css-transforms/transform3d-preserve3d-013-ref.html
/LayoutTests/imported/w3c/web-platform-tests/css/css-transforms/transform3d-preserve3d-013.html
/LayoutTests/imported/w3c/web-platform-tests/css/css-transforms/transform3d-rotate3d-001-expected.html
/LayoutTests/imported/w3c/web-platform-tests/css/css-transforms/transform3d-rotate3d-001.html
/LayoutTests/imported/w3c/web-platform-tests/css/css-transforms/transform3d-rotate3d-002-expected.html
/LayoutTests/imported/w3c/web-platform-tests/css/css-transforms/transform3d-rotate3d-002.html
/LayoutTests/imported/w3c/web-platform-tests/css/css-transforms/transform3d-rotatex-001-expected.html
/LayoutTests/imported/w3c/web-platform-tests/css/css-transforms/transform3d-rotatex-001.html
/LayoutTests/imported/w3c/web-platform-tests/css/css-transforms/transform3d-rotatex-perspective-001-expected-mismatch.html
/LayoutTests/imported/w3c/web-platform-tests/css/css-transforms/transform3d-rotatex-perspective-001.html
/LayoutTests/imported/w3c/web-platform-tests/css/css-transforms/transform3d-rotatex-perspective-002-expected-mismatch.html
/LayoutTests/imported/w3c/web-platform-tests/css/css-transforms/transform3d-rotatex-perspective-002.html
/LayoutTests/imported/w3c/web-platform-tests/css/css-transforms/transform3d-rotatex-perspective-003-expected.html
/LayoutTests/imported/w3c/web-platform-tests/css/css-transforms/transform3d-rotatex-perspective-003.html
/LayoutTests/imported/w3c/web-platform-tests/css/css-transforms/transform3d-rotatex-perspective-notref.html
/LayoutTests/imported/w3c/web-platform-tests/css/css-transforms/transform3d-rotatex-perspective-ref.html
/LayoutTests/imported/w3c/web-platform-tests/css/css-transforms/transform3d-rotatex-ref-expected-mismatch.html
/LayoutTests/imported/w3c/web-platform-tests/css/css-transforms/transform3d-rotatex-ref.html
/LayoutTests/imported/w3c/web-platform-tests/css/css-transforms/transform3d-rotatex-transformorigin-001-expected.html
/LayoutTests/imported/w3c/web-platform-tests/css/css-transforms/transform3d-rotatex-transformorigin-001.html
/LayoutTests/imported/w3c/web-platform-tests/css/css-transforms/transform3d-rotatex-transformorigin-ref.html
/LayoutTests/imported/w3c/web-platform-tests/css/css-transforms/transform3d-rotatey-001-expected.html
/LayoutTests/imported/w3c/web-platform-tests/css/css-transforms/transform3d-rotatey-001.html
/LayoutTests/imported/w3c/web-platform-tests/css/css-transforms/transform3d-rotatey-ref.html
/LayoutTests/imported/w3c/web-platform-tests/css/css-transforms/transform3d-scale-001-expected.html
/LayoutTests/imported/w3c/web-platform-tests/css/css-transforms/transform3d-scale-001-notref.html
/LayoutTests/imported/w3c/web-platform-tests/css/css-transforms/transform3d-scale-001-ref.html
/LayoutTests/imported/w3c/web-platform-tests/css/css-transforms/transform3d-scale-001.html
/LayoutTests/imported/w3c/web-platform-tests/css/css-transforms/transform3d-scale-002-expected.html
/LayoutTests/imported/w3c/web-platform-tests/css/css-transforms/transform3d-scale-002.html
/LayoutTests/imported/w3c/web-platform-tests/css/css-transforms/transform3d-scale-003-expected.html
/LayoutTests/imported/w3c/web-platform-tests/css/css-transforms/transform3d-scale-003.html
/LayoutTests/imported/w3c/web-platform-tests/css/css-transforms/transform3d-scale-004-expected.html
/LayoutTests/imported/w3c/web-platform-tests/css/css-transforms/transform3d-scale-004.html
/LayoutTests/imported/w3c/web-platform-tests/css/css-transforms/transform3d-scale-005-expected.html
/LayoutTests/imported/w3c/web-platform-tests/css/css-transforms/transform3d-scale-005-ref.html
/LayoutTests/imported/w3c/web-platform-tests/css/css-transforms/transform3d-scale-005.html
/LayoutTests/imported/w3c/web-platform-tests/css/css-transforms/transform3d-scale-006-expected.html
/LayoutTests/imported/w3c/web-platform-tests/css/css-transforms/transform3d-scale-006.html
/LayoutTests/imported/w3c/web-platform-tests/css/css-transforms/transform3d-scale-007-expected.html
/LayoutTests/imported/w3c/web-platform-tests/css/css-transforms/transform3d-scale-007-ref.html
/LayoutTests/imported/w3c/web-platform-tests/css/css-transforms/transform3d-scale-007.html
/LayoutTests/imported/w3c/web-platform-tests/css/css-transforms/transform3d-sorting-001-expected.html
/LayoutTests/imported/w3c/web-platform-tests/css/css-transforms/transform3d-sorting-001.html
/LayoutTests/imported/w3c/web-platform-tests/css/css-transforms/transform3d-sorting-002-expected.html
/LayoutTests/imported/w3c/web-platform-tests/css/css-transforms/transform3d-sorting-002.html
/LayoutTests/imported/w3c/web-platform-tests/css/css-transforms/transform3d-sorting-003-expected.html
/LayoutTests/imported/w3c/web-platform-tests/css/css-transforms/transform3d-sorting-003.html
/LayoutTests/imported/w3c/web-platform-tests/css/css-transforms/transform3d-sorting-004-expected.html
/LayoutTests/imported/w3c/web-platform-tests/css/css-transforms/transform3d-sorting-004.html
/LayoutTests/imported/w3c/web-platform-tests/css/css-transforms/transform3d-sorting-005-expected.html
/LayoutTests/imported/w3c/web-platform-tests/css/css-transforms/transform3d-sorting-005.html
/LayoutTests/imported/w3c/web-platform-tests/css/css-transforms/transform3d-sorting-006-expected.html
/LayoutTests/imported/w3c/web-platform-tests/css/css-transforms/transform3d-sorting-006-ref.html
/LayoutTests/imported/w3c/web-platform-tests/css/css-transforms/transform3d-sorting-006.html
/LayoutTests/imported/w3c/web-platform-tests/css/css-transforms/transform3d-translate3d-001-expected.html
/LayoutTests/imported/w3c/web-platform-tests/css/css-transforms/transform3d-translate3d-001.html
/LayoutTests/imported/w3c/web-platform-tests/css/css-transforms/transform3d-translate3d-ref.html
/LayoutTests/imported/w3c/web-platform-tests/css/css-transforms/transform3d-translatez-001-expected.html
/LayoutTests/imported/w3c/web-platform-tests/css/css-transforms/transform3d-translatez-001.html
/LayoutTests/imported/w3c/web-platform-tests/css/css-transforms/transform3d-translatez-notref.html
/LayoutTests/imported/w3c/web-platform-tests/css/css-transforms/transform3d-translatez-ref.html
/LayoutTests/imported/w3c/web-platform-tests/css/css-transforms/transform_translate.html
/LayoutTests/imported/w3c/web-platform-tests/css/css-transforms/transform_translate_invalid.html
/LayoutTests/imported/w3c/web-platform-tests/css/css-transforms/transform_translate_max.html
/LayoutTests/imported/w3c/web-platform-tests/css/css-transforms/transform_translate_min.html
/LayoutTests/imported/w3c/web-platform-tests/css/css-transforms/transform_translate_neg.html
/LayoutTests/imported/w3c/web-platform-tests/css/css-transforms/transform_translate_second_omited.html
/LayoutTests/imported/w3c/web-platform-tests/css/css-transforms/transform_translate_zero.html
/LayoutTests/imported/w3c/web-platform-tests/css/css-transforms/transformed-preserve-3d-1-expected.html
/LayoutTests/imported/w3c/web-platform-tests/css/css-transforms/transformed-preserve-3d-1.html
/LayoutTests/imported/w3c/web-platform-tests/css/css-transforms/transformed-rotateX-3-expected.html
/LayoutTests/imported/w3c/web-platform-tests/css/css-transforms/transformed-rotateX-3.html
/LayoutTests/imported/w3c/web-platform-tests/css/css-transforms/transformed-rotateY-1-expected.html
/LayoutTests/imported/w3c/web-platform-tests/css/css-transforms/transformed-rotateY-1.html
/LayoutTests/imported/w3c/web-platform-tests/css/css-transforms/transforms-rotate-degree-45-expected.html
/LayoutTests/imported/w3c/web-platform-tests/css/css-transforms/transforms-rotate-degree-45.html
/LayoutTests/imported/w3c/web-platform-tests/css/css-transforms/transforms-rotate-degree-90-expected.html
/LayoutTests/imported/w3c/web-platform-tests/css/css-transforms/transforms-rotate-degree-90.html
/LayoutTests/imported/w3c/web-platform-tests/css/css-transforms/transforms-rotate-translate-scale-expected.html
/LayoutTests/imported/w3c/web-platform-tests/css/css-transforms/transforms-rotate-translate-scale.html
/LayoutTests/imported/w3c/web-platform-tests/css/css-transforms/transforms-rotateY-degree-60-expected.html
/LayoutTests/imported/w3c/web-platform-tests/css/css-transforms/transforms-rotateY-degree-60.html
/LayoutTests/imported/w3c/web-platform-tests/css/css-transforms/transforms-skewX-expected.html
/LayoutTests/imported/w3c/web-platform-tests/css/css-transforms/transforms-skewX.html
/LayoutTests/imported/w3c/web-platform-tests/css/css-transforms/transforms-skewY-expected.html
/LayoutTests/imported/w3c/web-platform-tests/css/css-transforms/transforms-skewY.html
/LayoutTests/imported/w3c/web-platform-tests/css/css-transforms/transforms-support-calc.html
/LayoutTests/imported/w3c/web-platform-tests/css/css-transforms/translate-expected.html
/LayoutTests/imported/w3c/web-platform-tests/css/css-transforms/translate-getComputedStyle.html
/LayoutTests/imported/w3c/web-platform-tests/css/css-transforms/translate-optional-second-001-expected.html
/LayoutTests/imported/w3c/web-platform-tests/css/css-transforms/translate-optional-second-001.html
/LayoutTests/imported/w3c/web-platform-tests/css/css-transforms/translate-ref.html
/LayoutTests/imported/w3c/web-platform-tests/css/css-transforms/translate.html
/LayoutTests/imported/w3c/web-platform-tests/css/css-transforms/ttwf-css-3d-polygon-cycle-expected.html
/LayoutTests/imported/w3c/web-platform-tests/css/css-transforms/ttwf-css-3d-polygon-cycle-mismatch-expected-mismatch.html
/LayoutTests/imported/w3c/web-platform-tests/css/css-transforms/ttwf-css-3d-polygon-cycle-mismatch.html
/LayoutTests/imported/w3c/web-platform-tests/css/css-transforms/ttwf-css-3d-polygon-cycle.html
/LayoutTests/imported/w3c/web-platform-tests/css/css-transforms/ttwf-reftest-rotate-expected.html
/LayoutTests/imported/w3c/web-platform-tests/css/css-transforms/ttwf-reftest-rotate.html
/LayoutTests/imported/w3c/web-platform-tests/css/css-transforms/ttwf-transform-skewx-001-expected.html
/LayoutTests/imported/w3c/web-platform-tests/css/css-transforms/ttwf-transform-skewx-001.html
/LayoutTests/imported/w3c/web-platform-tests/css/css-transforms/ttwf-transform-skewy-001-expected.html
/LayoutTests/imported/w3c/web-platform-tests/css/css-transforms/ttwf-transform-skewy-001.html
/LayoutTests/imported/w3c/web-platform-tests/css/css-transforms/ttwf-transform-translatex-001-expected.html
/LayoutTests/imported/w3c/web-platform-tests/css/css-transforms/ttwf-transform-translatex-001.html
/LayoutTests/imported/w3c/web-platform-tests/css/css-transforms/ttwf-transform-translatey-001-expected.html
/LayoutTests/imported/w3c/web-platform-tests/css/css-transforms/ttwf-transform-translatey-001.html
/LayoutTests/imported/w3c/web-platform-tests/css/css-transforms/z-index-does-not-apply-expected.html
/LayoutTests/imported/w3c/web-platform-tests/css/css-transforms/z-index-does-not-apply-ref.html
/LayoutTests/imported/w3c/web-platform-tests/css/css-transforms/z-index-does-not-apply.html
