The tests in this directory were imported from the W3C repository.
Do NOT modify these tests directly in WebKit.
Instead, create a pull request on the WPT github:
	https://github.com/web-platform-tests/wpt

Then run the Tools/Scripts/import-w3c-tests in WebKit to reimport

Do NOT modify or remove this file.

------------------------------------------------------------------------
Properties requiring vendor prefixes:
None
Property values requiring vendor prefixes:
None
------------------------------------------------------------------------
List of files:
/LayoutTests/imported/w3c/web-platform-tests/html/semantics/embedded-content/the-canvas-element/2d-getcontext-options.html
/LayoutTests/imported/w3c/web-platform-tests/html/semantics/embedded-content/the-canvas-element/2d.canvas.context.html
/LayoutTests/imported/w3c/web-platform-tests/html/semantics/embedded-content/the-canvas-element/2d.canvas.readonly.html
/LayoutTests/imported/w3c/web-platform-tests/html/semantics/embedded-content/the-canvas-element/2d.canvas.reference.html
/LayoutTests/imported/w3c/web-platform-tests/html/semantics/embedded-content/the-canvas-element/2d.getcontext.exists.html
/LayoutTests/imported/w3c/web-platform-tests/html/semantics/embedded-content/the-canvas-element/2d.getcontext.extraargs.cache.html
/LayoutTests/imported/w3c/web-platform-tests/html/semantics/embedded-content/the-canvas-element/2d.getcontext.extraargs.create.html
/LayoutTests/imported/w3c/web-platform-tests/html/semantics/embedded-content/the-canvas-element/2d.getcontext.invalid.args.html
/LayoutTests/imported/w3c/web-platform-tests/html/semantics/embedded-content/the-canvas-element/2d.getcontext.shared.html
/LayoutTests/imported/w3c/web-platform-tests/html/semantics/embedded-content/the-canvas-element/2d.getcontext.unique.html
/LayoutTests/imported/w3c/web-platform-tests/html/semantics/embedded-content/the-canvas-element/2d.scaled.png
/LayoutTests/imported/w3c/web-platform-tests/html/semantics/embedded-content/the-canvas-element/2d.type.exists.html
/LayoutTests/imported/w3c/web-platform-tests/html/semantics/embedded-content/the-canvas-element/2d.type.extend.html
/LayoutTests/imported/w3c/web-platform-tests/html/semantics/embedded-content/the-canvas-element/2d.type.prototype.html
/LayoutTests/imported/w3c/web-platform-tests/html/semantics/embedded-content/the-canvas-element/2d.type.replace.html
/LayoutTests/imported/w3c/web-platform-tests/html/semantics/embedded-content/the-canvas-element/canvas-descendants-focusability-001.html
/LayoutTests/imported/w3c/web-platform-tests/html/semantics/embedded-content/the-canvas-element/canvas-descendants-focusability-002.html
/LayoutTests/imported/w3c/web-platform-tests/html/semantics/embedded-content/the-canvas-element/canvas-descendants-focusability-003.tentative.html
/LayoutTests/imported/w3c/web-platform-tests/html/semantics/embedded-content/the-canvas-element/canvas-descendants-focusability-004.tentative.html
/LayoutTests/imported/w3c/web-platform-tests/html/semantics/embedded-content/the-canvas-element/canvas-descendants-focusability-005.html
/LayoutTests/imported/w3c/web-platform-tests/html/semantics/embedded-content/the-canvas-element/context.arguments.missing.html
/LayoutTests/imported/w3c/web-platform-tests/html/semantics/embedded-content/the-canvas-element/context.casesensitive.html
/LayoutTests/imported/w3c/web-platform-tests/html/semantics/embedded-content/the-canvas-element/context.emptystring.html
/LayoutTests/imported/w3c/web-platform-tests/html/semantics/embedded-content/the-canvas-element/context.unrecognised.badname.html
/LayoutTests/imported/w3c/web-platform-tests/html/semantics/embedded-content/the-canvas-element/context.unrecognised.badsuffix.html
/LayoutTests/imported/w3c/web-platform-tests/html/semantics/embedded-content/the-canvas-element/context.unrecognised.nullsuffix.html
/LayoutTests/imported/w3c/web-platform-tests/html/semantics/embedded-content/the-canvas-element/context.unrecognised.unicode.html
/LayoutTests/imported/w3c/web-platform-tests/html/semantics/embedded-content/the-canvas-element/fallback.basic.html
/LayoutTests/imported/w3c/web-platform-tests/html/semantics/embedded-content/the-canvas-element/fallback.multiple.html
/LayoutTests/imported/w3c/web-platform-tests/html/semantics/embedded-content/the-canvas-element/fallback.nested.html
/LayoutTests/imported/w3c/web-platform-tests/html/semantics/embedded-content/the-canvas-element/historical.html
/LayoutTests/imported/w3c/web-platform-tests/html/semantics/embedded-content/the-canvas-element/imagedata.html
/LayoutTests/imported/w3c/web-platform-tests/html/semantics/embedded-content/the-canvas-element/initial.colour.html
/LayoutTests/imported/w3c/web-platform-tests/html/semantics/embedded-content/the-canvas-element/initial.colour.png
/LayoutTests/imported/w3c/web-platform-tests/html/semantics/embedded-content/the-canvas-element/initial.reset.2dstate.html
/LayoutTests/imported/w3c/web-platform-tests/html/semantics/embedded-content/the-canvas-element/initial.reset.clip.html
/LayoutTests/imported/w3c/web-platform-tests/html/semantics/embedded-content/the-canvas-element/initial.reset.different.html
/LayoutTests/imported/w3c/web-platform-tests/html/semantics/embedded-content/the-canvas-element/initial.reset.different.png
/LayoutTests/imported/w3c/web-platform-tests/html/semantics/embedded-content/the-canvas-element/initial.reset.gradient.html
/LayoutTests/imported/w3c/web-platform-tests/html/semantics/embedded-content/the-canvas-element/initial.reset.path.html
/LayoutTests/imported/w3c/web-platform-tests/html/semantics/embedded-content/the-canvas-element/initial.reset.path.png
/LayoutTests/imported/w3c/web-platform-tests/html/semantics/embedded-content/the-canvas-element/initial.reset.pattern.html
/LayoutTests/imported/w3c/web-platform-tests/html/semantics/embedded-content/the-canvas-element/initial.reset.same.html
/LayoutTests/imported/w3c/web-platform-tests/html/semantics/embedded-content/the-canvas-element/initial.reset.same.png
/LayoutTests/imported/w3c/web-platform-tests/html/semantics/embedded-content/the-canvas-element/initial.reset.transform.html
/LayoutTests/imported/w3c/web-platform-tests/html/semantics/embedded-content/the-canvas-element/security.dataURI.html
/LayoutTests/imported/w3c/web-platform-tests/html/semantics/embedded-content/the-canvas-element/security.drawImage.canvas.cross.html
/LayoutTests/imported/w3c/web-platform-tests/html/semantics/embedded-content/the-canvas-element/security.drawImage.canvas.redirect.html
/LayoutTests/imported/w3c/web-platform-tests/html/semantics/embedded-content/the-canvas-element/security.drawImage.image.cross.html
/LayoutTests/imported/w3c/web-platform-tests/html/semantics/embedded-content/the-canvas-element/security.drawImage.image.redirect.html
/LayoutTests/imported/w3c/web-platform-tests/html/semantics/embedded-content/the-canvas-element/security.pattern.canvas.fillStyle.cross.html
/LayoutTests/imported/w3c/web-platform-tests/html/semantics/embedded-content/the-canvas-element/security.pattern.canvas.fillStyle.redirect.html
/LayoutTests/imported/w3c/web-platform-tests/html/semantics/embedded-content/the-canvas-element/security.pattern.canvas.strokeStyle.cross.html
/LayoutTests/imported/w3c/web-platform-tests/html/semantics/embedded-content/the-canvas-element/security.pattern.canvas.strokeStyle.redirect.html
/LayoutTests/imported/w3c/web-platform-tests/html/semantics/embedded-content/the-canvas-element/security.pattern.canvas.timing.cross.html
/LayoutTests/imported/w3c/web-platform-tests/html/semantics/embedded-content/the-canvas-element/security.pattern.canvas.timing.redirect.html
/LayoutTests/imported/w3c/web-platform-tests/html/semantics/embedded-content/the-canvas-element/security.pattern.create.cross.html
/LayoutTests/imported/w3c/web-platform-tests/html/semantics/embedded-content/the-canvas-element/security.pattern.create.redirect.html
/LayoutTests/imported/w3c/web-platform-tests/html/semantics/embedded-content/the-canvas-element/security.pattern.cross.cross.html
/LayoutTests/imported/w3c/web-platform-tests/html/semantics/embedded-content/the-canvas-element/security.pattern.cross.redirect.html
/LayoutTests/imported/w3c/web-platform-tests/html/semantics/embedded-content/the-canvas-element/security.pattern.fillStyle.sub.html
/LayoutTests/imported/w3c/web-platform-tests/html/semantics/embedded-content/the-canvas-element/security.pattern.image.fillStyle.cross.html
/LayoutTests/imported/w3c/web-platform-tests/html/semantics/embedded-content/the-canvas-element/security.pattern.image.fillStyle.redirect.html
/LayoutTests/imported/w3c/web-platform-tests/html/semantics/embedded-content/the-canvas-element/security.pattern.image.strokeStyle.cross.html
/LayoutTests/imported/w3c/web-platform-tests/html/semantics/embedded-content/the-canvas-element/security.pattern.image.strokeStyle.redirect.html
/LayoutTests/imported/w3c/web-platform-tests/html/semantics/embedded-content/the-canvas-element/security.reset.cross.html
/LayoutTests/imported/w3c/web-platform-tests/html/semantics/embedded-content/the-canvas-element/security.reset.redirect.html
/LayoutTests/imported/w3c/web-platform-tests/html/semantics/embedded-content/the-canvas-element/size.attributes.default.html
/LayoutTests/imported/w3c/web-platform-tests/html/semantics/embedded-content/the-canvas-element/size.attributes.default.png
/LayoutTests/imported/w3c/web-platform-tests/html/semantics/embedded-content/the-canvas-element/size.attributes.get.png
/LayoutTests/imported/w3c/web-platform-tests/html/semantics/embedded-content/the-canvas-element/size.attributes.idl.html
/LayoutTests/imported/w3c/web-platform-tests/html/semantics/embedded-content/the-canvas-element/size.attributes.idl.set.zero.html
/LayoutTests/imported/w3c/web-platform-tests/html/semantics/embedded-content/the-canvas-element/size.attributes.parse.decimal.html
/LayoutTests/imported/w3c/web-platform-tests/html/semantics/embedded-content/the-canvas-element/size.attributes.parse.decimal.png
/LayoutTests/imported/w3c/web-platform-tests/html/semantics/embedded-content/the-canvas-element/size.attributes.parse.em.html
/LayoutTests/imported/w3c/web-platform-tests/html/semantics/embedded-content/the-canvas-element/size.attributes.parse.em.png
/LayoutTests/imported/w3c/web-platform-tests/html/semantics/embedded-content/the-canvas-element/size.attributes.parse.empty.html
/LayoutTests/imported/w3c/web-platform-tests/html/semantics/embedded-content/the-canvas-element/size.attributes.parse.empty.png
/LayoutTests/imported/w3c/web-platform-tests/html/semantics/embedded-content/the-canvas-element/size.attributes.parse.exp.html
/LayoutTests/imported/w3c/web-platform-tests/html/semantics/embedded-content/the-canvas-element/size.attributes.parse.exp.png
/LayoutTests/imported/w3c/web-platform-tests/html/semantics/embedded-content/the-canvas-element/size.attributes.parse.hex.html
/LayoutTests/imported/w3c/web-platform-tests/html/semantics/embedded-content/the-canvas-element/size.attributes.parse.junk.html
/LayoutTests/imported/w3c/web-platform-tests/html/semantics/embedded-content/the-canvas-element/size.attributes.parse.junk.png
/LayoutTests/imported/w3c/web-platform-tests/html/semantics/embedded-content/the-canvas-element/size.attributes.parse.minus.html
/LayoutTests/imported/w3c/web-platform-tests/html/semantics/embedded-content/the-canvas-element/size.attributes.parse.minus.png
/LayoutTests/imported/w3c/web-platform-tests/html/semantics/embedded-content/the-canvas-element/size.attributes.parse.octal.html
/LayoutTests/imported/w3c/web-platform-tests/html/semantics/embedded-content/the-canvas-element/size.attributes.parse.octal.png
/LayoutTests/imported/w3c/web-platform-tests/html/semantics/embedded-content/the-canvas-element/size.attributes.parse.onlyspace.html
/LayoutTests/imported/w3c/web-platform-tests/html/semantics/embedded-content/the-canvas-element/size.attributes.parse.onlyspace.png
/LayoutTests/imported/w3c/web-platform-tests/html/semantics/embedded-content/the-canvas-element/size.attributes.parse.percent.html
/LayoutTests/imported/w3c/web-platform-tests/html/semantics/embedded-content/the-canvas-element/size.attributes.parse.percent.png
/LayoutTests/imported/w3c/web-platform-tests/html/semantics/embedded-content/the-canvas-element/size.attributes.parse.plus.html
/LayoutTests/imported/w3c/web-platform-tests/html/semantics/embedded-content/the-canvas-element/size.attributes.parse.plus.png
/LayoutTests/imported/w3c/web-platform-tests/html/semantics/embedded-content/the-canvas-element/size.attributes.parse.space.html
/LayoutTests/imported/w3c/web-platform-tests/html/semantics/embedded-content/the-canvas-element/size.attributes.parse.space.png
/LayoutTests/imported/w3c/web-platform-tests/html/semantics/embedded-content/the-canvas-element/size.attributes.parse.trailingjunk.html
/LayoutTests/imported/w3c/web-platform-tests/html/semantics/embedded-content/the-canvas-element/size.attributes.parse.trailingjunk.png
/LayoutTests/imported/w3c/web-platform-tests/html/semantics/embedded-content/the-canvas-element/size.attributes.parse.whitespace.png
/LayoutTests/imported/w3c/web-platform-tests/html/semantics/embedded-content/the-canvas-element/size.attributes.parse.zero.html
/LayoutTests/imported/w3c/web-platform-tests/html/semantics/embedded-content/the-canvas-element/size.attributes.reflect.setcontent.html
/LayoutTests/imported/w3c/web-platform-tests/html/semantics/embedded-content/the-canvas-element/size.attributes.reflect.setcontent.png
/LayoutTests/imported/w3c/web-platform-tests/html/semantics/embedded-content/the-canvas-element/size.attributes.reflect.setidl.html
/LayoutTests/imported/w3c/web-platform-tests/html/semantics/embedded-content/the-canvas-element/size.attributes.reflect.setidl.png
/LayoutTests/imported/w3c/web-platform-tests/html/semantics/embedded-content/the-canvas-element/size.attributes.reflect.setidlzero.html
/LayoutTests/imported/w3c/web-platform-tests/html/semantics/embedded-content/the-canvas-element/size.attributes.removed.html
/LayoutTests/imported/w3c/web-platform-tests/html/semantics/embedded-content/the-canvas-element/size.attributes.removed.png
/LayoutTests/imported/w3c/web-platform-tests/html/semantics/embedded-content/the-canvas-element/size.attributes.set.png
/LayoutTests/imported/w3c/web-platform-tests/html/semantics/embedded-content/the-canvas-element/size.attributes.setAttribute.decimal.html
/LayoutTests/imported/w3c/web-platform-tests/html/semantics/embedded-content/the-canvas-element/size.attributes.setAttribute.decimal.png
/LayoutTests/imported/w3c/web-platform-tests/html/semantics/embedded-content/the-canvas-element/size.attributes.setAttribute.em.html
/LayoutTests/imported/w3c/web-platform-tests/html/semantics/embedded-content/the-canvas-element/size.attributes.setAttribute.em.png
/LayoutTests/imported/w3c/web-platform-tests/html/semantics/embedded-content/the-canvas-element/size.attributes.setAttribute.empty.html
/LayoutTests/imported/w3c/web-platform-tests/html/semantics/embedded-content/the-canvas-element/size.attributes.setAttribute.empty.png
/LayoutTests/imported/w3c/web-platform-tests/html/semantics/embedded-content/the-canvas-element/size.attributes.setAttribute.exp.html
/LayoutTests/imported/w3c/web-platform-tests/html/semantics/embedded-content/the-canvas-element/size.attributes.setAttribute.exp.png
/LayoutTests/imported/w3c/web-platform-tests/html/semantics/embedded-content/the-canvas-element/size.attributes.setAttribute.hex.html
/LayoutTests/imported/w3c/web-platform-tests/html/semantics/embedded-content/the-canvas-element/size.attributes.setAttribute.junk.html
/LayoutTests/imported/w3c/web-platform-tests/html/semantics/embedded-content/the-canvas-element/size.attributes.setAttribute.junk.png
/LayoutTests/imported/w3c/web-platform-tests/html/semantics/embedded-content/the-canvas-element/size.attributes.setAttribute.minus.html
/LayoutTests/imported/w3c/web-platform-tests/html/semantics/embedded-content/the-canvas-element/size.attributes.setAttribute.minus.png
/LayoutTests/imported/w3c/web-platform-tests/html/semantics/embedded-content/the-canvas-element/size.attributes.setAttribute.octal.html
/LayoutTests/imported/w3c/web-platform-tests/html/semantics/embedded-content/the-canvas-element/size.attributes.setAttribute.octal.png
/LayoutTests/imported/w3c/web-platform-tests/html/semantics/embedded-content/the-canvas-element/size.attributes.setAttribute.onlyspace.html
/LayoutTests/imported/w3c/web-platform-tests/html/semantics/embedded-content/the-canvas-element/size.attributes.setAttribute.onlyspace.png
/LayoutTests/imported/w3c/web-platform-tests/html/semantics/embedded-content/the-canvas-element/size.attributes.setAttribute.percent.html
/LayoutTests/imported/w3c/web-platform-tests/html/semantics/embedded-content/the-canvas-element/size.attributes.setAttribute.percent.png
/LayoutTests/imported/w3c/web-platform-tests/html/semantics/embedded-content/the-canvas-element/size.attributes.setAttribute.plus.html
/LayoutTests/imported/w3c/web-platform-tests/html/semantics/embedded-content/the-canvas-element/size.attributes.setAttribute.plus.png
/LayoutTests/imported/w3c/web-platform-tests/html/semantics/embedded-content/the-canvas-element/size.attributes.setAttribute.space.html
/LayoutTests/imported/w3c/web-platform-tests/html/semantics/embedded-content/the-canvas-element/size.attributes.setAttribute.space.png
/LayoutTests/imported/w3c/web-platform-tests/html/semantics/embedded-content/the-canvas-element/size.attributes.setAttribute.trailingjunk.html
/LayoutTests/imported/w3c/web-platform-tests/html/semantics/embedded-content/the-canvas-element/size.attributes.setAttribute.trailingjunk.png
/LayoutTests/imported/w3c/web-platform-tests/html/semantics/embedded-content/the-canvas-element/size.attributes.setAttribute.whitespace.html
/LayoutTests/imported/w3c/web-platform-tests/html/semantics/embedded-content/the-canvas-element/size.attributes.setAttribute.whitespace.png
/LayoutTests/imported/w3c/web-platform-tests/html/semantics/embedded-content/the-canvas-element/size.attributes.setAttribute.zero.html
/LayoutTests/imported/w3c/web-platform-tests/html/semantics/embedded-content/the-canvas-element/size.attributes.style.html
/LayoutTests/imported/w3c/web-platform-tests/html/semantics/embedded-content/the-canvas-element/size.attributes.style.png
/LayoutTests/imported/w3c/web-platform-tests/html/semantics/embedded-content/the-canvas-element/toBlob-cross-realm-callback-report-exception.html
/LayoutTests/imported/w3c/web-platform-tests/html/semantics/embedded-content/the-canvas-element/toBlob.jpeg.html
/LayoutTests/imported/w3c/web-platform-tests/html/semantics/embedded-content/the-canvas-element/toBlob.null.html
/LayoutTests/imported/w3c/web-platform-tests/html/semantics/embedded-content/the-canvas-element/toBlob.png.html
/LayoutTests/imported/w3c/web-platform-tests/html/semantics/embedded-content/the-canvas-element/toDataURL.arguments.1.html
/LayoutTests/imported/w3c/web-platform-tests/html/semantics/embedded-content/the-canvas-element/toDataURL.arguments.2.html
/LayoutTests/imported/w3c/web-platform-tests/html/semantics/embedded-content/the-canvas-element/toDataURL.arguments.3.html
/LayoutTests/imported/w3c/web-platform-tests/html/semantics/embedded-content/the-canvas-element/toDataURL.bogustype.html
/LayoutTests/imported/w3c/web-platform-tests/html/semantics/embedded-content/the-canvas-element/toDataURL.default.html
/LayoutTests/imported/w3c/web-platform-tests/html/semantics/embedded-content/the-canvas-element/toDataURL.jpeg.alpha.html
/LayoutTests/imported/w3c/web-platform-tests/html/semantics/embedded-content/the-canvas-element/toDataURL.jpeg.alpha.png
/LayoutTests/imported/w3c/web-platform-tests/html/semantics/embedded-content/the-canvas-element/toDataURL.jpeg.primarycolours.html
/LayoutTests/imported/w3c/web-platform-tests/html/semantics/embedded-content/the-canvas-element/toDataURL.jpeg.primarycolours.png
/LayoutTests/imported/w3c/web-platform-tests/html/semantics/embedded-content/the-canvas-element/toDataURL.jpeg.quality.basic.html
/LayoutTests/imported/w3c/web-platform-tests/html/semantics/embedded-content/the-canvas-element/toDataURL.jpeg.quality.basic.png
/LayoutTests/imported/w3c/web-platform-tests/html/semantics/embedded-content/the-canvas-element/toDataURL.jpeg.quality.notnumber.html
/LayoutTests/imported/w3c/web-platform-tests/html/semantics/embedded-content/the-canvas-element/toDataURL.jpeg.quality.outsiderange.html
/LayoutTests/imported/w3c/web-platform-tests/html/semantics/embedded-content/the-canvas-element/toDataURL.jpg.html
/LayoutTests/imported/w3c/web-platform-tests/html/semantics/embedded-content/the-canvas-element/toDataURL.lowercase.ascii.html
/LayoutTests/imported/w3c/web-platform-tests/html/semantics/embedded-content/the-canvas-element/toDataURL.lowercase.unicode.html
/LayoutTests/imported/w3c/web-platform-tests/html/semantics/embedded-content/the-canvas-element/toDataURL.nocontext.html
/LayoutTests/imported/w3c/web-platform-tests/html/semantics/embedded-content/the-canvas-element/toDataURL.png.complexcolours.html
/LayoutTests/imported/w3c/web-platform-tests/html/semantics/embedded-content/the-canvas-element/toDataURL.png.complexcolours.png
/LayoutTests/imported/w3c/web-platform-tests/html/semantics/embedded-content/the-canvas-element/toDataURL.png.html
/LayoutTests/imported/w3c/web-platform-tests/html/semantics/embedded-content/the-canvas-element/toDataURL.png.primarycolours.html
/LayoutTests/imported/w3c/web-platform-tests/html/semantics/embedded-content/the-canvas-element/toDataURL.png.primarycolours.png
/LayoutTests/imported/w3c/web-platform-tests/html/semantics/embedded-content/the-canvas-element/toDataURL.unrecognised.html
/LayoutTests/imported/w3c/web-platform-tests/html/semantics/embedded-content/the-canvas-element/toDataURL.zeroheight.html
/LayoutTests/imported/w3c/web-platform-tests/html/semantics/embedded-content/the-canvas-element/toDataURL.zerosize.html
/LayoutTests/imported/w3c/web-platform-tests/html/semantics/embedded-content/the-canvas-element/toDataURL.zerowidth.html
/LayoutTests/imported/w3c/web-platform-tests/html/semantics/embedded-content/the-canvas-element/type.delete.html
/LayoutTests/imported/w3c/web-platform-tests/html/semantics/embedded-content/the-canvas-element/type.exists.html
/LayoutTests/imported/w3c/web-platform-tests/html/semantics/embedded-content/the-canvas-element/type.extend.html
/LayoutTests/imported/w3c/web-platform-tests/html/semantics/embedded-content/the-canvas-element/type.name.html
/LayoutTests/imported/w3c/web-platform-tests/html/semantics/embedded-content/the-canvas-element/type.prototype.html
/LayoutTests/imported/w3c/web-platform-tests/html/semantics/embedded-content/the-canvas-element/type.replace.html
