layer at (0,0) size 800x600
  RenderView at (0,0) size 800x600
layer at (0,0) size 800x600
  RenderSVGRoot {svg} at (0,0) size 800x600
    RenderSVGContainer {g} at (33,222) size 651x143
      RenderSVGText {text} at (69,133) size 322x21 contains 1 chunk(s)
        RenderSVGInlineText {#text} at (209,0) size 112x21
          chunk 1 (middle anchor) text run 1 at (279.13,150.00) startOffset 0 endOffset 14 width 111.60 RTL: "\x{646}\x{634}\x{627}\x{637} \x{627}\x{644}\x{62A}\x{62F}\x{648}\x{64A}\x{644} \""
        RenderSVGTSpan {tspan} at (0,0) size 199x21
          RenderSVGInlineText {#text} at (11,0) size 199x21
            chunk 1 (middle anchor) text run 1 at (80.67,150.00) startOffset 0 endOffset 25 width 198.46 RTL: "dirRTL ubOverride, \x{627}\x{62E}\x{62A}\x{628}\x{627}\x{631}"
        RenderSVGInlineText {#text} at (0,0) size 12x21
          chunk 1 (middle anchor) text run 1 at (69.27,150.00) startOffset 0 endOffset 2 width 11.40 RTL: "\"!"
      RenderSVGText {text} at (20,170) size 84x13 contains 1 chunk(s)
        RenderSVGInlineText {#text} at (0,0) size 84x12
          chunk 1 text run 1 at (20.00,180.00) startOffset 0 endOffset 18 width 84.00: "Reference graphic:"
      RenderSVGImage {image} at (100,300) size 584x65
    RenderSVGContainer {g} at (16,557) size 76x12
      RenderSVGText {text} at (10,334) size 45x8 contains 1 chunk(s)
        RenderSVGInlineText {#text} at (0,0) size 45x7
          chunk 1 text run 1 at (10.00,340.00) startOffset 0 endOffset 16 width 45.00: "$Revision: 1.7 $"
    RenderSVGRect {rect} at (0,0) size 800x600 [stroke={[type=SOLID] [color=#000000]}] [x=1.00] [y=1.00] [width=478.00] [height=358.00]
    RenderSVGContainer {g} at (0,0) size 800x38
      RenderSVGRect {rect} at (0,0) size 800x36 [stroke={[type=SOLID] [color=#000000]}] [fill={[type=SOLID] [color=#FF0000]}] [x=1.00] [y=1.00] [width=478.00] [height=20.00]
      RenderSVGText {text} at (206,-1) size 68x24 contains 1 chunk(s)
        RenderSVGInlineText {#text} at (0,0) size 68x23
          chunk 1 (middle anchor) text run 1 at (206.40,18.00) startOffset 0 endOffset 5 width 67.20: "DRAFT"
