layer at (0,0) size 800x600
  RenderView at (0,0) size 800x600
layer at (0,0) size 800x600
  RenderBlock {HTML} at (0,0) size 800x600
    RenderBody {BODY} at (8,8) size 784x584
      RenderBlock {DIV} at (0,0) size 784x20
        RenderText {#text} at (0,0) size 266x19
          text run at (0,0) width 266: "PASS! This test passes if it does not crash."
      RenderBlock {DIV} at (0,20) size 200x200
