layer at (0,0) size 785x1369
  RenderView at (0,0) size 785x600
layer at (0,0) size 785x1369
  RenderBlock {HTML} at (0,0) size 785x1369
    RenderBody {BODY} at (8,8) size 769x1353 [bgcolor=#CCCCCC]
      RenderBlock {P} at (0,0) size 769x20
        RenderText {#text} at (0,0) size 355x19
          text run at (0,0) width 355: "The style declarations which apply to the text below are:"
      RenderBlock {PRE} at (0,36) size 769x192
        RenderText {#text} at (0,0) size 632x192
          text run at (0,0) width 560: ".one {border-style: dotted; border-color: black; border-width: thick;}"
          text run at (560,0) width 0: " "
          text run at (0,16) width 560: ".two {border-style: dashed; border-color: black; border-width: thick;}"
          text run at (560,16) width 0: " "
          text run at (0,32) width 568: ".three {border-style: solid; border-color: black; border-width: thick;}"
          text run at (568,32) width 0: " "
          text run at (0,48) width 568: ".four {border-style: double; border-color: black; border-width: thick;}"
          text run at (568,48) width 0: " "
          text run at (0,64) width 568: ".five {border-style: groove; border-color: olive; border-width: thick;}"
          text run at (568,64) width 0: " "
          text run at (0,80) width 552: ".six {border-style: ridge; border-color: olive; border-width: thick;}"
          text run at (552,80) width 0: " "
          text run at (0,96) width 568: ".seven {border-style: inset; border-color: olive; border-width: thick;}"
          text run at (568,96) width 0: " "
          text run at (0,112) width 576: ".eight {border-style: outset; border-color: olive; border-width: thick;}"
          text run at (576,112) width 0: " "
          text run at (0,128) width 632: ".nine {border-style: double groove; border-color: purple; border-width: thick;}"
          text run at (632,128) width 0: " "
          text run at (0,144) width 368: ".ten {border-style: double groove ridge inset;"
          text run at (368,144) width 0: " "
          text run at (0,160) width 368: "   border-color: purple; border-width: thick;}"
          text run at (368,160) width 0: " "
          text run at (0,176) width 552: ".eleven {border-style: none; border-color: red; border-width: thick;}"
          text run at (552,176) width 0: " "
      RenderBlock {P} at (0,259) size 769x30 [border: (5px dotted #000000)]
        RenderText {#text} at (5,5) size 472x19
          text run at (5,5) width 472: "This paragraph should have a thick black dotted border all the way around."
      RenderBlock {P} at (0,305) size 769x30 [border: (5px dashed #000000)]
        RenderText {#text} at (5,5) size 477x19
          text run at (5,5) width 477: "This paragraph should have a thick black dashed border all the way around."
      RenderBlock {P} at (0,351) size 769x30 [border: (5px solid #000000)]
        RenderText {#text} at (5,5) size 463x19
          text run at (5,5) width 463: "This paragraph should have a thick black solid border all the way around."
      RenderBlock {P} at (0,397) size 769x30 [border: (5px double #000000)]
        RenderText {#text} at (5,5) size 476x19
          text run at (5,5) width 476: "This paragraph should have a thick black double border all the way around."
      RenderBlock {P} at (0,443) size 769x30 [border: (5px groove #808000)]
        RenderText {#text} at (5,5) size 474x19
          text run at (5,5) width 474: "This paragraph should have a thick olive groove border all the way around."
      RenderBlock {P} at (0,489) size 769x30 [border: (5px ridge #808000)]
        RenderText {#text} at (5,5) size 462x19
          text run at (5,5) width 462: "This paragraph should have a thick olive ridge border all the way around."
      RenderBlock {P} at (0,535) size 769x30 [border: (5px inset #808000)]
        RenderText {#text} at (5,5) size 459x19
          text run at (5,5) width 459: "This paragraph should have a thick olive inset border all the way around."
      RenderBlock {P} at (0,581) size 769x30 [border: (5px outset #808000)]
        RenderText {#text} at (5,5) size 467x19
          text run at (5,5) width 467: "This paragraph should have a thick olive outset border all the way around."
      RenderBlock {P} at (0,627) size 769x50 [border: (5px double #800080) (5px groove #800080) (5px double #800080) (5px groove #800080)]
        RenderText {#text} at (5,5) size 744x39
          text run at (5,5) width 617: "This paragraph should have thick double top and bottom borders, and thick grooved side borders. "
          text run at (622,5) width 127: "The color of all four"
          text run at (5,25) width 204: "sides should be based on purple."
      RenderBlock {P} at (0,693) size 769x50 [border: (5px double #800080) (5px groove #800080) (5px ridge #800080) (5px inset #800080)]
        RenderText {#text} at (5,5) size 726x39
          text run at (5,5) width 701: "This paragraph should have, in clockwise order from the top, a double, grooved, ridged, and inset thick border. "
          text run at (706,5) width 25: "The"
          text run at (5,25) width 306: "color of all four sides should be based on purple."
      RenderBlock {P} at (0,759) size 769x20
        RenderText {#text} at (0,0) size 278x19
          text run at (0,0) width 278: "This paragraph should have no border at all."
      RenderTable {TABLE} at (0,795) size 769x558 [border: (1px outset #808080)]
        RenderTableSection {TBODY} at (1,1) size 767x556
          RenderTableRow {TR} at (0,0) size 767x28
            RenderTableCell {TD} at (0,0) size 767x28 [bgcolor=#C0C0C0] [border: (1px inset #808080)] [r=0 c=0 rs=1 cs=2]
              RenderInline {STRONG} at (0,0) size 160x19
                RenderText {#text} at (4,4) size 160x19
                  text run at (4,4) width 160: "TABLE Testing Section"
          RenderTableRow {TR} at (0,28) size 767x528
            RenderTableCell {TD} at (0,278) size 12x28 [bgcolor=#C0C0C0] [border: (1px inset #808080)] [r=1 c=0 rs=1 cs=1]
              RenderText {#text} at (4,4) size 4x19
                text run at (4,4) width 4: " "
            RenderTableCell {TD} at (12,28) size 755x528 [border: (1px inset #808080)] [r=1 c=1 rs=1 cs=1]
              RenderBlock {P} at (4,4) size 747x30 [border: (5px dotted #000000)]
                RenderText {#text} at (5,5) size 472x19
                  text run at (5,5) width 472: "This paragraph should have a thick black dotted border all the way around."
              RenderBlock {P} at (4,50) size 747x30 [border: (5px dashed #000000)]
                RenderText {#text} at (5,5) size 477x19
                  text run at (5,5) width 477: "This paragraph should have a thick black dashed border all the way around."
              RenderBlock {P} at (4,96) size 747x30 [border: (5px solid #000000)]
                RenderText {#text} at (5,5) size 463x19
                  text run at (5,5) width 463: "This paragraph should have a thick black solid border all the way around."
              RenderBlock {P} at (4,142) size 747x30 [border: (5px double #000000)]
                RenderText {#text} at (5,5) size 476x19
                  text run at (5,5) width 476: "This paragraph should have a thick black double border all the way around."
              RenderBlock {P} at (4,188) size 747x30 [border: (5px groove #808000)]
                RenderText {#text} at (5,5) size 474x19
                  text run at (5,5) width 474: "This paragraph should have a thick olive groove border all the way around."
              RenderBlock {P} at (4,234) size 747x30 [border: (5px ridge #808000)]
                RenderText {#text} at (5,5) size 462x19
                  text run at (5,5) width 462: "This paragraph should have a thick olive ridge border all the way around."
              RenderBlock {P} at (4,280) size 747x30 [border: (5px inset #808000)]
                RenderText {#text} at (5,5) size 459x19
                  text run at (5,5) width 459: "This paragraph should have a thick olive inset border all the way around."
              RenderBlock {P} at (4,326) size 747x30 [border: (5px outset #808000)]
                RenderText {#text} at (5,5) size 467x19
                  text run at (5,5) width 467: "This paragraph should have a thick olive outset border all the way around."
              RenderBlock {P} at (4,372) size 747x50 [border: (5px double #800080) (5px groove #800080) (5px double #800080) (5px groove #800080)]
                RenderText {#text} at (5,5) size 714x39
                  text run at (5,5) width 617: "This paragraph should have thick double top and bottom borders, and thick grooved side borders. "
                  text run at (622,5) width 97: "The color of all"
                  text run at (5,25) width 234: "four sides should be based on purple."
              RenderBlock {P} at (4,438) size 747x50 [border: (5px double #800080) (5px groove #800080) (5px ridge #800080) (5px inset #800080)]
                RenderText {#text} at (5,5) size 726x39
                  text run at (5,5) width 701: "This paragraph should have, in clockwise order from the top, a double, grooved, ridged, and inset thick border. "
                  text run at (706,5) width 25: "The"
                  text run at (5,25) width 306: "color of all four sides should be based on purple."
              RenderBlock {P} at (4,504) size 747x20
                RenderText {#text} at (0,0) size 278x19
                  text run at (0,0) width 278: "This paragraph should have no border at all."
layer at (8,249) size 769x2 clip at (0,0) size 0x0
  RenderBlock {HR} at (0,241) size 769x2 [color=#808080] [border: (1px inset #808080)]
