The tests in this directory were imported from the W3C repository.
Do NOT modify these tests directly in WebKit.
Instead, create a pull request on the WPT github:
	https://github.com/web-platform-tests/wpt

Then run the Tools/Scripts/import-w3c-tests in WebKit to reimport

Do NOT modify or remove this file.

------------------------------------------------------------------------
Properties requiring vendor prefixes:
None
Property values requiring vendor prefixes:
None
------------------------------------------------------------------------
List of files:
/LayoutTests/imported/w3c/web-platform-tests/css/css-sizing/contain-intrinsic-size/auto-001.html
/LayoutTests/imported/w3c/web-platform-tests/css/css-sizing/contain-intrinsic-size/auto-002.html
/LayoutTests/imported/w3c/web-platform-tests/css/css-sizing/contain-intrinsic-size/auto-003.html
/LayoutTests/imported/w3c/web-platform-tests/css/css-sizing/contain-intrinsic-size/auto-004.html
/LayoutTests/imported/w3c/web-platform-tests/css/css-sizing/contain-intrinsic-size/auto-005.html
/LayoutTests/imported/w3c/web-platform-tests/css/css-sizing/contain-intrinsic-size/auto-006.html
/LayoutTests/imported/w3c/web-platform-tests/css/css-sizing/contain-intrinsic-size/auto-007.html
/LayoutTests/imported/w3c/web-platform-tests/css/css-sizing/contain-intrinsic-size/auto-008.html
/LayoutTests/imported/w3c/web-platform-tests/css/css-sizing/contain-intrinsic-size/auto-009.html
/LayoutTests/imported/w3c/web-platform-tests/css/css-sizing/contain-intrinsic-size/auto-010.html
/LayoutTests/imported/w3c/web-platform-tests/css/css-sizing/contain-intrinsic-size/auto-011.html
/LayoutTests/imported/w3c/web-platform-tests/css/css-sizing/contain-intrinsic-size/auto-012.html
/LayoutTests/imported/w3c/web-platform-tests/css/css-sizing/contain-intrinsic-size/contain-intrinsic-size-001-expected.html
/LayoutTests/imported/w3c/web-platform-tests/css/css-sizing/contain-intrinsic-size/contain-intrinsic-size-001-ref.html
/LayoutTests/imported/w3c/web-platform-tests/css/css-sizing/contain-intrinsic-size/contain-intrinsic-size-001.html
/LayoutTests/imported/w3c/web-platform-tests/css/css-sizing/contain-intrinsic-size/contain-intrinsic-size-002-expected.html
/LayoutTests/imported/w3c/web-platform-tests/css/css-sizing/contain-intrinsic-size/contain-intrinsic-size-002-ref.html
/LayoutTests/imported/w3c/web-platform-tests/css/css-sizing/contain-intrinsic-size/contain-intrinsic-size-002.html
/LayoutTests/imported/w3c/web-platform-tests/css/css-sizing/contain-intrinsic-size/contain-intrinsic-size-003-expected.html
/LayoutTests/imported/w3c/web-platform-tests/css/css-sizing/contain-intrinsic-size/contain-intrinsic-size-003-ref.html
/LayoutTests/imported/w3c/web-platform-tests/css/css-sizing/contain-intrinsic-size/contain-intrinsic-size-003.html
/LayoutTests/imported/w3c/web-platform-tests/css/css-sizing/contain-intrinsic-size/contain-intrinsic-size-004-expected.html
/LayoutTests/imported/w3c/web-platform-tests/css/css-sizing/contain-intrinsic-size/contain-intrinsic-size-004-ref.html
/LayoutTests/imported/w3c/web-platform-tests/css/css-sizing/contain-intrinsic-size/contain-intrinsic-size-004.html
/LayoutTests/imported/w3c/web-platform-tests/css/css-sizing/contain-intrinsic-size/contain-intrinsic-size-005-expected.html
/LayoutTests/imported/w3c/web-platform-tests/css/css-sizing/contain-intrinsic-size/contain-intrinsic-size-005-ref.html
/LayoutTests/imported/w3c/web-platform-tests/css/css-sizing/contain-intrinsic-size/contain-intrinsic-size-005.html
/LayoutTests/imported/w3c/web-platform-tests/css/css-sizing/contain-intrinsic-size/contain-intrinsic-size-006-expected.html
/LayoutTests/imported/w3c/web-platform-tests/css/css-sizing/contain-intrinsic-size/contain-intrinsic-size-006-ref.html
/LayoutTests/imported/w3c/web-platform-tests/css/css-sizing/contain-intrinsic-size/contain-intrinsic-size-006.html
/LayoutTests/imported/w3c/web-platform-tests/css/css-sizing/contain-intrinsic-size/contain-intrinsic-size-007-expected.html
/LayoutTests/imported/w3c/web-platform-tests/css/css-sizing/contain-intrinsic-size/contain-intrinsic-size-007-ref.html
/LayoutTests/imported/w3c/web-platform-tests/css/css-sizing/contain-intrinsic-size/contain-intrinsic-size-007.html
/LayoutTests/imported/w3c/web-platform-tests/css/css-sizing/contain-intrinsic-size/contain-intrinsic-size-008-expected.html
/LayoutTests/imported/w3c/web-platform-tests/css/css-sizing/contain-intrinsic-size/contain-intrinsic-size-008-ref.html
/LayoutTests/imported/w3c/web-platform-tests/css/css-sizing/contain-intrinsic-size/contain-intrinsic-size-008.html
/LayoutTests/imported/w3c/web-platform-tests/css/css-sizing/contain-intrinsic-size/contain-intrinsic-size-009.html
/LayoutTests/imported/w3c/web-platform-tests/css/css-sizing/contain-intrinsic-size/contain-intrinsic-size-010-expected.html
/LayoutTests/imported/w3c/web-platform-tests/css/css-sizing/contain-intrinsic-size/contain-intrinsic-size-010-ref.html
/LayoutTests/imported/w3c/web-platform-tests/css/css-sizing/contain-intrinsic-size/contain-intrinsic-size-010.html
/LayoutTests/imported/w3c/web-platform-tests/css/css-sizing/contain-intrinsic-size/contain-intrinsic-size-011-expected.html
/LayoutTests/imported/w3c/web-platform-tests/css/css-sizing/contain-intrinsic-size/contain-intrinsic-size-011-ref.html
/LayoutTests/imported/w3c/web-platform-tests/css/css-sizing/contain-intrinsic-size/contain-intrinsic-size-011.html
/LayoutTests/imported/w3c/web-platform-tests/css/css-sizing/contain-intrinsic-size/contain-intrinsic-size-012-expected.html
/LayoutTests/imported/w3c/web-platform-tests/css/css-sizing/contain-intrinsic-size/contain-intrinsic-size-012-ref.html
/LayoutTests/imported/w3c/web-platform-tests/css/css-sizing/contain-intrinsic-size/contain-intrinsic-size-012.html
/LayoutTests/imported/w3c/web-platform-tests/css/css-sizing/contain-intrinsic-size/contain-intrinsic-size-013-expected.html
/LayoutTests/imported/w3c/web-platform-tests/css/css-sizing/contain-intrinsic-size/contain-intrinsic-size-013-ref.html
/LayoutTests/imported/w3c/web-platform-tests/css/css-sizing/contain-intrinsic-size/contain-intrinsic-size-013.html
/LayoutTests/imported/w3c/web-platform-tests/css/css-sizing/contain-intrinsic-size/contain-intrinsic-size-014-expected.html
/LayoutTests/imported/w3c/web-platform-tests/css/css-sizing/contain-intrinsic-size/contain-intrinsic-size-014-ref.html
/LayoutTests/imported/w3c/web-platform-tests/css/css-sizing/contain-intrinsic-size/contain-intrinsic-size-014.html
/LayoutTests/imported/w3c/web-platform-tests/css/css-sizing/contain-intrinsic-size/contain-intrinsic-size-015-expected.html
/LayoutTests/imported/w3c/web-platform-tests/css/css-sizing/contain-intrinsic-size/contain-intrinsic-size-015-ref.html
/LayoutTests/imported/w3c/web-platform-tests/css/css-sizing/contain-intrinsic-size/contain-intrinsic-size-015.html
/LayoutTests/imported/w3c/web-platform-tests/css/css-sizing/contain-intrinsic-size/contain-intrinsic-size-016-expected.html
/LayoutTests/imported/w3c/web-platform-tests/css/css-sizing/contain-intrinsic-size/contain-intrinsic-size-016-ref.html
/LayoutTests/imported/w3c/web-platform-tests/css/css-sizing/contain-intrinsic-size/contain-intrinsic-size-016.html
/LayoutTests/imported/w3c/web-platform-tests/css/css-sizing/contain-intrinsic-size/contain-intrinsic-size-017-expected.html
/LayoutTests/imported/w3c/web-platform-tests/css/css-sizing/contain-intrinsic-size/contain-intrinsic-size-017-ref.html
/LayoutTests/imported/w3c/web-platform-tests/css/css-sizing/contain-intrinsic-size/contain-intrinsic-size-017.html
/LayoutTests/imported/w3c/web-platform-tests/css/css-sizing/contain-intrinsic-size/contain-intrinsic-size-018-expected.html
/LayoutTests/imported/w3c/web-platform-tests/css/css-sizing/contain-intrinsic-size/contain-intrinsic-size-018-ref.html
/LayoutTests/imported/w3c/web-platform-tests/css/css-sizing/contain-intrinsic-size/contain-intrinsic-size-018.html
/LayoutTests/imported/w3c/web-platform-tests/css/css-sizing/contain-intrinsic-size/contain-intrinsic-size-019-expected.html
/LayoutTests/imported/w3c/web-platform-tests/css/css-sizing/contain-intrinsic-size/contain-intrinsic-size-019-ref.html
/LayoutTests/imported/w3c/web-platform-tests/css/css-sizing/contain-intrinsic-size/contain-intrinsic-size-019.html
/LayoutTests/imported/w3c/web-platform-tests/css/css-sizing/contain-intrinsic-size/contain-intrinsic-size-020-expected.html
/LayoutTests/imported/w3c/web-platform-tests/css/css-sizing/contain-intrinsic-size/contain-intrinsic-size-020-ref.html
/LayoutTests/imported/w3c/web-platform-tests/css/css-sizing/contain-intrinsic-size/contain-intrinsic-size-020.html
/LayoutTests/imported/w3c/web-platform-tests/css/css-sizing/contain-intrinsic-size/contain-intrinsic-size-021-expected.html
/LayoutTests/imported/w3c/web-platform-tests/css/css-sizing/contain-intrinsic-size/contain-intrinsic-size-021-ref.html
/LayoutTests/imported/w3c/web-platform-tests/css/css-sizing/contain-intrinsic-size/contain-intrinsic-size-021.html
/LayoutTests/imported/w3c/web-platform-tests/css/css-sizing/contain-intrinsic-size/contain-intrinsic-size-022-expected.html
/LayoutTests/imported/w3c/web-platform-tests/css/css-sizing/contain-intrinsic-size/contain-intrinsic-size-022-ref.html
/LayoutTests/imported/w3c/web-platform-tests/css/css-sizing/contain-intrinsic-size/contain-intrinsic-size-022.html
/LayoutTests/imported/w3c/web-platform-tests/css/css-sizing/contain-intrinsic-size/contain-intrinsic-size-023-expected.html
/LayoutTests/imported/w3c/web-platform-tests/css/css-sizing/contain-intrinsic-size/contain-intrinsic-size-023-ref.html
/LayoutTests/imported/w3c/web-platform-tests/css/css-sizing/contain-intrinsic-size/contain-intrinsic-size-023.html
/LayoutTests/imported/w3c/web-platform-tests/css/css-sizing/contain-intrinsic-size/contain-intrinsic-size-024-expected.html
/LayoutTests/imported/w3c/web-platform-tests/css/css-sizing/contain-intrinsic-size/contain-intrinsic-size-024-ref.html
/LayoutTests/imported/w3c/web-platform-tests/css/css-sizing/contain-intrinsic-size/contain-intrinsic-size-024.html
/LayoutTests/imported/w3c/web-platform-tests/css/css-sizing/contain-intrinsic-size/contain-intrinsic-size-025-expected.html
/LayoutTests/imported/w3c/web-platform-tests/css/css-sizing/contain-intrinsic-size/contain-intrinsic-size-025-ref.html
/LayoutTests/imported/w3c/web-platform-tests/css/css-sizing/contain-intrinsic-size/contain-intrinsic-size-025.html
/LayoutTests/imported/w3c/web-platform-tests/css/css-sizing/contain-intrinsic-size/contain-intrinsic-size-026-expected.html
/LayoutTests/imported/w3c/web-platform-tests/css/css-sizing/contain-intrinsic-size/contain-intrinsic-size-026-ref.html
/LayoutTests/imported/w3c/web-platform-tests/css/css-sizing/contain-intrinsic-size/contain-intrinsic-size-026.html
/LayoutTests/imported/w3c/web-platform-tests/css/css-sizing/contain-intrinsic-size/contain-intrinsic-size-027-expected.html
/LayoutTests/imported/w3c/web-platform-tests/css/css-sizing/contain-intrinsic-size/contain-intrinsic-size-027.html
/LayoutTests/imported/w3c/web-platform-tests/css/css-sizing/contain-intrinsic-size/contain-intrinsic-size-028.html
/LayoutTests/imported/w3c/web-platform-tests/css/css-sizing/contain-intrinsic-size/contain-intrinsic-size-029.html
/LayoutTests/imported/w3c/web-platform-tests/css/css-sizing/contain-intrinsic-size/contain-intrinsic-size-030.html
/LayoutTests/imported/w3c/web-platform-tests/css/css-sizing/contain-intrinsic-size/contain-intrinsic-size-031.html
/LayoutTests/imported/w3c/web-platform-tests/css/css-sizing/contain-intrinsic-size/contain-intrinsic-size-032.html
/LayoutTests/imported/w3c/web-platform-tests/css/css-sizing/contain-intrinsic-size/contain-intrinsic-size-033.html
/LayoutTests/imported/w3c/web-platform-tests/css/css-sizing/contain-intrinsic-size/contain-intrinsic-size-logical-001-expected.html
/LayoutTests/imported/w3c/web-platform-tests/css/css-sizing/contain-intrinsic-size/contain-intrinsic-size-logical-001.html
/LayoutTests/imported/w3c/web-platform-tests/css/css-sizing/contain-intrinsic-size/contain-intrinsic-size-logical-002-expected.html
/LayoutTests/imported/w3c/web-platform-tests/css/css-sizing/contain-intrinsic-size/contain-intrinsic-size-logical-002.html
/LayoutTests/imported/w3c/web-platform-tests/css/css-sizing/contain-intrinsic-size/contain-intrinsic-size-logical-003.html
