The tests in this directory were imported from the W3C repository.
Do NOT modify these tests directly in WebKit.
Instead, create a pull request on the WPT github:
	https://github.com/web-platform-tests/wpt

Then run the Tools/Scripts/import-w3c-tests in WebKit to reimport

Do NOT modify or remove this file.

------------------------------------------------------------------------
Properties requiring vendor prefixes:
None
Property values requiring vendor prefixes:
None
------------------------------------------------------------------------
List of files:
/LayoutTests/imported/w3c/web-platform-tests/css/css-flexbox/intrinsic-size/auto-min-size-001-expected.xht
/LayoutTests/imported/w3c/web-platform-tests/css/css-flexbox/intrinsic-size/auto-min-size-001.html
/LayoutTests/imported/w3c/web-platform-tests/css/css-flexbox/intrinsic-size/col-wrap-001-expected.xht
/LayoutTests/imported/w3c/web-platform-tests/css/css-flexbox/intrinsic-size/col-wrap-001.html
/LayoutTests/imported/w3c/web-platform-tests/css/css-flexbox/intrinsic-size/col-wrap-002-expected.xht
/LayoutTests/imported/w3c/web-platform-tests/css/css-flexbox/intrinsic-size/col-wrap-002.html
/LayoutTests/imported/w3c/web-platform-tests/css/css-flexbox/intrinsic-size/col-wrap-003-expected.xht
/LayoutTests/imported/w3c/web-platform-tests/css/css-flexbox/intrinsic-size/col-wrap-003.html
/LayoutTests/imported/w3c/web-platform-tests/css/css-flexbox/intrinsic-size/col-wrap-004-expected.xht
/LayoutTests/imported/w3c/web-platform-tests/css/css-flexbox/intrinsic-size/col-wrap-004.html
/LayoutTests/imported/w3c/web-platform-tests/css/css-flexbox/intrinsic-size/col-wrap-005-expected.xht
/LayoutTests/imported/w3c/web-platform-tests/css/css-flexbox/intrinsic-size/col-wrap-005.html
/LayoutTests/imported/w3c/web-platform-tests/css/css-flexbox/intrinsic-size/col-wrap-006-expected.xht
/LayoutTests/imported/w3c/web-platform-tests/css/css-flexbox/intrinsic-size/col-wrap-006.html
/LayoutTests/imported/w3c/web-platform-tests/css/css-flexbox/intrinsic-size/col-wrap-007-expected.xht
/LayoutTests/imported/w3c/web-platform-tests/css/css-flexbox/intrinsic-size/col-wrap-007.html
/LayoutTests/imported/w3c/web-platform-tests/css/css-flexbox/intrinsic-size/col-wrap-008-expected.xht
/LayoutTests/imported/w3c/web-platform-tests/css/css-flexbox/intrinsic-size/col-wrap-008.html
/LayoutTests/imported/w3c/web-platform-tests/css/css-flexbox/intrinsic-size/col-wrap-009-expected.xht
/LayoutTests/imported/w3c/web-platform-tests/css/css-flexbox/intrinsic-size/col-wrap-009.html
/LayoutTests/imported/w3c/web-platform-tests/css/css-flexbox/intrinsic-size/col-wrap-010.html
/LayoutTests/imported/w3c/web-platform-tests/css/css-flexbox/intrinsic-size/col-wrap-011-expected.xht
/LayoutTests/imported/w3c/web-platform-tests/css/css-flexbox/intrinsic-size/col-wrap-011.html
/LayoutTests/imported/w3c/web-platform-tests/css/css-flexbox/intrinsic-size/col-wrap-012-expected.xht
/LayoutTests/imported/w3c/web-platform-tests/css/css-flexbox/intrinsic-size/col-wrap-012.html
/LayoutTests/imported/w3c/web-platform-tests/css/css-flexbox/intrinsic-size/col-wrap-013-expected.xht
/LayoutTests/imported/w3c/web-platform-tests/css/css-flexbox/intrinsic-size/col-wrap-013.html
/LayoutTests/imported/w3c/web-platform-tests/css/css-flexbox/intrinsic-size/col-wrap-014-expected.xht
/LayoutTests/imported/w3c/web-platform-tests/css/css-flexbox/intrinsic-size/col-wrap-014.html
/LayoutTests/imported/w3c/web-platform-tests/css/css-flexbox/intrinsic-size/col-wrap-015-expected.xht
/LayoutTests/imported/w3c/web-platform-tests/css/css-flexbox/intrinsic-size/col-wrap-015.html
/LayoutTests/imported/w3c/web-platform-tests/css/css-flexbox/intrinsic-size/col-wrap-016-expected.xht
/LayoutTests/imported/w3c/web-platform-tests/css/css-flexbox/intrinsic-size/col-wrap-016.html
/LayoutTests/imported/w3c/web-platform-tests/css/css-flexbox/intrinsic-size/col-wrap-017-expected.xht
/LayoutTests/imported/w3c/web-platform-tests/css/css-flexbox/intrinsic-size/col-wrap-017.html
/LayoutTests/imported/w3c/web-platform-tests/css/css-flexbox/intrinsic-size/col-wrap-018.html
/LayoutTests/imported/w3c/web-platform-tests/css/css-flexbox/intrinsic-size/col-wrap-019.html
/LayoutTests/imported/w3c/web-platform-tests/css/css-flexbox/intrinsic-size/row-001-expected.xht
/LayoutTests/imported/w3c/web-platform-tests/css/css-flexbox/intrinsic-size/row-001.html
/LayoutTests/imported/w3c/web-platform-tests/css/css-flexbox/intrinsic-size/row-002-expected.xht
/LayoutTests/imported/w3c/web-platform-tests/css/css-flexbox/intrinsic-size/row-002.html
/LayoutTests/imported/w3c/web-platform-tests/css/css-flexbox/intrinsic-size/row-003-expected.xht
/LayoutTests/imported/w3c/web-platform-tests/css/css-flexbox/intrinsic-size/row-003.html
/LayoutTests/imported/w3c/web-platform-tests/css/css-flexbox/intrinsic-size/row-004-expected.xht
/LayoutTests/imported/w3c/web-platform-tests/css/css-flexbox/intrinsic-size/row-004.html
/LayoutTests/imported/w3c/web-platform-tests/css/css-flexbox/intrinsic-size/row-005.html
/LayoutTests/imported/w3c/web-platform-tests/css/css-flexbox/intrinsic-size/row-006-expected.xht
/LayoutTests/imported/w3c/web-platform-tests/css/css-flexbox/intrinsic-size/row-006.html
/LayoutTests/imported/w3c/web-platform-tests/css/css-flexbox/intrinsic-size/row-007-expected.xht
/LayoutTests/imported/w3c/web-platform-tests/css/css-flexbox/intrinsic-size/row-007.html
/LayoutTests/imported/w3c/web-platform-tests/css/css-flexbox/intrinsic-size/row-008.html
/LayoutTests/imported/w3c/web-platform-tests/css/css-flexbox/intrinsic-size/row-compat-001.html
/LayoutTests/imported/w3c/web-platform-tests/css/css-flexbox/intrinsic-size/row-use-cases-001.html
/LayoutTests/imported/w3c/web-platform-tests/css/css-flexbox/intrinsic-size/row-wrap-001.html
/LayoutTests/imported/w3c/web-platform-tests/css/css-flexbox/intrinsic-size/row-wrap-002.tentative-expected.xht
/LayoutTests/imported/w3c/web-platform-tests/css/css-flexbox/intrinsic-size/row-wrap-002.tentative.html
