layer at (0,0) size 480x360
  RenderView at (0,0) size 480x360
layer at (0,0) size 480x360
  RenderSVGRoot {svg} at (0,0) size 480x360
layer at (0,0) size 480x360
  RenderSVGViewportContainer at (0,0) size 480x360
layer at (63.55,18.50) size 352x21
  RenderSVGText {text} at (63,18) size 354x22 contains 1 chunk(s)
    RenderSVGInlineText {#text} at (0,0) size 353x21
      chunk 1 (middle anchor) text run 1 at (63.55,35.00) startOffset 0 endOffset 51 width 352.90: "Testing stroke inclusion for 'clip-path' and 'mask'"
layer at (150,0) size 200x200
  RenderSVGRect {rect} at (150,0) size 200x200 [fill={[type=SOLID] [color=#00008B]}] [x=150.00] [y=0.00] [width=200.00] [height=200.00]
layer at (50,96) size 114x18
  RenderSVGText {text} at (50,96) size 115x18 contains 1 chunk(s)
    RenderSVGInlineText {#text} at (0,0) size 115x18
      chunk 1 text run 1 at (50.00,110.00) startOffset 0 endOffset 19 width 114.17: "With a 'clip-path':"
layer at (150,150) size 200x200
  RenderSVGRect {rect} at (150,150) size 200x200 [fill={[type=SOLID] [color=#00008B]}] [x=150.00] [y=150.00] [width=200.00] [height=200.00]
layer at (50,246) size 91x18
  RenderSVGText {text} at (50,246) size 92x18 contains 1 chunk(s)
    RenderSVGInlineText {#text} at (0,0) size 92x18
      chunk 1 text run 1 at (50.00,260.00) startOffset 0 endOffset 14 width 91.08: "With a 'mask':"
layer at (10,304) size 263x46
  RenderSVGText {text} at (10,304) size 264x46 contains 1 chunk(s)
    RenderSVGInlineText {#text} at (0,0) size 264x46
      chunk 1 text run 1 at (10.00,340.00) startOffset 0 endOffset 16 width 263.34: "$Revision: 1.7 $"
layer at (1,1) size 478x358
  RenderSVGRect {rect} at (1,1) size 478x358 [stroke={[type=SOLID] [color=#000000]}] [x=1.00] [y=1.00] [width=478.00] [height=358.00]
