{
    "TestAuthentication": {
        "subtests": {
            "/webkit/Authentication/authentication-empty-realm": {
                "expected": {"all@Debug": {"status": ["CRASH"], "bug": "webkit.org/b/221119"}}
            },
            "/webkit/Authentication/authentication-no-credential": {
                "expected": {"all@Debug": {"status": ["CRASH"], "bug": "webkit.org/b/221119"}}
            },
            "/webkit/Authentication/authentication-success": {
                "expected": {
                        "all@Debug": {"status": ["CRASH"], "bug": "webkit.org/b/221119"},
                        "gtk@Release": {"status": ["PASS", "TIMEOUT"], "bug": "webkit.org/b/233509"}
                }
            }
        }
    },
    "TestBackForwardList": {
        "subtests": {
            "/webkit/BackForwardList/list-limit-and-cache": {
                "expected": {
                    "all": {"status": ["PASS"], "slow": true }
                }
            },
            "/webkit/BackForwardList/navigation": {
                "expected": {
                    "all": {"status": ["PASS", "TIMEOUT"], "bug": "webkit.org/b/224175"}
                }
            }
        }
    },
    "TestWebKitAccessibility": {
        "subtests": {
            "/webkit/WebKitAccessibility/accessible/attributes": {
                "expected": {"gtk": {"status": ["FAIL", "PASS"], "bug": "webkit.org/b/246471"}}
            },
            "/webkit/WebKitAccessibility/accessible/children-changed": {
                "expected": {"gtk": {"status": ["FAIL", "PASS"], "bug": "webkit.org/b/246471"}}
            },
            "/webkit/WebKitAccessibility/accessible/basic-hierarchy": {
                "expected": {"gtk": {"status": ["FAIL", "PASS"], "bug": "webkit.org/b/246471"}}
            },
            "/webkit/WebKitAccessibility/text/selections": {
                "expected": {"gtk": {"status": ["TIMEOUT", "PASS"], "bug": "webkit.org/b/256557"}}
            },
            "/webkit/WebKitAccessibility/text/state-changed": {
                "expected": {"gtk": {"status": ["TIMEOUT", "PASS"], "bug": "webkit.org/b/256557"}}
            }
        }
    },
    "TestWebKitSettings": {
        "subtests": {
            "/webkit/WebKitSettings/javascript-markup": {
                "expected": {"all@Debug": {"status": ["CRASH"], "bug": "webkit.org/b/221119"}}
            }
        }
    },
    "TestUIClient": {
        "subtests": {
            "/webkit/WebKitWebView/geolocation-permission-requests": {
                "expected": {"all": {"status": ["TIMEOUT", "PASS"], "bug": "webkit.org/b/235955"}}
            }
        }
    },
    "TestPrinting": {
        "subtests": {
            "/webkit/WebKitPrintOperation/custom-widget": {
                "expected": {"gtk": {"status": ["FAIL", "TIMEOUT", "PASS"], "bug": "webkit.org/b/168196"}}
            }
        }
    },
    "TestWebViewEditor": {
        "subtests": {
            "/webkit/WebKitWebView/editable/editable": {
                "expected": {"gtk@Debug": {"status": ["FAIL"], "bug": "webkit.org/b/134580"}}
            }
        }
    },
    "TestWebProcessExtensions": {
        "subtests": {
            "/webkit/WebKitWebProcessExtension/form-submission-steps": {
                "expected": {"all": {"status": ["TIMEOUT", "PASS"], "bug": "webkit.org/b/205333"}}
            },
            "/webkit/WebKitWebProcessExtension/user-messages": {
                "expected": {"all": {"slow": true}}
            }
        }
    },
    "TestWebsiteData": {
        "subtests": {
            "/webkit/WebKitWebsiteData/cache": {
                "expected": {"wpe": {"status": ["CRASH", "PASS"], "bug": "webkit.org/b/260524"}}
            }
        }
    },
    "TestWebKitWebView": {
        "subtests": {
            "/webkit/WebKitWebView/is-web-process-responsive": {
                "expected": {"all": {"slow": true }}
            },
            "/webkit/WebKitWebView/terminate-unresponsive-web-process": {
                "expected": {"all": {"slow": true }}
            },
            "/webkit/WebKitWebView/fullscreen": {
                "expected": {"gtk": {"status": ["SKIP"], "bug": "webkit.org/b/248203"}}
            }
        }
    },
    "TestInspectorServer": {
        "subtests": {
           "/webkit/WebKitWebInspectorServer/test-page-list": {
              "expected": {"gtk": {"status": ["FAIL", "PASS"], "bug": "webkit.org/b/216646"}}
           }
        },
        "expected": {"all": {"slow": true}}
    },
    "TestLoaderClient": {
        "subtests": {
            "/webkit/WebKitWebPage/get-uri": {
                "expected": {"gtk": {"status": ["FAIL", "PASS"], "bug": "webkit.org/b/206728"}}
            },
            "/webkit/WebKitWebView/title": {
                "expected": {"all@Debug": {"status": ["CRASH"], "bug": "webkit.org/b/221119"}}
            }
        }
    },
    "TestWebKit": {
        "subtests": {
            "WebKit.MouseMoveAfterCrash": {
                "expected": {
                    "gtk": {"status": ["CRASH", "PASS"], "bug": "webkit.org/b/85066"}
                }
            },
            "WebKit.NewFirstVisuallyNonEmptyLayoutForImages": {
                "expected": {"gtk": {"status": ["FAIL", "PASS"], "bug": "webkit.org/b/85066"}}
            },
            "WebKit.SpacebarScrolling": {
                "expected": {"gtk": {"status": ["FAIL"], "bug": "webkit.org/b/84961"}}
            },
            "WebKit.WKConnection": {
                "expected": {"gtk": {"status": ["FAIL", "TIMEOUT"], "bug": "webkit.org/b/84959"}}
            },
            "WebKit.DidAssociateFormControls": {
                "expected": {"gtk": {"status": ["TIMEOUT"], "bug": "webkit.org/b/120302"}}
            },
            "WebKit.TerminateTwice": {
                "expected": {"gtk": {"status": ["SKIP"], "bug": "webkit.org/b/121970"}}
            },
            "WebKit.FocusedFrameAfterCrash": {
                "expected": {"gtk": {"status": ["TIMEOUT", "PASS"], "bug": "webkit.org/b/205336"}}
            },
            "WebKit.GeolocationWatchMultiprocess": {
                "expected": {"gtk": {"status": ["FAIL", "PASS"], "bug": "webkit.org/b/254002"}}
            },
            "WebKit.GeolocationTransitionToLowAccuracy": {
                "expected": {"gtk": {"status": ["FAIL", "PASS"], "bug": "webkit.org/b/254002"}}
            },
            "WebKit.PendingAPIRequestURL": {
                "expected": {"gtk": {"status": ["TIMEOUT", "PASS"], "bug": "webkit.org/b/254002"}}
            },
            "WebKit.DOMWindowExtensionCrashOnReload": {
                "expected": {"gtk": {"status": ["TIMEOUT", "PASS"], "bug": "webkit.org/b/254002"}}
            }
        }
    },
    "TestWebKitUserContentManager": {
        "subtests": {
            "WebKit.MouseMoveAfterCrash": {
                "expected": {
                    "gtk": {"status": ["FAIL"], "bug": "webkit.org/b/254002"}
                }
            }
        }
    },
    "TestWTF": {
        "subtests": {
            "ThreadMessage.MultipleSenders": {
                "expected": {"gtk": {"slow": true, "status": ["TIMEOUT", "PASS"], "bug": "webkit.org/b/246472" }}
            },
            "WTF_Condition.TenProducersOneConsumerHundredSlotsNotifyOne": {
                "expected": {"gtk": {"slow": true, "status": ["TIMEOUT", "PASS"], "bug": "webkit.org/b/246472" }}
            },
            "WTF_Condition.TenProducersOneConsumerHundredSlotsNotifyAll": {
                "expected": {"gtk": {"slow": true, "status": ["TIMEOUT", "PASS"], "bug": "webkit.org/b/246472" }}
            },
            "WTF_Condition.TenProducersTenConsumersHundredSlotsNotifyOne": {
                "expected": {"gtk": {"slow": true, "status": ["TIMEOUT", "PASS"], "bug": "webkit.org/b/246472" }}
            },
            "WTF_Condition.TenProducersTenConsumersHundredSlotsNotifyAll": {
                "expected": {"gtk": {"slow": true, "status": ["TIMEOUT", "PASS"], "bug": "webkit.org/b/246472" }}
            },
            "WTF_Condition.TenProducersTenConsumersOneSlot": {
                "expected": {"gtk": {"slow": true, "status": ["TIMEOUT", "PASS"], "bug": "webkit.org/b/246472" }}
            },
            "WTF_Condition.TenProducersOneConsumerOneSlot": {
                "expected": {"gtk": {"slow": true, "status": ["TIMEOUT", "PASS"], "bug": "webkit.org/b/246472" }}
            },
            "WTF_Condition.OneProducerOneConsumerHundredSlots": {
                "expected": {"gtk": {"slow": true, "status": ["TIMEOUT", "PASS"], "bug": "webkit.org/b/246472" }}
            },
            "WTF_Condition.OneProducerOneConsumerOneSlot": {
                "expected": {"gtk": {"slow": true, "status": ["TIMEOUT", "PASS"], "bug": "webkit.org/b/246472" }}
            },
            "WTF_Condition.OneProducerOneConsumerOneSlotTimeout": {
                "expected": {"gtk": {"slow": true, "status": ["TIMEOUT", "PASS"], "bug": "webkit.org/b/246472" }}
            },
            "WTF_Condition.OneProducerTenConsumersOneSlot": {
                "expected": {"gtk": {"slow": true, "status": ["TIMEOUT", "PASS"], "bug": "webkit.org/b/246472" }}
            },
            "WTF_Condition.OneProducerTenConsumersHundredSlotsNotifyAll": {
                "expected": {"gtk": {"slow": true, "status": ["TIMEOUT", "PASS"], "bug": "webkit.org/b/246472" }}
            },
            "WTF_Condition.OneProducerTenConsumersHundredSlotsNotifyOne": {
                "expected": {"gtk": {"slow": true, "status": ["TIMEOUT", "PASS"], "bug": "webkit.org/b/246472" }}
            },
            "WTF_Lock.ContendedShortSection": {
                "expected": {"all": {"slow": true, "status": ["TIMEOUT", "PASS"], "bug": "webkit.org/b/260029" }}
            },
            "WTF_Lock.ContendedLongSection": {
                "expected": {"all": {"slow": true, "status": ["TIMEOUT", "PASS"], "bug": "webkit.org/b/260029" }}
            },
            "WTF_Lock.ManyContendedLongSections": {
                "expected": {"gtk": {"slow": true, "status": ["TIMEOUT", "PASS"], "bug": "webkit.org/b/260029" }}
            },
            "WTF_Lock.ManyContendedShortSections": {
                "expected": {"gtk": {"slow": true, "status": ["TIMEOUT", "PASS"], "bug": "webkit.org/b/260029" }}
            },
            "WTF_Lock.SectionAddressCollision": {
                "expected": {"gtk": {"slow": true, "status": ["TIMEOUT", "PASS"], "bug": "webkit.org/b/260029" }}
            },
            "WTF_ParkingLot.HundredUnparkAllOneFast": {
                "expected": {"all": {"slow": true, "status": ["TIMEOUT", "PASS"], "bug": "webkit.org/b/259945" }}
            },
            "WTF_ParkingLot.UnparkAllHundred": {
                "expected": {"all": {"slow": true, "status": ["TIMEOUT", "PASS"], "bug": "webkit.org/b/259945" }}
            },
            "WTF_ParkingLot.UnparkAllHundredFast": {
                "expected": {"all": {"slow": true, "status": ["TIMEOUT", "PASS"], "bug": "webkit.org/b/259945" }}
            },
            "WTF_ParkingLot.UnparkAllOneFast": {
                "expected": {"all": {"slow": true, "status": ["TIMEOUT", "PASS"], "bug": "webkit.org/b/259945" }}
            },
            "WTF_ParkingLot.UnparkOneFiftyThenFiftyAllFast": {
                "expected": {"all": {"slow": true, "status": ["TIMEOUT", "PASS"], "bug": "webkit.org/b/259945" }}
            },
            "WTF_ParkingLot.UnparkOneHundredFast": {
                "expected": {"all": {"slow": true, "status": ["TIMEOUT", "PASS"], "bug": "webkit.org/b/259945" }}
            },
            "WTF_RunLoop.ManyTimes": {
                "expected": {"gtk": {"slow": true, "status": ["TIMEOUT", "PASS"], "bug": "webkit.org/b/246472" }}
            },
            "WTF_WordLock.ContendedShortSection": {
                "expected": {"gtk": {"slow": true, "status": ["TIMEOUT", "PASS"], "bug": "webkit.org/b/260209" }}
            },
            "WTF_WordLock.ContendedLongSection": {
                "expected": {"gtk": {"slow": true, "status": ["TIMEOUT", "PASS"], "bug": "webkit.org/b/260209" }}
            },
            "WTF_WordLock.ManyContendedShortSections": {
                "expected": {"gtk": {"slow": true, "status": ["TIMEOUT", "PASS"], "bug": "webkit.org/b/260209" }}
            },
            "WTF_WordLock.ManyContendedLongSections": {
                "expected": {"all": {"slow": true, "status": ["TIMEOUT", "PASS"], "bug": "webkit.org/b/246603"}}
            },
            "WTF.WorkerPoolDecrease": {
                "expected": {"gtk": {"status": ["TIMEOUT", "PASS"], "bug": "webkit.org/b/214803"}}
            },
            "WTF_WorkQueue.DestroyDispatchedOnDispatchQueue": {
                "expected": {"gtk": {"status": ["TIMEOUT", "PASS"], "bug": "webkit.org/b/260211" }}
            }
        }
    },
    "TestContextMenu": {
        "subtests": {
            "/webkit/WebKitWebView/context-menu-key": {
                "expected": {
                    "gtk": {"status": ["PASS"] , "slow": true }
                }
            },
            "/webkit/WebKitWebView/default-menu": {
                "expected": {
                    "gtk": {"status": ["PASS", "TIMEOUT", "FAIL"], "bug": "webkit.org/b/248213"}
                }
            },
            "/webkit/WebKitWebView/popup-event-signal": {
                "expected": {
                    "gtk": {"status": ["PASS", "TIMEOUT"], "bug": "webkit.org/b/248213"}
                }
            }
        }
    },
    "TestJSC": {
        "subtests": {
            "/jsc/vm": {
                "expected": {"all": {"slow": true}}
            }
        }
    },
    "TestWebKitPolicyClient": {
        "subtests": {
            "/webkit/WebKitPolicyClient/autoplay-policy": {
                "expected": {"gtk": {"status": ["TIMEOUT", "PASS"], "bug": "webkit.org/b/222091"}}
            }
        }
    },
    "TestDownloads": {
        "subtests": {
            "/webkit/Downloads/remote-file-error": {
                "expected": {"gtk": {"status": ["TIMEOUT", "PASS"], "bug": "webkit.org/b/254002"}}
            }
        }
    },
    "TestMultiprocess": {
        "subtests": {
            "/webkit/WebKitWebContext/process-per-web-view": {
                "expected": {"gtk": {"status": ["TIMEOUT", "PASS"], "bug": "webkit.org/b/254002"}}
            }
        }

    }
}
