layer at (0,0) size 800x600
  RenderView at (0,0) size 800x600
layer at (0,0) size 225x425
  RenderSVGRoot {svg} at (0,0) size 225x425
layer at (0,0) size 225x425
  RenderSVGViewportContainer at (0,0) size 225x425
layer at (0,0) size 200x90
  RenderSVGHiddenContainer {defs} at (0,0) size 200x90
layer at (-10,-15) size 20x22 backgroundClip at (0,0) size 225x425 clip at (0,0) size 225x425
  RenderSVGHiddenContainer {symbol} at (-10,-15) size 20x22
layer at (0,-15) size 0x30
  RenderSVGPath {path} at (10,0) size 0x30 [stroke={[type=SOLID] [color=#008000] [stroke width=2.00]}] [data="M 0 -15 L 0 15"]
layer at (0,0) size 10x7
  RenderSVGPath {path} at (10,15) size 10x7 [stroke={[type=SOLID] [color=#008000] [stroke width=2.00]}] [data="M 0 0 C 0 4.66667 3.33333 7 10 7"]
layer at (-10,0) size 10x7 backgroundClip at (0,0) size 225x425 clip at (0,0) size 225x425
  RenderSVGPath {path} at (0,15) size 10x7 [stroke={[type=SOLID] [color=#008000] [stroke width=2.00]}] [data="M 0 0 C 0 4.66667 -3.33333 7 -10 7"]
layer at (-10.42,-15.88) size 22x23 backgroundClip at (0,0) size 225x425 clip at (0,0) size 225x425
  RenderSVGHiddenContainer {symbol} at (-10.42,-15.88) size 20.84x22.81
layer at (0,5) size 0x11
  RenderSVGPath {path} at (10.42,20.88) size 0x10 [stroke={[type=SOLID] [color=#008000] [stroke width=2.00]}] [data="M 0 15 L 0 5"]
layer at (-10.42,-15.88) size 21x23 backgroundClip at (0,0) size 225x425 clip at (0,0) size 225x425
  RenderSVGPath {path} at (0,0) size 20.84x22.81 [stroke={[type=SOLID] [color=#008000] [stroke width=2.00]}] [data="M 0 5 C -1.93923 7.10121 -5.09176 7.54205 -7.53298 6.0534 C -9.97421 4.56474 -11.0258 1.56025 -10.0457 -1.12585 C -9.06566 -3.81196 -6.3263 -5.43327 -3.5 -5 C -5.61622 -6.51983 -6.50972 -9.23171 -5.71141 -11.7118 C -4.91309 -14.1919 -2.60543 -15.8734 7.15493e-8 -15.8734 C 2.60543 -15.8734 4.91309 -14.1919 5.71141 -11.7118 C 6.50972 -9.23171 5.61622 -6.51983 3.5 -5 C 6.3263 -5.43327 9.06566 -3.81196 10.0457 -1.12585 C 11.0258 1.56025 9.97421 4.56475 7.53298 6.0534 C 5.09176 7.54205 1.93923 7.10121 7.15256e-7 5 Z"]
layer at (0,0) size 200x90
  RenderSVGPath {path} at (0,0) size 200x90 [stroke={[type=SOLID] [color=#B42D25] [stroke width=2.00]}] [fill={[type=SOLID] [color=#000000]}] [data="M 0 50 L 100 0 L 200 20 L 150 70 L 50 90 Z"]
layer at (0,-4) size 200x94 backgroundClip at (0,0) size 225x425 clip at (0,0) size 225x425
  RenderSVGTransformableContainer {g} at (0,-4) size 200x94
layer at (0,-4) size 68x18 backgroundClip at (0,0) size 225x425 clip at (0,0) size 225x425
  RenderSVGText {text} at (0,0) size 68x18 contains 1 chunk(s)
    RenderSVGInlineText {#text} at (0,0) size 68x18
      chunk 1 text run 1 at (0.00,10.00) startOffset 0 endOffset 10 width 67.53: "coniferous"
layer at (0,0) size 200x90
  RenderSVGTransformableContainer {use} at (0,4) size 200x90
layer at (0,0) size 200x90
  RenderSVGPath {path} at (0,0) size 200x90 [stroke={[type=SOLID] [color=#B42D25] [stroke width=2.00]}] [fill={[type=SOLID] [color=#000000]}] [data="M 0 50 L 100 0 L 200 20 L 150 70 L 50 90 Z"]
layer at (0,-4) size 200x94 backgroundClip at (0,0) size 225x425 clip at (0,0) size 225x425
  RenderSVGTransformableContainer {g} at (0,-4) size 200x94
layer at (0,-4) size 76x18 backgroundClip at (0,0) size 225x425 clip at (0,0) size 225x425
  RenderSVGText {text} at (0,0) size 76x18 contains 1 chunk(s)
    RenderSVGInlineText {#text} at (0,0) size 76x18
      chunk 1 text run 1 at (0.00,10.00) startOffset 0 endOffset 10 width 75.51: "broadLeave"
layer at (0,0) size 200x90
  RenderSVGTransformableContainer {use} at (0,4) size 200x90
layer at (0,0) size 200x90
  RenderSVGPath {path} at (0,0) size 200x90 [stroke={[type=SOLID] [color=#B42D25] [stroke width=2.00]}] [fill={[type=SOLID] [color=#000000]}] [data="M 0 50 L 100 0 L 200 20 L 150 70 L 50 90 Z"]
