timestamp_ms,accel_x,accel_y,accel_z
0004161,000000,000000,000000
0004169,000268,000104,017620
0004176,000348,000072,017620
0004183,000280,000072,017640
0004212,000288,000096,017492
0004216,000300,000120,017540
0004223,000316,000052,017584
0004231,000320,000048,017512
0004238,000268,000004,017500
0004246,000136,000076,017640
0004253,000352,000064,017552
0004261,000216,000092,017612
0004268,000304,000044,017628
0004276,000348,000168,017564
0004283,000276,000044,017548
0004291,000356,000116,017560
0004298,000228,-00040,017636
0004306,000284,000060,017464
0004313,000376,000072,017544
0004323,000244,000056,017600
0004333,000184,000080,017604
0004354,000236,000164,017660
0004358,000296,000080,017596
0004366,000160,000112,017612
0004373,000320,000092,017700
0004383,000280,000180,017648
0004393,000252,000164,017548
0004403,000336,000132,017656
0004413,000256,000144,017600
0004423,000248,000116,017536
0004433,000376,000136,017708
0004443,000228,000116,017620
0004453,000272,000084,017792
0004463,000248,000056,017520
0004473,000240,000088,017632
0004483,000280,000048,017616
0004493,000144,000068,017592
0004503,000292,000064,017592
0004513,000248,000184,017600
0004528,000248,000016,017660
0004533,000344,000080,017636
0004543,000308,000080,017572
0004553,000288,000092,017672
0004563,000272,000120,017644
0004573,000304,000028,017640
0004583,000200,000040,017552
0004593,000168,000092,017580
0004603,000172,000032,017548
0004613,000348,000036,017652
0004623,000260,000152,017776
0004633,000348,000100,017488
0004643,000328,000068,017608
0004653,000336,000108,017624
0004663,000224,000100,017576
0004673,000276,000052,017640
0004683,000160,000128,017600
0004693,000224,000004,017640
0004712,000264,000172,017528
0004716,000200,000076,017540
0004723,000264,000096,017676
0004733,000280,000020,017500
0004743,000320,000052,017696
0004753,000220,000148,017716
0004763,000284,000064,017620
0004773,000252,000104,017752
0004783,000180,000124,017404
0004793,000204,000092,017548
0004803,000172,-00012,017636
0004813,000216,000152,017724
0004823,000356,000120,017720
0004833,000336,000032,017716
0004843,000276,000080,017700
0004853,000324,000064,017580
0004863,000296,000108,017540
0004878,000204,000104,017684
0004883,000304,-00004,017592
0004893,000340,000076,017676
0004903,000292,000076,017684
0004913,000192,000048,017608
0004923,000164,000060,017712
0004933,000240,000072,017612
0004943,000272,000036,017604
0004953,000244,000124,017524
0004963,000256,000084,017640
0004973,000332,000060,017508
0004983,000296,000184,017740
0004993,000296,000052,017480
0005003,000200,000152,017680
0005013,000276,000028,017632
0005023,000380,000072,017692
0005033,000216,000224,017620
0005043,000280,000124,017672
0005062,000156,000136,017620
0005065,000224,-00008,017672
0005073,000340,000088,017508
0005083,000192,000120,017584
0005093,000320,000096,017680
0005103,000216,000048,017668
0005113,000280,000088,017484
0005123,000272,000040,017536
0005133,000236,000024,017568
0005143,000292,000100,017608
0005153,000380,000048,017544
0005163,000364,000176,017524
0005173,000260,000012,017552
0005183,000200,-00008,017568
0005193,000224,000004,017512
0005203,000296,000008,017584
0005213,000388,000056,017480
0005223,000372,000020,017656
0005238,000164,000116,017532
0005243,000204,000080,017604
0005253,000284,000040,017612
0005263,000212,-00024,017568
0005273,000332,000100,017660
0005283,000348,000128,017704
0005293,000136,000004,017468
0005303,000224,000144,017540
0005313,000188,000024,017520
0005323,000172,000116,017528
0005333,000332,000160,017516
0005343,000316,000156,017524
0005353,000280,000116,017540
0005363,000216,000128,017640
0005373,000268,000176,017716
0005383,000248,000060,017568
0005393,000352,000092,017608
0005412,000292,000116,017664
0005415,000200,000028,017684
0005423,000320,000068,017544
0005433,000260,000120,017664
0005443,000288,000084,017676
0005453,000212,000044,017632
0005463,000324,000028,017620
0005473,000232,000008,017560
0005483,000316,000112,017472
0005493,000268,000104,017624
0005503,000284,000132,017596
0005513,000200,000156,017512
0005523,000260,000168,017572
0005533,000264,000156,017676
0005543,000348,000128,017608
0005553,000280,000084,017612
0005563,000252,000128,017480
0005573,000228,000016,017708
0005591,000248,000148,017600
0005595,000300,000188,017632
0005603,000268,000072,017592
0005613,000268,000036,017696
0005623,000284,000152,017596
0005633,000272,000120,017684
0005643,000228,000092,017484
0005653,000264,000052,017656
0005663,000240,000100,017540
0005673,000256,000052,017548
0005683,000324,000092,017564
0005693,000252,000036,017692
0005703,000124,000064,017620
0005713,000232,000172,017576
0005723,000232,000116,017664
0005733,000324,000152,017684
0005743,000420,000084,017688
0005753,000368,000044,017484
0005772,000236,000104,017760
0005776,000252,000000,017660
0005783,000276,000064,017700
0005793,000320,-00008,017652
0005803,000244,000132,017656
0005813,000316,000048,017636
0005823,000180,000124,017684
0005833,000288,-00020,017552
0005843,000372,000004,017664
0005853,000308,000072,017552
0005863,000216,000020,017600
0005873,000148,000016,017520
0005883,000268,000100,017540
0005893,000316,000048,017632
0005903,000348,000156,017556
0005913,000260,000108,017564
0005923,000268,000040,017560
0005938,000252,000124,017644
0005943,000268,000048,017680
0005953,000108,000100,017612
0005963,000144,000120,017632
0005973,000220,000196,017488
0005983,000332,000228,017576
0005993,000260,000140,017672
0006003,000388,000008,017636
0006013,000340,000000,017684
0006023,000232,000008,017668
0006033,000296,000072,017580
0006043,000236,000128,017744
0006053,000072,000132,017472
0006063,000184,000148,017644
0006073,000276,000140,017532
0006083,000260,000048,017708
0006093,000416,000052,017556
0006103,000408,000120,017684
0006122,000308,000172,017660
0006126,000248,000084,017652
0006133,000236,000188,017724
0006143,000172,000100,017448
0006153,000088,000140,017548
0006163,000256,000188,017604
0006173,000232,000112,017640
0006183,000304,000064,017580
0006193,000416,000140,017460
0006203,000308,000120,017524
0006213,000460,000168,017488
0006223,000260,000104,017716
0006233,000208,000000,017688
0006243,000120,000152,017532
0006253,000112,000140,017656
0006263,000172,-00024,017556
0006273,000244,000088,017616
0006288,000344,000136,017520
0006293,000404,000112,017532
0006303,000420,000160,017564
0006313,000300,000084,017584
0006323,000248,000124,017472
0006333,000248,-00024,017496
0006343,000216,000052,017512
0006353,000220,000124,017632
0006363,000264,000108,017532
0006373,000308,000044,017632
0006383,000368,000104,017616
0006393,000300,000112,017512
0006403,000288,000084,017612
0006413,000280,000044,017612
0006423,000312,000064,017620
0006433,000252,000004,017700
0006443,000340,000108,017532
0006453,000296,000104,017672
0006472,000292,000124,017648
0006476,000348,000152,017580
0006483,000340,000004,017452
0006493,000288,000060,017588
0006503,000248,000200,017448
0006513,000228,000104,017572
0006523,000184,000032,017632
0006533,000128,000052,017660
0006543,000244,000072,017476
0006553,000216,000036,017392
0006563,000304,000056,017632
0006573,000304,000196,017492
0006583,000344,-00036,017784
0006593,000200,000032,017536
0006603,000308,000096,017468
0006613,000232,000064,017644
0006623,000264,000100,017612
0006633,000308,000160,017496
0006648,000296,000020,017652
0006653,000308,000072,017604
0006663,000208,000032,017636
0006673,000388,000104,017576
0006683,000252,000104,017648
0006693,000236,000128,017632
0006703,000208,000040,017696
0006713,000304,000060,017592
0006723,000096,000036,017528
0006733,000336,000016,017460
0006743,000248,000036,017760
0006753,000292,000140,017692
0006763,000400,000080,017572
0006773,000336,000056,017656
0006783,000168,-00036,017648
0006793,000284,-00012,017704
0006803,000192,000112,017492
0006822,000204,000056,017592
0006826,000268,000172,017680
0006833,000292,000016,017696
0006843,000308,000064,017616
0006853,000328,000144,017544
0006863,000288,000064,017648
0006873,000236,000068,017652
0006883,000352,000052,017696
0006893,000256,000100,017464
0006903,000256,000108,017612
0006913,000248,000132,017476
0006923,000324,000092,017620
0006933,000300,000072,017612
0006943,000248,000040,017452
0006953,000228,000164,017644
0006963,000228,000140,017532
0006973,000316,000168,017596
0006983,000236,000168,017632
0006998,000380,000012,017684
0007003,000236,-00024,017548
0007013,000264,000052,017540
0007023,000308,000096,017612
0007033,000300,000036,017656
0007043,000176,000112,017524
0007053,000268,000120,017500
0007063,000268,000056,017556
0007073,000260,000064,017516
0007083,000320,000108,017636
0007093,000356,000116,017800
0007103,000288,000104,017668
0007113,000180,000112,017428
0007123,000240,000084,017476
0007133,000344,000116,017712
0007143,000336,000092,017552
0007153,000272,000108,017568
0007163,000244,000064,017580
0007182,000300,000092,017620
0007186,000260,000068,017608
0007194,000200,000028,017556
0007203,000156,000084,017548
0007213,000360,000112,017652
0007223,000264,000084,017812
0007233,000304,000092,017628
0007243,000312,000148,017528
0007253,000324,000060,017624
0007263,000140,000048,017508
0007273,000260,000068,017592
0007283,000240,000088,017632
0007293,000236,000088,017556
0007303,000352,000112,017796
0007313,000268,000076,017548
0007323,000252,000104,017620
0007333,000272,-00012,017492
0007348,000256,000072,017616
0007353,000200,000076,017588
0007363,000252,-00012,017784
0007373,000264,000120,017596
0007383,000216,000140,017636
0007393,000288,000136,017528
0007403,000204,000048,017640
0007413,000360,000092,017548
0007423,000324,000044,017540
0007433,000388,000060,017600
0007443,000288,000080,017596
0007453,000212,000040,017532
0007463,000156,000112,017592
0007473,000332,000104,017668
0007483,000172,000060,017596
0007493,000192,000048,017684
0007503,000252,000084,017588
0007513,000400,000104,017632
0007532,000192,000064,017564
0007536,000300,000116,017752
0007543,000228,000136,017592
0007553,000248,000028,017660
0007563,000280,000016,017520
0007573,000248,000020,017600
0007583,000280,000072,017576
0007593,000288,000108,017456
0007603,000284,000188,017540
0007613,000272,000076,017580
0007623,000252,000204,017464
0007633,000320,000040,017600
0007643,000100,000060,017540
0007653,000268,-00004,017500
0007663,000256,000028,017584
0007673,000336,000116,017536
0007683,000300,000112,017552
0007693,000344,000128,017700
0007708,000284,000076,017660
0007713,000228,000048,017608
0007723,000192,000088,017580
0007733,000236,000096,017592
0007743,000308,000072,017616
0007753,000288,000044,017640
0007763,000224,000112,017496
0007773,000300,000048,017460
0007783,000212,000084,017568
0007793,000252,000084,017612
0007803,000316,000008,017524
0007813,000180,000088,017600
0007823,000316,000052,017552
0007833,000228,000128,017612
0007843,000308,000008,017668
0007853,000212,000036,017652
0007863,000396,000096,017660
0007882,000176,000140,017576
0007885,000272,000092,017472
0007893,000288,000068,017600
0007903,000156,000096,017592
0007913,000288,000084,017720
0007923,000308,000048,017632
0007933,000268,000072,017548
0007943,000308,000072,017536
0007953,000320,000064,017680
0007963,000256,000056,017672
0007973,000320,000084,017712
0007983,000276,000140,017596
0007993,000272,000112,017736
0008003,000280,000084,017704
0008013,000152,000044,017588
0008023,000272,000060,017664
0008033,000288,000060,017588
0008043,000220,000016,017496
0008058,000324,000240,017588
0008063,000164,000052,017456
0008073,000292,000036,017592
0008083,000260,000060,017620
0008093,000356,000172,017500
0008103,000284,000044,017608
0008113,000196,-00024,017680
0008123,000268,000104,017620
0008133,000336,000068,017488
0008143,000280,000004,017576
0008153,000264,000056,017620
0008163,000288,000136,017596
0008173,000216,-00012,017652
0008183,000192,000072,017540
0008193,000276,000124,017576
0008203,000284,000104,017708
0008213,000340,000080,017660
0008223,000380,-00008,017564
0008242,000204,000112,017564
0008246,000204,000152,017632
0008253,000300,000144,017644
0008263,000300,000004,017572
0008273,000336,000068,017596
0008283,000232,000060,017640
0008293,000260,000164,017700
0008303,000292,000064,017596
0008313,000252,000020,017692
0008323,000220,000148,017656
0008333,000304,000036,017712
0008343,000248,000032,017548
0008353,000336,000040,017528
0008363,000192,000004,017696
0008373,000360,000088,017584
0008383,000236,000120,017664
0008393,000212,-00020,017528
0008408,000376,000116,017672
0008413,000352,000064,017576
0008423,000304,000052,017600
0008433,000340,000148,017716
0008443,000272,000136,017472
0008453,000248,000156,017652
0008463,000228,000052,017580
0008473,000336,000048,017592
0008483,000368,-00024,017592
0008493,000292,000044,017640
0008503,000272,000088,017692
0008513,000264,000200,017496
0008523,000272,000084,017496
0008533,000272,-00016,017552
0008543,000260,000148,017624
0008553,000196,000088,017600
0008563,000204,000132,017620
0008573,000248,000052,017664
0008592,000340,000132,017656
0008596,000292,000072,017492
0008603,000288,000124,017644
0008613,000224,000236,017624
0008623,000208,000176,017648
0008633,000264,000052,017640
0008643,000280,000068,017656
0008653,000288,000068,017540
0008663,000260,000008,017572
0008673,000324,-00032,017516
0008683,000216,000056,017616
0008693,000312,000112,017568
0008703,000384,000076,017436
0008713,000244,000104,017600
0008723,000280,000100,017680
0008733,000280,000008,017580
0008743,000388,000132,017636
0008753,000296,-00008,017480
0008768,000276,000124,017532
0008773,000308,000164,017632
0008783,000232,000100,017600
0008793,000208,000080,017656
0008803,000300,000100,017560
0008813,000292,000060,017584
0008823,000308,000068,017572
0008833,000332,000124,017596
0008843,000320,000008,017628
0008853,000144,000076,017600
0008863,000260,000096,017604
0008873,000252,000084,017692
0008883,000212,000044,017528
0008893,000308,000056,017584
0008903,000288,000040,017616
0008913,000336,000116,017512
0008923,000364,-00032,017512
0008942,000280,000128,017732
0008946,000236,000056,017676
0008953,000272,000072,017664
0008963,000236,000076,017436
0008973,000216,-00028,017680
0008983,000332,000048,017708
0008993,000192,000120,017488
0009003,000384,000144,017528
0009013,000284,000104,017644
0009023,000292,000100,017660
0009033,000180,-00008,017640
0009043,000268,000028,017716
0009053,000248,000128,017676
0009063,000256,000048,017592
0009073,000212,000096,017744
0009083,000396,-00044,017576
0009093,000216,000100,017624
0009103,000156,000076,017588
0009118,000268,000096,017612
0009123,000168,000064,017652
