timestamp_ms,accel_x,accel_y,accel_z
0005230,000000,000000,000000
0005233,000244,000132,017640
0005241,000248,000172,017744
0005249,000204,-00012,017400
0005281,000312,000100,017636
0005285,000328,000156,017652
0005293,000272,000152,017640
0005300,000200,000160,017540
0005308,000244,000092,017620
0005315,000324,000040,017612
0005323,000328,000072,017692
0005330,000236,000112,017516
0005338,000332,000028,017600
0005345,000216,000148,017616
0005353,000396,000124,017560
0005360,000368,000068,017692
0005368,000272,000092,017668
0005375,000260,000076,017592
0005383,000260,000164,017752
0005392,000264,000072,017644
0005402,000212,000096,017532
0005419,000204,000080,017700
0005423,000196,-00008,017620
0005432,000296,000084,017608
0005442,000328,000032,017592
0005452,000248,000160,017536
0005462,000384,000088,017564
0005472,000348,000176,017580
0005482,000388,000024,017560
0005492,000296,000152,017484
0005502,000228,000244,017528
0005512,000248,000128,017652
0005522,000264,000120,017580
0005532,000308,000088,017748
0005542,000312,000112,017700
0005552,000184,000076,017592
0005562,000300,000052,017516
0005572,000220,000116,017572
0005582,000260,000132,017480
0005601,000260,000044,017528
0005605,000364,000128,017776
0005612,000216,000112,017528
0005622,000108,000072,017572
0005632,000216,000076,017680
0005642,000200,000148,017600
0005652,000300,000080,017576
0005662,000320,000108,017520
0005672,000192,000168,017716
0005682,000268,000044,017508
0005692,000268,-00016,017696
0005702,000224,000140,017556
0005712,000236,000128,017524
0005722,000160,000176,017500
0005732,000296,000084,017724
0005742,000280,000060,017604
0005752,000276,000076,017632
0005762,000240,000048,017676
0005777,000300,000028,017572
0005782,000324,000028,017632
0005792,000252,000112,017632
0005802,000304,000100,017560
0005812,000224,000152,017684
0005822,000304,000132,017548
0005832,000280,000184,017592
0005842,000304,000152,017584
0005852,000192,000084,017492
0005862,000220,000012,017496
0005872,000408,000016,017536
0005882,000280,000084,017632
0005892,000256,000160,017692
0005902,000312,000132,017720
0005912,000344,000096,017588
0005922,000256,000092,017632
0005932,000232,000116,017556
0005951,000292,000132,017528
0005955,000236,000052,017672
0005962,000172,000092,017824
0005972,000332,000128,017580
0005982,000292,000084,017664
0005992,000244,000092,017588
0006002,000228,000000,017608
0006012,000256,000028,017508
0006022,000272,000092,017528
0006032,000292,000044,017600
0006042,000280,000096,017584
0006052,000308,000084,017592
0006062,000284,000136,017632
0006072,000176,000004,017604
0006082,000312,000116,017624
0006092,000320,000164,017540
0006102,000264,000100,017644
0006112,000384,000152,017724
0006127,000192,000044,017660
0006132,000248,000148,017636
0006142,000236,000072,017528
0006152,000216,000004,017548
0006162,000276,000060,017624
0006172,000224,000140,017600
0006182,000304,000144,017608
0006192,000236,000140,017640
0006202,000356,000120,017680
0006212,000352,000152,017660
0006222,000304,000124,017592
0006232,000248,000036,017656
0006242,000280,000048,017716
0006252,000212,000100,017644
0006262,000320,000064,017488
0006272,000236,000148,017544
0006282,000312,000088,017628
0006292,000264,000088,017624
0006311,000228,000028,017580
0006315,000336,000092,017624
0006322,000300,000132,017632
0006332,000332,000040,017608
0006342,000264,000120,017544
0006352,000304,000128,017636
0006362,000304,000172,017608
0006372,000200,000092,017600
0006382,000284,000092,017508
0006392,000276,000132,017728
0006402,000292,000100,017748
0006412,000304,000152,017572
0006422,000264,000068,017712
0006432,000288,000036,017656
0006442,000212,000156,017612
0006452,000264,000040,017696
0006462,000256,000180,017700
0006477,000232,000132,017624
0006482,000200,000120,017640
0006492,000292,000232,017528
0006502,000248,000088,017532
0006512,000256,000092,017552
0006522,000252,000076,017500
0006532,000228,000116,017684
0006542,000240,000076,017708
0006552,000316,000012,017620
0006562,000264,000068,017588
0006572,000256,000052,017732
0006582,000244,-00012,017756
0006592,000252,000108,017676
0006602,000320,000044,017536
0006612,000160,000124,017632
0006622,000260,000120,017560
0006632,000200,000048,017532
0006642,000260,000124,017600
0006661,000300,000164,017664
0006665,000320,000192,017552
0006672,000168,000084,017584
0006682,000396,000192,017676
0006692,000356,-00024,017600
0006702,000276,000056,017676
0006712,000176,000012,017520
0006722,000212,000060,017476
0006732,000304,000092,017616
0006742,000256,000156,017616
0006752,000276,000080,017572
0006762,000356,000096,017540
0006772,000244,000072,017616
0006782,000136,000228,017800
0006792,000268,000044,017564
0006802,000384,000072,017664
0006812,000232,000084,017496
0006822,000260,000152,017572
0006837,000352,000092,017600
0006842,000252,000092,017664
0006852,000260,000044,017740
0006862,000284,000172,017592
0006872,000232,000184,017672
0006882,000248,000132,017656
0006892,000256,000012,017600
0006902,000312,000044,017572
0006912,000248,000096,017652
0006922,000312,000112,017700
0006932,000292,000152,017504
0006942,000284,000104,017692
0006952,000256,000092,017624
0006962,000256,000060,017620
0006972,000200,000128,017572
0006982,000228,000108,017668
0006992,000340,000104,017540
0007011,000304,000068,017664
0007015,000380,000152,017724
0007022,000328,000068,017536
0007032,000332,000040,017704
0007042,000272,000048,017508
0007052,000256,000044,017612
0007062,000284,000032,017580
0007072,000240,000060,017624
0007082,000312,000116,017620
0007092,000188,000188,017624
0007102,000180,000056,017700
0007112,000328,000008,017816
0007122,000356,000132,017532
0007132,000300,000088,017640
0007142,000356,000072,017420
0007152,000364,000116,017656
0007162,000324,000048,017476
0007172,000132,000164,017488
0007187,000312,000076,017612
0007192,000184,000048,017508
0007202,000256,000072,017580
0007212,000248,000028,017548
0007222,000192,000104,017656
0007232,000308,000088,017552
0007242,000312,000132,017732
0007252,000272,000160,017616
0007262,000328,000120,017472
0007272,000296,000144,017756
0007282,000304,000072,017548
0007292,000244,000064,017440
0007302,000204,000092,017624
0007312,000236,000148,017476
0007322,000312,000088,017500
0007332,000396,000172,017592
0007342,000292,000000,017548
0007361,000232,000124,017612
0007365,000264,000104,017540
0007372,000340,000076,017628
0007382,000216,000108,017600
0007392,000248,000144,017500
0007402,000276,000064,017560
0007412,000168,000052,017548
0007422,000252,000064,017592
0007432,000260,000052,017528
0007442,000256,000064,017680
0007452,000216,000112,017780
0007462,000340,000112,017532
0007472,000204,000060,017448
0007482,000352,-00024,017760
0007492,000324,000116,017568
0007502,000324,000076,017528
0007512,000360,000136,017636
0007522,000240,000060,017492
0007537,000176,000100,017580
0007542,000148,000104,017676
0007552,000172,000072,017508
0007562,000216,000028,017600
0007572,000260,000064,017652
0007582,000268,000024,017700
0007592,000228,000016,017508
0007602,000344,000076,017612
0007612,000312,000108,017508
0007622,000444,000148,017724
0007632,000252,000156,017700
0007642,000208,000232,017468
0007652,000136,000068,017664
0007662,000152,000036,017584
0007672,000180,000044,017556
0007682,000252,000132,017580
0007692,000364,000164,017580
0007702,000376,000132,017688
0007721,000316,000144,017664
0007725,000264,000048,017560
0007732,000256,000032,017716
0007742,000228,000132,017624
0007752,000228,000116,017484
0007762,000236,000152,017620
0007772,000160,000020,017540
0007782,000192,000124,017488
0007792,000264,000156,017652
0007802,000320,000220,017664
0007812,000440,000120,017628
0007822,000412,000112,017496
0007832,000396,-00052,017660
0007842,000172,-00012,017412
0007852,000120,000096,017656
0007862,000084,000192,017656
0007872,000256,000200,017664
0007887,000336,000088,017644
0007892,000216,000028,017684
0007902,000248,000240,017572
0007912,000372,-00040,017508
0007922,000416,000024,017592
0007932,000308,000000,017636
0007942,000272,-00024,017564
0007952,000280,000076,017564
0007962,000140,000144,017628
0007972,000168,000128,017744
0007982,000076,000108,017520
0007992,000312,000116,017584
0008002,000312,000036,017664
0008012,000448,000008,017552
0008022,000296,000132,017556
0008032,000312,000108,017596
0008042,000308,000036,017644
0008052,000292,000044,017556
0008071,000200,000036,017636
0008075,000216,000060,017580
0008082,000220,000088,017584
0008092,000272,000008,017580
0008102,000236,000128,017772
0008112,000320,000136,017764
0008122,000256,000144,017604
0008132,000264,000076,017736
0008142,000208,000116,017500
0008152,000192,000100,017572
0008162,000224,000092,017540
0008172,000276,000164,017596
0008182,000416,000036,017668
0008192,000324,000112,017568
0008202,000272,000028,017456
0008212,000348,-00068,017580
0008222,000156,000144,017600
0008232,000308,000096,017628
0008247,000284,000048,017680
0008252,000324,000016,017704
0008263,000292,000064,017456
0008272,000260,000068,017516
0008282,000240,000116,017568
0008292,000216,000020,017632
0008302,000216,000144,017612
0008312,000172,000020,017612
0008322,000184,000116,017644
0008332,000308,000096,017536
0008342,000268,000088,017644
0008352,000268,000088,017700
0008362,000232,000112,017548
0008372,000284,000056,017568
0008382,000224,000224,017636
0008392,000228,000164,017804
0008402,000372,000140,017540
0008421,000224,000128,017592
0008424,000188,000084,017676
0008432,000252,000084,017576
0008442,000260,000016,017788
0008452,000348,000132,017652
0008462,000232,-00076,017612
0008472,000244,000120,017636
0008482,000304,000056,017600
0008492,000312,000084,017596
0008502,000200,000076,017684
0008512,000212,000084,017500
0008522,000236,000044,017524
0008532,000208,000104,017560
0008542,000268,000076,017660
0008552,000256,000120,017648
0008562,000256,000096,017656
0008572,000160,000100,017696
0008582,000324,000080,017476
0008597,000196,000140,017704
0008602,000192,000140,017604
0008612,000156,000080,017580
0008622,000336,000136,017504
0008632,000240,000044,017652
0008642,000208,000092,017732
0008652,000440,000164,017616
0008662,000316,000064,017576
0008672,000332,000068,017524
0008682,000260,000040,017592
0008692,000192,000108,017600
0008702,000256,000088,017600
0008712,000192,000124,017552
0008722,000244,000004,017568
0008732,000324,000056,017564
0008742,000316,000064,017576
0008752,000200,000044,017656
0008762,000240,000088,017528
0008781,000152,000104,017676
0008785,000252,000108,017600
0008792,000268,000176,017520
0008802,000244,000024,017656
0008812,000244,000080,017576
0008822,000252,000092,017696
0008832,000224,000144,017576
0008842,000232,000116,017612
0008852,000184,000152,017488
0008862,000276,000040,017588
0008872,000284,000136,017716
0008882,000220,000156,017628
0008892,000328,000208,017596
0008902,000160,000080,017460
0008912,000152,-00048,017520
0008922,000268,-00136,017524
0008932,000244,000028,017620
0008947,000300,000260,017700
0008952,000268,000200,017584
0008962,000340,000216,017652
0008972,000288,000148,017632
0008982,000216,-00052,017656
0008992,000204,-00036,017560
0009002,000308,000020,017520
0009012,000312,000092,017532
0009022,000248,000120,017688
0009032,000220,000172,017740
0009042,000292,000252,017680
0009052,000324,000156,017600
0009062,000376,000160,017632
0009072,000344,000080,017444
0009082,000368,000012,017612
0009092,000272,-00020,017568
0009102,000316,000140,017560
0009112,000268,000144,017644
0009131,000300,000044,017668
0009135,000384,000188,017624
0009142,000364,000108,017588
0009152,000356,-00012,017560
0009162,000288,000108,017572
0009172,000296,000092,017668
0009182,000332,000076,017536
0009192,000256,000120,017740
0009202,000284,000056,017712
0009212,000184,000172,017708
0009222,000040,-00016,017668
0009232,000160,000040,017636
0009242,000324,000008,017488
0009252,000268,000052,017584
0009262,000368,000224,017536
0009272,000316,000144,017656
0009282,000264,000144,017632
0009292,000140,000068,017756
0009307,000276,-00032,017600
0009312,000244,000056,017588
0009322,000228,000152,017656
0009332,000248,000120,017664
0009342,000324,000072,017496
0009352,000212,000136,017596
0009362,000428,000184,017676
0009372,000336,000068,017592
0009382,000332,000144,017520
0009392,000296,000216,017624
0009402,000200,000100,017644
0009412,000132,000144,017640
0009422,000204,000136,017700
0009432,000272,000116,017672
0009442,000224,000140,017656
0009452,000348,000116,017644
0009462,000368,000072,017588
0009481,000284,000124,017696
0009485,000264,000168,017628
0009493,000328,000080,017596
0009502,000216,000200,017672
0009512,000136,000176,017532
0009522,000248,000100,017608
0009532,000300,000036,017588
0009542,000336,000080,017584
0009552,000344,000044,017720
0009562,000376,000152,017620
0009572,000252,000164,017632
0009582,000192,000096,017616
0009592,000248,000148,017584
0009602,000268,000048,017600
0009612,000188,000116,017628
0009622,000332,000072,017488
0009632,000280,000160,017620
0009642,000180,000116,017640
0009657,000172,000080,017656
0009662,000228,000012,017704
0009672,000304,000028,017672
0009682,000280,000084,017448
0009692,000248,000048,017488
0009702,000240,000028,017568
0009712,000344,000140,017660
0009722,000344,000136,017644
0009732,000304,000144,017576
0009742,000256,000120,017624
0009752,000296,000100,017644
0009762,000204,000108,017552
0009772,000372,000076,017600
0009782,000172,000064,017580
0009792,000196,000120,017520
0009802,000316,000064,017644
0009812,000236,000104,017684
0009822,000328,000156,017576
0009840,000312,000028,017536
0009844,000228,000120,017564
0009852,000192,000096,017460
0009862,000268,000112,017672
0009872,000204,000156,017708
0009882,000252,000136,017660
0009892,000232,000088,017440
0009902,000276,000020,017472
0009912,000204,000112,017628
0009922,000236,-00044,017652
0009932,000356,000028,017640
0009942,000220,000128,017620
0009952,000320,000080,017500
0009962,000180,000152,017636
0009972,000268,000060,017596
0009982,000152,000140,017572
0009992,000236,000116,017368
0010094,000272,000020,017616
0010098,000156,000116,017524
0010106,000332,000056,017692
0010114,000304,000132,017684
0010121,000260,-00012,017468
0010129,000276,000012,017624
0010137,000208,000172,017580
0010144,000332,000124,017576
0010152,000292,000076,017556
0010160,000216,000072,017508
0010167,000348,000132,017556
0010175,000252,000088,017616
0010183,000260,000136,017672
0010190,000232,000120,017620
0010198,000280,000056,017748
0010206,000276,-00012,017676
0010213,000300,000036,017676
0010221,000292,000120,017500
0010322,000356,000064,017652
0010326,000340,000112,017572
