timestamp_ms,accel_x,accel_y,accel_z
0022729,000000,000000,000000
0022733,000244,000204,017624
0022740,000188,-00012,017528
0022748,000316,000052,017512
0022777,000284,000112,017704
0022781,000300,000088,017620
0022789,000304,000116,017496
0022797,000328,000140,017772
0022804,000304,000084,017652
0022812,000268,000080,017612
0022819,000172,000048,017552
0022827,000248,000136,017620
0022835,000224,000068,017520
0022843,000128,000112,017540
0022850,000272,000096,017700
0022858,000272,000228,017840
0022866,000228,000092,017568
0022873,000380,000020,017640
0022881,000332,000092,017548
0022891,000140,000012,017596
0022901,000220,000000,017548
0022922,000380,000168,017636
0022926,000252,000108,017520
0022934,000244,000160,017656
0022942,000260,000104,017704
0022951,000300,000152,017576
0022961,000280,000060,017652
0022971,000300,000068,017588
0022981,000236,000092,017644
0022991,000128,000172,017568
0023001,000208,000092,017560
0023011,000152,000168,017612
0023021,000232,000112,017732
0023031,000248,000048,017552
0023041,000388,000128,017676
0023051,000400,000044,017684
0023061,000356,-00024,017508
0023071,000300,000052,017612
0023081,000200,000140,017608
0023096,000312,000152,017672
0023101,000340,000248,017704
0023111,000204,000084,017652
0023121,000332,-00012,017540
0023131,000244,-00040,017648
0023141,000232,000044,017644
0023151,000372,000064,017664
0023161,000304,000280,017656
0023171,000372,000184,017628
0023181,000224,000128,017688
0023191,000168,000096,017464
0023201,000224,-00104,017628
0023211,000244,000000,017624
0023221,000220,000060,017536
0023231,000200,000228,017652
0023241,000328,000228,017468
0023251,000332,000176,017736
0023261,000140,000084,017592
0023280,000240,000020,017480
0023284,000228,000064,017568
0023291,000312,000072,017684
0023301,000252,000084,017732
0023311,000136,000160,017724
0023321,000204,000084,017640
0023331,000180,000004,017528
0023341,000300,000020,017556
0023351,000356,000108,017500
0023361,000292,-00004,017584
0023371,000356,000052,017468
0023381,000300,000024,017636
0023391,000252,000036,017736
0023401,000152,000120,017552
0023411,000372,000048,017420
0023421,000212,000084,017664
0023431,000204,000100,017604
0023446,000260,000048,017664
0023451,000192,000048,017684
0023461,000328,000096,017700
0023471,000196,000184,017500
0023481,000264,000168,017620
0023491,000332,000160,017676
0023501,000292,000088,017468
0023511,000332,000036,017576
0023521,000248,-00152,017584
0023531,000276,000064,017532
0023541,000396,000000,017608
0023551,000344,000172,017644
0023561,000284,000224,017904
0023571,000240,000268,017540
0023581,000320,000120,017596
0023591,000296,-00032,017732
0023601,000224,000016,017608
0023611,000396,-00020,017548
0023630,000372,000228,017608
0023634,000388,000224,017628
0023642,000276,000312,017580
0023651,000188,000144,017688
0023661,000108,-00008,017556
0023671,000200,-00096,017732
0023681,000312,-00008,017580
0023691,000300,000040,017452
0023701,000364,000040,017748
0023711,000292,000072,017592
0023721,000160,000140,017480
0023731,000344,000236,017252
0023741,000360,000256,017508
0023751,000300,000332,017744
0023761,000276,000032,017572
0023771,000240,-00064,017404
0023781,000184,-00088,017556
0023791,000228,000104,017556
0023806,000284,000292,017604
0023811,000340,000200,017716
0023821,000276,000204,017496
0023831,000324,000032,017644
0023841,000328,-00016,017388
0023851,000252,000084,017576
0023861,000268,000100,017588
0023871,000428,000036,017608
0023881,000136,000040,017556
0023891,000144,000124,017628
0023901,000140,000136,017728
0023911,000180,000148,017640
0023921,000308,000052,017576
0023931,000312,-00068,017512
0023941,000408,000036,017612
0023951,000152,000020,017672
0023961,000272,000220,017516
0023980,000240,000124,017704
0023984,000172,000276,017592
0023991,000216,000128,017512
0024001,000252,000104,017608
0024011,000160,-00040,017504
0024021,000264,-00008,017468
0024031,000344,-00012,017540
0024041,000308,000172,017568
0024051,000352,000200,017740
0024061,000244,000232,017660
0024071,000256,000056,017616
0024081,000192,000048,017544
0024091,000288,000048,017652
0024101,000216,000056,017712
0024111,000212,000088,017688
0024121,000244,000008,017508
0024131,000272,000120,017672
0024141,000320,000116,017724
0024156,000336,000224,017696
0024161,000400,000176,017644
0024171,000408,000152,017548
0024181,000252,000064,017672
0024191,000136,-00008,017468
0024201,000244,000024,017720
0024211,000168,000108,017668
0024221,000220,000208,017760
0024231,000140,000168,017652
0024241,000316,000148,017728
0024251,000304,-00008,017680
0024261,000436,000060,017608
0024271,000456,000108,017680
0024281,000344,000084,017680
0024291,000220,000160,017644
0024301,000108,000104,017520
0024311,000048,000176,017772
0024321,000156,000128,017504
0024340,000504,-00056,017564
0024344,000368,-00008,017696
0024352,000352,-00008,017632
0024361,000304,000028,017752
0024371,000416,000128,017532
0024381,000288,000180,017688
0024391,000216,000144,017792
0024401,000196,000152,017548
0024411,000128,000080,017596
0024421,000292,000032,017568
0024431,000232,-00032,017572
0024441,000432,000008,017592
0024451,000300,000000,017580
0024461,000288,000144,017612
0024471,000276,000204,017592
0024481,000264,000124,017656
0024491,000204,000188,017512
0024506,000224,000092,017632
0024511,000244,000032,017596
0024521,000316,-00044,017624
0024531,000384,000020,017472
0024541,000424,000136,017688
0024551,000288,000156,017428
0024561,000280,000100,017628
0024571,000204,000084,017516
0024581,000284,000092,017508
0024591,000140,000100,017644
0024601,000168,000076,017588
0024611,000320,000140,017636
0024621,000196,000204,017776
0024631,000368,000256,017632
0024641,000340,000188,017744
0024651,000316,000160,017756
0024661,000264,-00120,017548
0024671,000132,-00088,017564
0024690,000068,000088,017460
0024694,000096,000140,017420
0024701,000236,000144,017608
0024711,000248,000116,017548
0024721,000344,000160,017772
0024731,000312,000084,017572
0024741,000344,000152,017596
0024751,000380,000076,017424
0024761,000404,000092,017648
0024771,000316,-00040,017656
0024781,000208,000040,017596
0024791,000116,000084,017720
0024801,000276,000108,017676
0024811,000284,000088,017544
0024821,000228,000056,017396
0024831,000288,000088,017696
0024841,000380,-00004,017536
0024856,000324,000064,017652
0024861,000292,000168,017692
0024871,000280,000200,017608
0024881,000264,000144,017528
0024891,000284,000128,017572
0024901,000280,000024,017636
0024911,000248,000080,017716
0024921,000224,-00044,017700
0024931,000292,000104,017680
0024941,000144,000072,017572
0024951,000252,000144,017720
0024961,000344,000144,017608
0024971,000232,000120,017724
0024981,000296,000184,017496
0024991,000364,000076,017584
0025001,000224,000036,017832
0025011,000304,000012,017552
0025021,000252,000044,017708
0025040,000268,000092,017712
0025044,000168,000148,017688
0025052,000164,000128,017560
0025061,000348,000168,017624
0025071,000380,-00016,017708
0025081,000260,000056,017488
0025091,000364,000112,017600
0025101,000396,000072,017580
0025111,000260,000048,017568
0025121,000272,000020,017636
0025131,000300,000132,017640
0025141,000180,000144,017484
0025151,000180,000036,017440
0025161,000132,000104,017680
0025171,000344,000128,017756
0025181,000340,000176,017588
0025191,000440,000056,017632
0025201,000324,000020,017620
0025216,000212,000032,017704
0025221,000228,000092,017560
0025231,000104,000092,017588
0025241,000132,-00012,017784
0025251,000180,-00016,017468
0025261,000240,000100,017496
0025271,000288,000092,017460
0025281,000380,000148,017632
0025291,000368,000040,017520
0025301,000304,000052,017484
0025311,000260,000112,017680
0025321,000216,-00024,017580
0025331,000164,000136,017640
0025341,000172,000152,017532
0025351,000236,000048,017588
0025361,000260,000060,017708
0025371,000308,000108,017704
0025390,000340,000144,017532
0025394,000268,000068,017612
0025401,000296,000080,017600
0025411,000216,000048,017644
0025421,000244,000044,017572
0025431,000096,000028,017684
0025441,000116,000100,017692
0025451,000208,000068,017512
0025461,000236,000056,017680
0025471,000400,000020,017540
0025481,000424,000112,017436
0025491,000268,000056,017580
0025501,000300,000032,017596
0025511,000316,000056,017552
0025521,000248,000088,017612
0025531,000220,000120,017516
0025541,000180,000228,017576
0025551,000336,000132,017692
0025566,000312,000008,017604
0025571,000332,-00020,017716
0025581,000452,000004,017584
0025591,000260,000044,017520
0025601,000156,000080,017608
0025611,000044,000076,017544
0025621,000152,000112,017644
0025631,000116,000112,017692
0025641,000388,000076,017460
0025651,000416,000108,017456
0025661,000508,000104,017368
0025671,000348,000108,017560
0025681,000216,000056,017816
0025691,000216,000020,017792
0025701,-00008,000028,017664
0025711,000120,000088,017692
0025721,000176,000132,017680
0025731,000276,000092,017724
0025750,000388,000116,017524
0025754,000372,000144,017496
0025762,000356,000024,017576
0025771,000308,000044,017632
0025781,000268,000116,017524
0025791,000264,000048,017492
0025801,000120,-00008,017660
0025811,000252,000104,017596
0025821,000212,000112,017580
0025831,000348,000004,017516
0025841,000376,000084,017664
0025851,000372,-00028,017636
0025861,000432,-00012,017408
0025871,000236,000116,017572
0025881,000360,000060,017604
0025891,000192,000068,017812
0025901,000228,000156,017748
0025916,000088,000048,017612
0025921,000212,000016,017756
0025931,000280,-00036,017424
0025941,000312,000096,017428
0025951,000408,000112,017680
0025961,000340,000180,017932
0025971,000328,000128,018152
0025981,000284,000116,017604
0025991,000208,000016,017764
0026001,000236,000036,017416
0026011,000128,000020,017736
0026021,000184,000064,017580
0026031,000340,000124,017712
0026041,000216,000076,017608
0026051,000388,000048,017748
0026061,000380,000136,017548
0026071,000268,000148,017408
0026081,000232,000116,017636
0026100,000160,000068,017584
0026104,000176,000040,017668
0026112,000140,000144,017552
0026121,000272,000100,017656
0026131,000184,000172,017488
0026141,000184,000064,017660
0026151,000312,000052,017656
0026161,000380,000076,017572
0026171,000324,000084,017612
0026181,000260,000056,017428
0026191,000124,000052,017708
0026201,000164,000188,017784
0026211,000184,000152,017720
0026221,000336,000004,017572
0026231,000360,000040,017580
0026241,000344,000044,017724
0026251,000400,000100,017780
0026261,000232,000104,017508
0026276,000192,000012,017640
0026281,000028,000056,017592
0026291,000160,000032,017488
0026301,000076,000056,017584
0026311,000108,000084,017612
0026321,000244,000020,017568
0026331,000412,000228,017656
0026341,000484,000196,017416
0026351,000508,000204,017664
0026361,000456,000188,017356
0026371,000364,000076,017588
0026381,000228,000084,017660
0026391,000104,-00048,017800
0026401,000080,-00108,017376
0026411,000132,000128,017532
0026421,000148,000104,017608
0026431,000268,000184,017544
0026450,000320,-00004,017460
0026454,000336,-00020,017676
0026462,000400,-00068,017216
0026471,000400,000036,017420
0026481,000336,000028,017500
0026491,000248,000156,017696
0026501,000212,000224,017676
0026511,000060,000100,017696
0026521,000076,-00004,017732
0026531,000324,000056,017684
0026541,000344,000064,017656
0026551,000316,-00052,017560
0026561,000340,000076,017528
0026571,000280,000020,017380
0026581,000220,000196,017748
0026591,000124,000120,017632
0026601,000192,000184,017664
0026611,000184,000024,017552
0026626,000308,-00132,017560
0026631,000288,000044,017480
0026641,000352,000072,017720
0026651,000392,000148,017680
0026661,000296,000144,017696
0026671,000288,000216,017820
0026681,000208,000164,017516
0026691,000252,000072,017516
0026701,000116,-00080,017428
0026711,000272,-00060,017460
0026721,000220,000004,017532
0026731,000392,000172,017660
0026741,000380,000224,017644
0026751,000396,000212,017740
0026761,000276,000132,017712
0026771,000228,-00048,017376
0026781,000092,000012,017668
0026791,000212,-00052,017604
0026810,000368,000208,017556
0026814,000320,000124,017576
0026821,000228,000168,017612
0026831,000352,000184,017600
0026841,000204,000164,017660
0026851,000364,000108,017432
0026861,000168,000020,017620
0026871,000332,000112,017588
0026881,000272,000124,017484
0026891,000160,-00020,017524
0026901,000164,000056,017396
0026911,000252,000156,017684
0026921,000336,000268,017728
0026931,000352,000180,017648
0026941,000224,000096,017584
0026951,000304,000024,017540
0026961,000120,-00020,017480
0026976,000256,000048,017684
0026981,000288,000044,017596
0026991,000284,000160,017604
0027001,000248,000076,017644
0027011,000400,000244,017724
0027021,000344,000144,017636
0027031,000204,000036,017556
0027041,000284,000076,017504
0027051,000248,-00080,017680
0027061,000136,000156,017628
0027071,000140,000124,017468
0027081,000264,000192,017680
0027091,000316,000144,017708
0027101,000308,000108,017592
0027111,000248,000148,017764
0027121,000352,000020,017540
0027131,000312,-00028,017512
0027141,000236,000112,017560
0027160,000236,000236,017792
0027164,000268,000276,017732
0027172,000332,000244,017564
0027181,000360,000072,017736
0027191,000236,000200,017832
0027201,000336,000028,017620
0027211,000228,-00072,017380
0027221,000288,-00116,017676
0027231,000232,000076,017556
0027241,000296,000124,017852
0027251,000260,000268,017656
0027261,000324,000188,017520
0027271,000236,000084,017660
0027281,000184,000104,017564
0027291,000368,000024,017668
0027301,000320,000012,017804
0027311,000168,000012,017692
0027321,000232,000176,017680
0027336,000236,000192,017728
0027341,000260,000196,017612
0027351,000148,000108,017604
0027361,000196,000108,017408
0027371,000356,-00060,017532
0027381,000292,000012,017540
0027391,000268,000064,017512
0027401,000116,000084,017672
0027411,000200,000184,017508
0027421,000172,000268,017692
0027431,000188,000112,017656
0027441,000140,000056,017712
0027451,000324,-00004,017512
0027461,000240,000020,017628
0027471,000264,000088,017620
0027481,000412,000048,017556
0027491,000216,000068,017652
0027510,000208,000120,017680
0027514,000260,000028,017672
0027522,000192,000028,017580
0027531,000180,000008,017736
0027541,000288,000144,017540
0027551,000304,000096,017536
0027561,000296,-00028,017672
0027571,000324,000132,017660
0027581,000496,000128,017756
0027591,000332,000068,017692
0027601,000232,000088,017624
0027611,000236,000156,017776
0027621,000120,000124,017648
0027631,000144,000084,017580
0027641,000292,000116,017608
0027651,000236,000104,017500
0027661,000364,000092,017672
0027671,000216,000208,017552
0027686,000256,000132,017628
0027691,000196,000072,017716
