<?xml version="1.0" standalone="no"?>
<!DOCTYPE svg PUBLIC "-//W3C//DTD SVG 20010904//EN"
 "http://www.w3.org/TR/2001/REC-SVG-20010904/DTD/svg10.dtd">
<svg version="1.0" xmlns="http://www.w3.org/2000/svg"
 width="192.000000pt" height="192.000000pt" viewBox="0 0 192.000000 192.000000"
 preserveAspectRatio="xMidYMid meet">
<metadata>
Created by potrace 1.14, written by Peter Selinger 2001-2017
</metadata>
<g transform="translate(0.000000,192.000000) scale(0.100000,-0.100000)"
fill="#000000" stroke="none">
<path d="M891 1424 c-19 -8 -46 -27 -60 -43 -14 -16 -66 -73 -116 -126 -49
-54 -110 -120 -135 -148 -25 -27 -56 -62 -70 -77 -29 -31 -168 -183 -229 -250
-23 -25 -48 -59 -56 -77 -55 -116 51 -252 168 -214 40 13 47 20 152 136 107
118 113 125 214 235 48 52 110 121 137 152 27 31 54 57 61 57 13 1 22 -9 223
-230 320 -352 315 -347 366 -355 110 -16 199 112 151 218 -11 24 -58 80 -208
243 -26 27 -71 77 -101 110 -30 33 -67 74 -83 90 -15 17 -64 70 -109 119 -124
136 -134 146 -171 162 -44 18 -90 17 -134 -2z"/>
</g>
</svg>
