<svg width="911" height="585" viewBox="0 0 911 585" fill="none" xmlns="http://www.w3.org/2000/svg">
<path fill-rule="evenodd" clip-rule="evenodd" d="M25.4784 557.077C-8.49277 519.766 -8.49279 459.214 25.4783 421.904L377.156 35.6565C420.443 -11.8855 490.557 -11.8855 533.844 35.6565L885.522 421.904C919.493 459.214 919.493 519.766 885.522 557.077C851.623 594.308 796.716 594.308 762.817 557.077L455.5 219.551L148.183 557.077C114.284 594.308 59.3773 594.308 25.4784 557.077Z" fill="black"/>
</svg>
