{
  "/umi.css": "/umi.4ad3aec1.css",
  "/umi.js": "/umi.9a0e2680.js",
  "/t__plugin-layout__Layout.css": "/t__plugin-layout__Layout.85b4bb32.chunk.css",
  "/t__plugin-layout__Layout.js": "/t__plugin-layout__Layout.cf43b159.async.js",
  "/p__file__competition-info__competition-info.css": "/p__file__competition-info__competition-info.f89bb59a.chunk.css",
  "/p__file__competition-info__competition-info.js": "/p__file__competition-info__competition-info.1b2c5d0a.async.js",
  "/p__file__competition-info__competition-level.css": "/p__file__competition-info__competition-level.bfcf418c.chunk.css",
  "/p__file__competition-info__competition-level.js": "/p__file__competition-info__competition-level.cba27035.async.js",
  "/p__file__group-classification.css": "/p__file__group-classification.f89bb59a.chunk.css",
  "/p__file__group-classification.js": "/p__file__group-classification.f4428293.async.js",
  "/p__file__phonebook.css": "/p__file__phonebook.c2ed7356.chunk.css",
  "/p__file__phonebook.js": "/p__file__phonebook.9fb78042.async.js",
  "/p__file__coach-data.css": "/p__file__coach-data.c2ed7356.chunk.css",
  "/p__file__coach-data.js": "/p__file__coach-data.41223f0a.async.js",
  "/p__file__player-data.css": "/p__file__player-data.c2ed7356.chunk.css",
  "/p__file__player-data.js": "/p__file__player-data.60caa69c.async.js",
  "/p__file__competition-detail__competition-status.css": "/p__file__competition-detail__competition-status.bfcf418c.chunk.css",
  "/p__file__competition-detail__competition-status.js": "/p__file__competition-detail__competition-status.a5467bb7.async.js",
  "/p__file__competition-detail__competition-detail.css": "/p__file__competition-detail__competition-detail.bfcf418c.chunk.css",
  "/p__file__competition-detail__competition-detail.js": "/p__file__competition-detail__competition-detail.5d8346af.async.js",
  "/p__setting__sc-joint-action.css": "/p__setting__sc-joint-action.039dc232.chunk.css",
  "/p__setting__sc-joint-action.js": "/p__setting__sc-joint-action.bb12645a.async.js",
  "/p__setting__sc-muscle-group.css": "/p__setting__sc-muscle-group.039dc232.chunk.css",
  "/p__setting__sc-muscle-group.js": "/p__setting__sc-muscle-group.c7efb010.async.js",
  "/p__setting__sub-sc-setting.css": "/p__setting__sub-sc-setting.039dc232.chunk.css",
  "/p__setting__sub-sc-setting.js": "/p__setting__sub-sc-setting.588d7fa7.async.js",
  "/p__setting__national-height.css": "/p__setting__national-height.bfcf418c.chunk.css",
  "/p__setting__national-height.js": "/p__setting__national-height.e2d352fc.async.js",
  "/p__setting__group-activity.css": "/p__setting__group-activity.9a6f1754.chunk.css",
  "/p__setting__group-activity.js": "/p__setting__group-activity.b2d5ae83.async.js",
  "/p__setting__coach-agenda-setting.css": "/p__setting__coach-agenda-setting.9a6f1754.chunk.css",
  "/p__setting__coach-agenda-setting.js": "/p__setting__coach-agenda-setting.59b36090.async.js",
  "/p__setting__attendance-setting.css": "/p__setting__attendance-setting.e38e7804.chunk.css",
  "/p__setting__attendance-setting.js": "/p__setting__attendance-setting.e7d56bf5.async.js",
  "/p__individual__competition-report__result-category.css": "/p__individual__competition-report__result-category.b11ab370.chunk.css",
  "/p__individual__competition-report__result-category.js": "/p__individual__competition-report__result-category.40576710.async.js",
  "/p__individual__competition-report__competition-report.css": "/p__individual__competition-report__competition-report.c08310d9.chunk.css",
  "/p__individual__competition-report__competition-report.js": "/p__individual__competition-report__competition-report.72179a1e.async.js",
  "/p__individual__medical-record.css": "/p__individual__medical-record.e262dbe1.chunk.css",
  "/p__individual__medical-record.js": "/p__individual__medical-record.07717d51.async.js",
  "/p__individual__attendance.css": "/p__individual__attendance.5ae7e99f.chunk.css",
  "/p__individual__attendance.js": "/p__individual__attendance.92c79417.async.js",
  "/p__individual__kpi-2.css": "/p__individual__kpi-2.249a6f8a.chunk.css",
  "/p__individual__kpi-2.js": "/p__individual__kpi-2.c5abd129.async.js",
  "/p__data-management__strength-conditioning.css": "/p__data-management__strength-conditioning.dc393877.chunk.css",
  "/p__data-management__strength-conditioning.js": "/p__data-management__strength-conditioning.1ce15856.async.js",
  "/p__data-management__strength-conditioning-data.css": "/p__data-management__strength-conditioning-data.bfea4be0.chunk.css",
  "/p__data-management__strength-conditioning-data.js": "/p__data-management__strength-conditioning-data.9bdc29a4.async.js",
  "/p__data-management__maturational-status.css": "/p__data-management__maturational-status.575cde64.chunk.css",
  "/p__data-management__maturational-status.js": "/p__data-management__maturational-status.c1b3d67f.async.js",
  "/p__data-management__fitness-monitor-tool.css": "/p__data-management__fitness-monitor-tool.2f315e57.chunk.css",
  "/p__data-management__fitness-monitor-tool.js": "/p__data-management__fitness-monitor-tool.6f9f036f.async.js",
  "/p__data-management__fitness-test.css": "/p__data-management__fitness-test.205a5b96.chunk.css",
  "/p__data-management__fitness-test.js": "/p__data-management__fitness-test.df45b938.async.js",
  "/p__master-plan__coach-agenda.css": "/p__master-plan__coach-agenda.0e5e806e.chunk.css",
  "/p__master-plan__coach-agenda.js": "/p__master-plan__coach-agenda.1c7928b1.async.js",
  "/p__master-plan__ypi.css": "/p__master-plan__ypi.a80e44c1.chunk.css",
  "/p__master-plan__ypi.js": "/p__master-plan__ypi.90fd564c.async.js",
  "/p__master-plan__ytp.css": "/p__master-plan__ytp.64d9a742.chunk.css",
  "/p__master-plan__ytp.js": "/p__master-plan__ytp.f4a961c7.async.js",
  "/p__master-plan__wtp.css": "/p__master-plan__wtp.8a2077f6.chunk.css",
  "/p__master-plan__wtp.js": "/p__master-plan__wtp.2bdf23e0.async.js",
  "/p__report__data-player.css": "/p__report__data-player.2a8cd56e.chunk.css",
  "/p__report__data-player.js": "/p__report__data-player.f0d0e38f.async.js",
  "/p__report__coach-agenda.css": "/p__report__coach-agenda.0e5e806e.chunk.css",
  "/p__report__coach-agenda.js": "/p__report__coach-agenda.367f4e58.async.js",
  "/p__system__edit-profile.css": "/p__system__edit-profile.39fb17c9.chunk.css",
  "/p__system__edit-profile.js": "/p__system__edit-profile.f223c19c.async.js",
  "/p__menu.css": "/p__menu.a8ccbdd8.chunk.css",
  "/p__menu.js": "/p__menu.b765462d.async.js",
  "/p__menu.png": "/static/bg.1182312e.png",
  "/p__user__Login.css": "/p__user__Login.4f6d2c69.chunk.css",
  "/p__user__Login.js": "/p__user__Login.8b433ea6.async.js",
  "/p__user__Login.png": "/static/logo_bypro.26076d08.png",
  "/p__user__register-result.css": "/p__user__register-result.34ba54c3.chunk.css",
  "/p__user__register-result.js": "/p__user__register-result.b1d18f0a.async.js",
  "/p__user__register.css": "/p__user__register.d58302e8.chunk.css",
  "/p__user__register.js": "/p__user__register.eac0aa53.async.js",
  "/p__404.css": "/p__404.b88066b1.chunk.css",
  "/p__404.js": "/p__404.c17642d4.async.js",
  "/1120.63548b9a.async.js": "/1120.63548b9a.async.js",
  "/7856.928f338b.async.js": "/7856.928f338b.async.js",
  "/1608.aeaa7feb.async.js": "/1608.aeaa7feb.async.js",
  "/3851.0140a41a.chunk.css": "/3851.0140a41a.chunk.css",
  "/3851.39b99411.async.js": "/3851.39b99411.async.js",
  "/7008.2a780ab1.chunk.css": "/7008.2a780ab1.chunk.css",
  "/7008.ebec1ab2.async.js": "/7008.ebec1ab2.async.js",
  "/786.d4da8688.chunk.css": "/786.d4da8688.chunk.css",
  "/786.8ff47e8a.async.js": "/786.8ff47e8a.async.js",
  "/704.be486b49.async.js": "/704.be486b49.async.js",
  "/9302.15269648.chunk.css": "/9302.15269648.chunk.css",
  "/958.e4494396.chunk.css": "/958.e4494396.chunk.css",
  "/958.d1863fdc.async.js": "/958.d1863fdc.async.js",
  "/8737.c0c92ad7.chunk.css": "/8737.c0c92ad7.chunk.css",
  "/8737.79d4ddfb.async.js": "/8737.79d4ddfb.async.js",
  "/9326.e6b22f26.async.js": "/9326.e6b22f26.async.js",
  "/2397.9de21168.async.js": "/2397.9de21168.async.js",
  "/2646.8dca7408.async.js": "/2646.8dca7408.async.js",
  "/2136.b3303102.async.js": "/2136.b3303102.async.js",
  "/8036.48ced59c.async.js": "/8036.48ced59c.async.js",
  "/6799.f68eeda0.async.js": "/6799.f68eeda0.async.js",
  "/2148.e8b6fa48.async.js": "/2148.e8b6fa48.async.js",
  "/9990.3bf84bff.async.js": "/9990.3bf84bff.async.js",
  "/1647.718c293e.async.js": "/1647.718c293e.async.js",
  "/2134.950121df.chunk.css": "/2134.950121df.chunk.css",
  "/2134.d4b115e5.async.js": "/2134.d4b115e5.async.js",
  "/2653.23bd832f.async.js": "/2653.23bd832f.async.js",
  "/6849.7fbee877.async.js": "/6849.7fbee877.async.js",
  "/8357.e74405f9.chunk.css": "/8357.e74405f9.chunk.css",
  "/static/bg.png": "/static/bg.1182312e.png",
  "/logo.png": "/logo.png",
  "/static/logo_bypro.png": "/static/logo_bypro.26076d08.png",
  "/static/menu_out.png": "/static/menu_out.e0c80b43.png",
  "/static/menu_bg.png": "/static/menu_bg.e5a803be.png",
  "/icons/icon-512x512.png": "/icons/icon-512x512.png",
  "/favicon.ico": "/favicon.ico",
  "/logo.svg": "/logo.svg",
  "/icons/icon-192x192.png": "/icons/icon-192x192.png",
  "/icons/icon-128x128.png": "/icons/icon-128x128.png",
  "/pro_icon.svg": "/pro_icon.svg",
  "/CNAME": "/CNAME"
}