{
  "type": "service_account",
  "project_id": "rn-fibersquad-bb124",
  "private_key_id": "f7782d03330557149ad6f9784d8d014e39a5a0df",
  "private_key": "-----BEGIN PRIVATE KEY-----\nMIIEvgIBADANBgkqhkiG9w0BAQEFAASCBKgwggSkAgEAAoIBAQDR+mjYuGyLhPmx\nA4d+6IIRU4fIZsttmM5AnsrPD1BwB7axk6XR8hXoioFlDAhEcqEP89yt9xVD9jVq\nmOSIXE5nXNLR1APcCY2mCF5jLyPuHjT3uKryfpWTUASuYUZoCKjIT9keIEvHc9zf\n/3RnA4N1N7ORXucSiCGuRJ7lhOgKBgF7uDoCbTYOvxK13EWL1z2NkWj9F13keaUY\non+1RLi8xVoNl237HBp7NgCKYXfoKwZLIYxDi3JSFlDnC9yAfM1pbf3lAByM9SJk\npjOS1jqj5FYdYNttS7HrKUQjTvK3nYkhss3MLBP0Xzz/1gLUq0GN0aVTvXx23rLN\nqDjd9O8bAgMBAAECggEAF1D5w4Ghy/xVcv/eqTZNpc7jYlrHzBZju26RPAeJ+bwM\nNWZydgBZHnFYMk2bvWiyfyr9HkmJkE+5WWo7i54fDACVXbzFO5xz9jPdB0vSGZGR\nICY0FVP+bVU9Wn/CvwVMeLHP0jXpNESmtNjmUWoPzDxbMZFFkhvmYYuNJBTAuhwC\nXNqRckRkIGVgQJ7nbzMYdi+LcGOH1OgKZdN0UMPGHo9EbgTxxihquFlOrqcqBTRL\nhhASCgGJ5GzYURcz6lI7xdlxN1M3nnOlGojGTUItQ0sqBaEVFHE7Z5jrCPA1n5Pe\ngQg8vxaH0JpDMAsY0S/uc4dTnlfje9ilTp3vSXFRgQKBgQD2k0wG05sI0sD48Qd9\nc9EDCf+e/iLEgVyo9CaQDjBjaMJPSu1Zg0zpD4uwgxq+PyA0Gh6J17OIq0zzpNyU\n6vRodVu+PYF+Z6SQO2KMyqRpcMz20uWabn7IWSK/C6oqPhEiNkXwF3/ToAU1p0LC\nw6EVdOZXcAIVuvwlPVITOB/lAwKBgQDaAQOqJeQ+g5vEkYxcSD7+bqZ2moYuJmym\n2luvVw8GirMbXa3u7gXyEuAxKs+o/x9u3EVr4aIeKVEfyykBjN+zv6Mes3CVdO+j\nBEj4FpnCv5l7x8rlDraXdbsxoeUve49IopTP8JgfDvR9XkOT35O01yUGlY+fcyIF\nGaZtDpf2CQKBgQDk1PxIlZca0CSAo4eU+Kfvzxao4ic4AOoSbktfg5uKlk1GMz4k\nxYLaBDBahsGJ76GeWOMgf8tBOeC3eLexiH98dfXHjuMfgWYq6MHj8ag1ppbBNiYZ\ndRQ6MObbMCMjAuj5vC6Zy+U4bBiJm4mMoOtcs1mVqgB1VEvu74K9DWgkKwKBgEUJ\nYTG2wisR3nhHZ12p+1jzjX+tu6RNwsasC7DhLv7xWXrnFbe+ZN+eHqUzW4O3Fysy\nUkGxuHc4uloJKjk1dXoky/Fi/do2p9TF/J2j+plzt5U9VgFnwWcBf4BeNofs5xkn\nc1zOYj4jrEUvXtMrUElKgI0vO8ZQ3Ysj7lJG9tSRAoGBAMq9bpmmul9h+z+HgJdB\nceC3VdZKxYoYionIivFpDpXWYQnztE02tlYU4LUkrHN0FZnCijHtBLSgiYhwNN2s\na+7yf3YaXVncK+josX7I0/CBlo6vVqXtSB23bnoSXzG2LoWDsB0k2mqLOc5q5CcK\n91EDC1SYWsY/fvV/tNK0ira4\n-----END PRIVATE KEY-----\n",
  "client_email": "firebase-adminsdk-ym379@rn-fibersquad-bb124.iam.gserviceaccount.com",
  "client_id": "109650753927330990895",
  "auth_uri": "https://accounts.google.com/o/oauth2/auth",
  "token_uri": "https://oauth2.googleapis.com/token",
  "auth_provider_x509_cert_url": "https://www.googleapis.com/oauth2/v1/certs",
  "client_x509_cert_url": "https://www.googleapis.com/robot/v1/metadata/x509/firebase-adminsdk-ym379%40rn-fibersquad-bb124.iam.gserviceaccount.com"
}
