[
  {
    "title": "Advanced Natural Language Processing Techniques",
    "category": "Research"
  },
  {
    "title": "Implementing Machine Learning Algorithms",
    "category": "Research"
  },
  {
    "title": "Understanding Big Data Analytics",
    "category": "Research"
  },
  {
    "title": "JavaScript: Creating Hero Information Cards",
    "category": "Code Snippets"
  },
  {
    "title": "JavaScript: Loading JSON Data Into Script",
    "category": "Code Snippets"
  },
  {
    "title": "Python: Handling Large JSON Files",
    "category": "Code Snippets"
  }
]