{
    "swagger": "2.0",
    "info": {
        "contact": {}
    },
    "basePath": "/api/v1",
    "paths": {
        "/books": {
            "get": {
                "description": "Returns a list of books",
                "consumes": [
                    "application/json"
                ],
                "produces": [
                    "application/json"
                ],
                "tags": [
                    "Book"
                ],
                "summary": "List of books",
                "responses": {
                    "200": {
                        "description": "OK",
                        "schema": {
                            "type": "string"
                        }
                    }
                }
            }
        }
    }
}