{
  "_note1": "KEEP THIS FILE! Check it into a version control system (VCS) like git.",
  "_note2": "ObjectBox manages crucial IDs for your object model. See docs for details.",
  "_note3": "If you have VCS merge conflicts, you must resolve them according to ObjectBox docs.",
  "entities": [
    {
      "id": "1:4259037607875658431",
      "lastPropertyId": "2:1869459561017915811",
      "name": "QuerySearch",
      "properties": [
        {
          "id": "1:170377347116921041",
          "name": "id",
          "type": 6,
          "flags": 1
        },
        {
          "id": "2:1869459561017915811",
          "name": "query",
          "type": 9
        }
      ],
      "relations": []
    }
  ],
  "lastEntityId": "1:4259037607875658431",
  "lastIndexId": "0:0",
  "lastRelationId": "0:0",
  "lastSequenceId": "0:0",
  "modelVersion": 5,
  "modelVersionParserMinimum": 5,
  "retiredEntityUids": [],
  "retiredIndexUids": [],
  "retiredPropertyUids": [],
  "retiredRelationUids": [],
  "version": 1
}