module twittor

go 1.20

require (
	github.com/ashwanthkumar/slack-go-webhook v0.0.0-20200209025033-430dd4e66960
	github.com/go-chi/chi v1.5.4
	github.com/go-chi/cors v1.2.1
	github.com/go-chi/render v1.0.2
	github.com/go-playground/universal-translator v0.18.1
	github.com/go-playground/validator/v10 v10.12.0
	github.com/golang-jwt/jwt/v4 v4.5.0
	github.com/joho/godotenv v1.5.1
	github.com/lib/pq v1.10.7
	github.com/stretchr/testify v1.8.2
	github.com/swaggo/http-swagger v1.3.4
	github.com/swaggo/swag v1.8.11
	go.mongodb.org/mongo-driver v1.11.3
)

require (
	github.com/KyleBanks/depth v1.2.1 // indirect
	github.com/ajg/form v1.5.1 // indirect
	github.com/davecgh/go-spew v1.1.1 // indirect
	github.com/elazarl/goproxy v0.0.0-20221015165544-a0805db90819 // indirect
	github.com/go-openapi/jsonpointer v0.19.5 // indirect
	github.com/go-openapi/jsonreference v0.20.0 // indirect
	github.com/go-openapi/spec v0.20.6 // indirect
	github.com/go-openapi/swag v0.19.15 // indirect
	github.com/go-playground/locales v0.14.1 // indirect
	github.com/golang/snappy v0.0.1 // indirect
	github.com/josharian/intern v1.0.0 // indirect
	github.com/klauspost/compress v1.13.6 // indirect
	github.com/leodido/go-urn v1.2.2 // indirect
	github.com/mailru/easyjson v0.7.6 // indirect
	github.com/montanaflynn/stats v0.0.0-20171201202039-1bf9dbcd8cbe // indirect
	github.com/parnurzeal/gorequest v0.2.16 // indirect
	github.com/pkg/errors v0.9.1 // indirect
	github.com/pmezard/go-difflib v1.0.0 // indirect
	github.com/smartystreets/goconvey v1.7.2 // indirect
	github.com/swaggo/files v0.0.0-20220610200504-28940afbdbfe // indirect
	github.com/xdg-go/pbkdf2 v1.0.0 // indirect
	github.com/xdg-go/scram v1.1.1 // indirect
	github.com/xdg-go/stringprep v1.0.3 // indirect
	github.com/youmark/pkcs8 v0.0.0-20181117223130-1be2e3e5546d // indirect
	golang.org/x/crypto v0.7.0 // indirect
	golang.org/x/net v0.8.0 // indirect
	golang.org/x/sync v0.1.0 // indirect
	golang.org/x/sys v0.6.0 // indirect
	golang.org/x/text v0.8.0 // indirect
	golang.org/x/tools v0.6.0 // indirect
	gopkg.in/yaml.v2 v2.4.0 // indirect
	gopkg.in/yaml.v3 v3.0.1 // indirect
	moul.io/http2curl v1.0.0 // indirect
)
