id,NF
78,50.04778593138494
371,61.580909168750985
248,51.84773789502522
55,43.69697029165814
390,66.16006940599893
223,63.454119111433684
42,66.6301322554374
234,47.80790118018435
316,37.21306966871486
116,53.75037824857305
9,49.88819261221066
209,40.46744219178678
323,48.60417798849476
393,55.79620407713447
258,39.33719726418454
155,56.035616813219264
124,39.56209853409586
272,59.11961841944077
324,64.32590976427892
334,55.905947436634946
15,56.79211606606067
391,58.151159996371256
167,53.70063369188767
0,47.72514415556368
140,52.48240478191808
113,70.7109360619249
77,46.545991431976134
33,51.6249664092607
101,44.163668493860214
76,50.518590173289645
307,52.67266659128257
375,53.72853546649348
291,58.25835794313483
356,57.6705713185518
90,43.89783205116574
384,62.03898468052697
137,53.94237348718628
57,64.13992698416092
73,63.253804819175635
25,57.06853337184044
72,44.900186028772005
145,38.315096819511446
329,42.67083427952001
141,28.291569511117203
158,64.69747747654561
93,49.893538972657105
46,48.85367472314866
304,48.815916144925374
108,42.14986246542276
196,58.736780009345075
39,59.460097620795366
56,68.29160988275653
30,51.82168076283287
377,45.94242804164358
386,54.64763746174379
132,28.62643474027009
285,56.904084468868795
168,64.55119058999146
22,44.36710010856047
31,56.66162329897177
94,46.81519773274813
193,63.287688356391676
157,65.07459144898647
177,36.15304089498058
370,51.76514712386666
182,52.85562351391951
255,56.86699907261294
358,58.101306581661866
317,51.19487301548094
5,38.01812781355575
45,61.04951922957138
84,61.32200625196758
289,57.50206139721915
110,58.8880662647101
364,19.014252386077743
82,40.31289909197141
114,64.5221257062606
3,46.75642327565311
18,54.56996982906413
181,38.386873288051255
194,54.03189078279037
173,50.94287345352724
63,20.957714612183995
253,37.02898169423301
225,59.10185402684655
331,49.71591578573217
383,43.900433028193525
227,70.06645255056844
342,41.1708846639051
131,45.34975380581423
320,60.24734396391469
175,58.42821126365389
238,55.621547816460364
368,60.05092723223724
367,45.45887893820268
210,62.86896078134562
75,56.10502130729016
104,48.73447976431392
374,47.438595149658845
16,51.53889507843507
66,44.907420379340365
211,54.93622691773231
7,48.427013211751515
19,45.12757090337849
301,32.79294232764727
350,64.28322696585758
365,54.33723601803428
118,65.29999289148216
321,64.46390830051847
296,59.361895516096894
381,56.172993422381225
373,61.035312487346935
60,58.984581726634694
79,51.51077829831236
281,57.016635470838985
245,64.08207115916156
250,66.46510471289731
218,57.649190971710745
109,61.50505044360882
