<svg width="1252" height="361" viewBox="0 0 1252 361" fill="none" xmlns="http://www.w3.org/2000/svg">
<rect width="1252" height="361" fill="white"/>
<rect x="49" y="49" width="258.5" height="114" stroke="#5C7499" stroke-opacity="0.48" stroke-width="2" stroke-dasharray="14 14"/>
<g filter="url(#filter0_i_6578_12666)">
<path d="M74 72H86C87.0938 72 88 72.9062 88 74V76C88 77.125 87.0938 78 86 78H74C72.875 78 72 77.125 72 76V74C72 72.9062 72.875 72 74 72ZM82.75 74.25C82.3125 74.25 82 74.5938 82 75C82 75.4375 82.3125 75.75 82.75 75.75C83.1562 75.75 83.5 75.4375 83.5 75C83.5 74.5938 83.1562 74.25 82.75 74.25ZM84.25 75C84.25 75.4375 84.5625 75.75 85 75.75C85.4062 75.75 85.75 75.4375 85.75 75C85.75 74.5938 85.4062 74.25 85 74.25C84.5625 74.25 84.25 74.5938 84.25 75ZM74 80H86C87.0938 80 88 80.9062 88 82V84C88 85.125 87.0938 86 86 86H74C72.875 86 72 85.125 72 84V82C72 80.9062 72.875 80 74 80ZM82.75 82.25C82.3125 82.25 82 82.5938 82 83C82 83.4375 82.3125 83.75 82.75 83.75C83.1562 83.75 83.5 83.4375 83.5 83C83.5 82.5938 83.1562 82.25 82.75 82.25ZM84.5 83C84.5 83.4375 84.8125 83.75 85.25 83.75C85.6562 83.75 86 83.4375 86 83C86 82.5938 85.6562 82.25 85.25 82.25C84.8125 82.25 84.5 82.5938 84.5 83Z" fill="#5C7499"/>
</g>
<path d="M75.2344 127.625V139H73.0859V127.625H75.2344ZM79.8203 132.539V134.234H74.6719V132.539H79.8203ZM80.4219 127.625V129.32H74.6719V127.625H80.4219ZM86.9219 127.625V139H84.7812V127.625H86.9219ZM90.4531 127.625V129.32H81.2891V127.625H90.4531ZM96.2578 134.852H93.3281V133.164H96.2578C96.737 133.164 97.125 133.086 97.4219 132.93C97.724 132.768 97.9453 132.549 98.0859 132.273C98.2266 131.992 98.2969 131.672 98.2969 131.312C98.2969 130.964 98.2266 130.638 98.0859 130.336C97.9453 130.034 97.724 129.789 97.4219 129.602C97.125 129.414 96.737 129.32 96.2578 129.32H94.0312V139H91.8828V127.625H96.2578C97.1432 127.625 97.8984 127.784 98.5234 128.102C99.1536 128.414 99.6328 128.849 99.9609 129.406C100.294 129.958 100.461 130.589 100.461 131.297C100.461 132.031 100.294 132.664 99.9609 133.195C99.6328 133.727 99.1536 134.135 98.5234 134.422C97.8984 134.708 97.1432 134.852 96.2578 134.852Z" fill="#003366"/>
<path d="M48 218.75V204.25H49V198H55.2361V197H69.7083V198H84.1805V197H98.6527V198H113.125V197H127.597V198H142.069V197H156.542V198H171.014V197H185.486V198H199.958V197H214.431V198H228.903V197H243.375V198H257.847V197H272.319V198H286.792V197H301.264V198H307.5V204.25H308.5V218.75H307.5V233.25H308.5V247.75H307.5V262.25H308.5V276.75H307.5V291.25H308.5V305.75H307.5V312H301.264V313H286.792V312H272.319V313H257.847V312H243.375V313H228.903V312H214.431V313H199.958V312H185.486V313H171.014V312H156.542V313H142.069V312H127.597V313H113.125V312H98.6528V313H84.1806V312H69.7083V313H55.2361V312H49V305.75H48V291.25H49V276.75H48V262.25H49V247.75H48V233.25H49V218.75H48Z" stroke="#5C7499" stroke-opacity="0.48" stroke-width="2" stroke-dasharray="14 14"/>
<g filter="url(#filter1_i_6578_12666)">
<path d="M87.75 224.062V225.75C87.75 227.332 84.1992 228.562 79.875 228.562C75.5156 228.562 72 227.332 72 225.75V224.062C72 222.516 75.5156 221.25 79.875 221.25C84.1992 221.25 87.75 222.516 87.75 224.062ZM85.8164 228.809C86.5547 228.562 87.2227 228.211 87.75 227.824V231.375C87.75 232.957 84.1992 234.188 79.875 234.188C75.5156 234.188 72 232.957 72 231.375V227.824C72.4922 228.211 73.1953 228.562 73.8984 228.809C75.4805 229.371 77.5898 229.688 79.875 229.688C82.125 229.688 84.2344 229.371 85.8164 228.809ZM72 233.449C72.4922 233.836 73.1953 234.188 73.8984 234.434C75.4805 234.996 77.5898 235.312 79.875 235.312C82.125 235.312 84.2344 234.996 85.8164 234.434C86.5547 234.188 87.2227 233.836 87.75 233.449V236.438C87.75 238.02 84.1992 239.25 79.875 239.25C75.5156 239.25 72 238.02 72 236.438V233.449Z" fill="#5C7499"/>
</g>
<path d="M79.0391 285.047C79.0391 284.828 79.0052 284.633 78.9375 284.461C78.875 284.284 78.7578 284.125 78.5859 283.984C78.4193 283.839 78.1823 283.698 77.875 283.562C77.5729 283.422 77.1823 283.276 76.7031 283.125C76.1719 282.958 75.6771 282.771 75.2188 282.562C74.7604 282.354 74.3568 282.112 74.0078 281.836C73.6641 281.56 73.3958 281.242 73.2031 280.883C73.0104 280.518 72.9141 280.096 72.9141 279.617C72.9141 279.148 73.013 278.721 73.2109 278.336C73.4141 277.951 73.7005 277.62 74.0703 277.344C74.4401 277.062 74.875 276.846 75.375 276.695C75.8802 276.544 76.4375 276.469 77.0469 276.469C77.8906 276.469 78.6198 276.622 79.2344 276.93C79.8542 277.237 80.3333 277.654 80.6719 278.18C81.0104 278.706 81.1797 279.297 81.1797 279.953H79.0391C79.0391 279.599 78.9635 279.286 78.8125 279.016C78.6667 278.745 78.4427 278.531 78.1406 278.375C77.8438 278.219 77.4688 278.141 77.0156 278.141C76.5781 278.141 76.2135 278.206 75.9219 278.336C75.6354 278.466 75.4193 278.643 75.2734 278.867C75.1328 279.091 75.0625 279.341 75.0625 279.617C75.0625 279.826 75.112 280.013 75.2109 280.18C75.3099 280.341 75.4583 280.495 75.6562 280.641C75.8542 280.781 76.099 280.914 76.3906 281.039C76.6875 281.159 77.0312 281.279 77.4219 281.398C78.0469 281.586 78.5938 281.794 79.0625 282.023C79.5365 282.253 79.9297 282.513 80.2422 282.805C80.5599 283.096 80.7969 283.424 80.9531 283.789C81.1146 284.154 81.1953 284.568 81.1953 285.031C81.1953 285.521 81.099 285.958 80.9062 286.344C80.7135 286.729 80.4375 287.057 80.0781 287.328C79.7188 287.599 79.2865 287.805 78.7812 287.945C78.2812 288.086 77.7214 288.156 77.1016 288.156C76.5495 288.156 76.0026 288.083 75.4609 287.938C74.9245 287.786 74.4375 287.562 74 287.266C73.5625 286.964 73.2135 286.583 72.9531 286.125C72.6927 285.661 72.5625 285.12 72.5625 284.5H74.7188C74.7188 284.859 74.776 285.167 74.8906 285.422C75.0104 285.672 75.1771 285.878 75.3906 286.039C75.6094 286.195 75.8646 286.31 76.1562 286.383C76.4479 286.456 76.763 286.492 77.1016 286.492C77.5391 286.492 77.8984 286.432 78.1797 286.312C78.4661 286.188 78.6797 286.016 78.8203 285.797C78.9661 285.578 79.0391 285.328 79.0391 285.047ZM87.2266 283.852H84.2969V282.164H87.2266C87.7057 282.164 88.0938 282.086 88.3906 281.93C88.6927 281.768 88.9141 281.549 89.0547 281.273C89.1953 280.992 89.2656 280.672 89.2656 280.312C89.2656 279.964 89.1953 279.638 89.0547 279.336C88.9141 279.034 88.6927 278.789 88.3906 278.602C88.0938 278.414 87.7057 278.32 87.2266 278.32H85V288H82.8516V276.625H87.2266C88.112 276.625 88.8672 276.784 89.4922 277.102C90.1224 277.414 90.6016 277.849 90.9297 278.406C91.263 278.958 91.4297 279.589 91.4297 280.297C91.4297 281.031 91.263 281.664 90.9297 282.195C90.6016 282.727 90.1224 283.135 89.4922 283.422C88.8672 283.708 88.112 283.852 87.2266 283.852ZM96.4062 278.352L93.1641 288H90.8906L95.1406 276.625H96.5938L96.4062 278.352ZM99.1172 288L95.8594 278.352L95.6641 276.625H97.125L101.398 288H99.1172ZM98.9688 283.773V285.469H92.8672V283.773H98.9688ZM102.57 276.625H106.703C107.568 276.625 108.31 276.755 108.93 277.016C109.549 277.276 110.026 277.661 110.359 278.172C110.693 278.682 110.859 279.31 110.859 280.055C110.859 280.643 110.755 281.154 110.547 281.586C110.339 282.018 110.044 282.38 109.664 282.672C109.289 282.964 108.846 283.193 108.336 283.359L107.664 283.703H104.016L104 282.008H106.727C107.169 282.008 107.536 281.93 107.828 281.773C108.12 281.617 108.339 281.401 108.484 281.125C108.635 280.849 108.711 280.534 108.711 280.18C108.711 279.799 108.638 279.471 108.492 279.195C108.346 278.914 108.125 278.698 107.828 278.547C107.531 278.396 107.156 278.32 106.703 278.32H104.719V288H102.57V276.625ZM108.992 288L106.359 282.906L108.633 282.898L111.297 287.891V288H108.992ZM118.844 286.398L121.875 288.805L120.5 290L117.516 287.609L118.844 286.398ZM121.93 282.023V282.609C121.93 283.469 121.815 284.242 121.586 284.93C121.357 285.612 121.029 286.193 120.602 286.672C120.18 287.151 119.677 287.518 119.094 287.773C118.51 288.029 117.865 288.156 117.156 288.156C116.453 288.156 115.807 288.029 115.219 287.773C114.635 287.518 114.13 287.151 113.703 286.672C113.276 286.193 112.945 285.612 112.711 284.93C112.477 284.242 112.359 283.469 112.359 282.609V282.023C112.359 281.159 112.474 280.385 112.703 279.703C112.938 279.021 113.266 278.44 113.688 277.961C114.115 277.477 114.62 277.107 115.203 276.852C115.792 276.596 116.438 276.469 117.141 276.469C117.849 276.469 118.495 276.596 119.078 276.852C119.667 277.107 120.172 277.477 120.594 277.961C121.021 278.44 121.349 279.021 121.578 279.703C121.812 280.385 121.93 281.159 121.93 282.023ZM119.758 282.609V282.008C119.758 281.388 119.701 280.844 119.586 280.375C119.471 279.901 119.299 279.503 119.07 279.18C118.846 278.857 118.573 278.615 118.25 278.453C117.927 278.286 117.557 278.203 117.141 278.203C116.729 278.203 116.362 278.286 116.039 278.453C115.716 278.615 115.443 278.857 115.219 279.18C114.995 279.503 114.823 279.901 114.703 280.375C114.589 280.844 114.531 281.388 114.531 282.008V282.609C114.531 283.224 114.589 283.768 114.703 284.242C114.823 284.716 114.995 285.117 115.219 285.445C115.448 285.768 115.724 286.013 116.047 286.18C116.375 286.346 116.745 286.43 117.156 286.43C117.573 286.43 117.943 286.346 118.266 286.18C118.589 286.013 118.859 285.768 119.078 285.445C119.302 285.117 119.471 284.716 119.586 284.242C119.701 283.768 119.758 283.224 119.758 282.609ZM130.992 286.312V288H125.273V286.312H130.992ZM125.922 276.625V288H123.773V276.625H125.922Z" fill="#003366"/>
<path d="M308.956 105.456C308.655 105.756 308.655 106.244 308.956 106.544L313.856 111.445C314.156 111.745 314.644 111.745 314.945 111.445C315.245 111.144 315.245 110.657 314.945 110.356L310.589 106L314.945 101.644C315.245 101.344 315.245 100.856 314.945 100.555C314.644 100.255 314.157 100.255 313.856 100.555L308.956 105.456ZM389.044 106.546C389.345 106.245 389.345 105.757 389.044 105.457L384.144 100.556C383.844 100.256 383.356 100.256 383.055 100.556C382.755 100.857 382.755 101.345 383.055 101.645L387.411 106.001L383.055 110.357C382.755 110.658 382.755 111.145 383.055 111.446C383.356 111.746 383.843 111.746 384.144 111.446L389.044 106.546ZM309.5 106.77L316.083 106.77L316.083 105.23L309.5 105.23L309.5 106.77ZM329.25 106.77L342.417 106.77L342.417 105.23L329.25 105.23L329.25 106.77ZM355.583 106.771L368.75 106.771L368.75 105.231L355.583 105.231L355.583 106.771ZM381.917 106.771L388.5 106.771L388.5 105.231L381.917 105.231L381.917 106.771ZM308.956 105.456C308.655 105.756 308.655 106.244 308.956 106.544L313.856 111.445C314.156 111.745 314.644 111.745 314.945 111.445C315.245 111.144 315.245 110.657 314.945 110.356L310.589 106L314.945 101.644C315.245 101.344 315.245 100.856 314.945 100.555C314.644 100.255 314.157 100.255 313.856 100.555L308.956 105.456ZM389.044 106.546C389.345 106.245 389.345 105.757 389.044 105.457L384.144 100.556C383.844 100.256 383.356 100.256 383.055 100.556C382.755 100.857 382.755 101.345 383.055 101.645L387.411 106.001L383.055 110.357C382.755 110.658 382.755 111.145 383.055 111.446C383.356 111.746 383.843 111.746 384.144 111.446L389.044 106.546ZM309.5 106.77L316.083 106.77L316.083 105.23L309.5 105.23L309.5 106.77ZM329.25 106.77L342.417 106.77L342.417 105.23L329.25 105.23L329.25 106.77ZM355.583 106.771L368.75 106.771L368.75 105.231L355.583 105.231L355.583 106.771ZM381.917 106.771L388.5 106.771L388.5 105.231L381.917 105.231L381.917 106.771Z" fill="#003366"/>
<path d="M308.956 254.456C308.655 254.756 308.655 255.244 308.956 255.544L313.856 260.445C314.156 260.745 314.644 260.745 314.945 260.445C315.245 260.144 315.245 259.657 314.945 259.356L310.589 255L314.945 250.644C315.245 250.344 315.245 249.856 314.945 249.555C314.644 249.255 314.157 249.255 313.856 249.555L308.956 254.456ZM389.044 255.546C389.345 255.245 389.345 254.757 389.044 254.457L384.144 249.556C383.844 249.256 383.356 249.256 383.055 249.556C382.755 249.857 382.755 250.345 383.055 250.645L387.411 255.001L383.055 259.357C382.755 259.658 382.755 260.145 383.055 260.446C383.356 260.746 383.843 260.746 384.144 260.446L389.044 255.546ZM309.5 255.77L316.083 255.77L316.083 254.23L309.5 254.23L309.5 255.77ZM329.25 255.77L342.417 255.77L342.417 254.23L329.25 254.23L329.25 255.77ZM355.583 255.771L368.75 255.771L368.75 254.231L355.583 254.231L355.583 255.771ZM381.917 255.771L388.5 255.771L388.5 254.231L381.917 254.231L381.917 255.771ZM308.956 254.456C308.655 254.756 308.655 255.244 308.956 255.544L313.856 260.445C314.156 260.745 314.644 260.745 314.945 260.445C315.245 260.144 315.245 259.657 314.945 259.356L310.589 255L314.945 250.644C315.245 250.344 315.245 249.856 314.945 249.555C314.644 249.255 314.157 249.255 313.856 249.555L308.956 254.456ZM389.044 255.546C389.345 255.245 389.345 254.757 389.044 254.457L384.144 249.556C383.844 249.256 383.356 249.256 383.055 249.556C382.755 249.857 382.755 250.345 383.055 250.645L387.411 255.001L383.055 259.357C382.755 259.658 382.755 260.145 383.055 260.446C383.356 260.746 383.843 260.746 384.144 260.446L389.044 255.546ZM309.5 255.77L316.083 255.77L316.083 254.23L309.5 254.23L309.5 255.77ZM329.25 255.77L342.417 255.77L342.417 254.23L329.25 254.23L329.25 255.77ZM355.583 255.771L368.75 255.771L368.75 254.231L355.583 254.231L355.583 255.771ZM381.917 255.771L388.5 255.771L388.5 254.231L381.917 254.231L381.917 255.771Z" fill="#003366"/>
<rect x="390" y="48.5" width="472" height="264" stroke="#D61A29"/>
<g filter="url(#filter2_i_6578_12666)">
<path d="M424.5 84H445.5C447.141 84 448.5 85.3594 448.5 87V100.5C448.5 102.188 447.141 103.5 445.5 103.5H437.25L437.719 105H441C441.797 105 442.5 105.703 442.5 106.5C442.5 107.344 441.797 108 441 108H429C428.156 108 427.5 107.344 427.5 106.5C427.5 105.703 428.156 105 429 105H432.234L432.75 103.5H424.5C422.812 103.5 421.5 102.188 421.5 100.5V87C421.5 85.3594 422.812 84 424.5 84ZM445.5 87H424.5V97.5H445.5V87Z" fill="#ED2232"/>
</g>
<path d="M429.961 258.855L425.32 273H421.582L427.922 255.938H430.301L429.961 258.855ZM433.816 273L429.164 258.855L428.789 255.938H431.191L437.566 273H433.816ZM433.605 266.648V269.402H424.594V266.648H433.605ZM446.426 270.234V255H449.824V273H446.766L446.426 270.234ZM438.41 266.812V266.566C438.41 265.598 438.52 264.719 438.738 263.93C438.957 263.133 439.277 262.449 439.699 261.879C440.121 261.309 440.641 260.867 441.258 260.555C441.875 260.242 442.578 260.086 443.367 260.086C444.109 260.086 444.758 260.242 445.312 260.555C445.875 260.867 446.352 261.312 446.742 261.891C447.141 262.461 447.461 263.137 447.703 263.918C447.945 264.691 448.121 265.539 448.23 266.461V267C448.121 267.883 447.945 268.703 447.703 269.461C447.461 270.219 447.141 270.883 446.742 271.453C446.352 272.016 445.875 272.453 445.312 272.766C444.75 273.078 444.094 273.234 443.344 273.234C442.555 273.234 441.852 273.074 441.234 272.754C440.625 272.434 440.109 271.984 439.688 271.406C439.273 270.828 438.957 270.148 438.738 269.367C438.52 268.586 438.41 267.734 438.41 266.812ZM441.785 266.566V266.812C441.785 267.336 441.824 267.824 441.902 268.277C441.988 268.73 442.125 269.133 442.312 269.484C442.508 269.828 442.758 270.098 443.062 270.293C443.375 270.48 443.754 270.574 444.199 270.574C444.777 270.574 445.254 270.445 445.629 270.188C446.004 269.922 446.289 269.559 446.484 269.098C446.688 268.637 446.805 268.105 446.836 267.504V265.969C446.812 265.477 446.742 265.035 446.625 264.645C446.516 264.246 446.352 263.906 446.133 263.625C445.922 263.344 445.656 263.125 445.336 262.969C445.023 262.812 444.652 262.734 444.223 262.734C443.785 262.734 443.41 262.836 443.098 263.039C442.785 263.234 442.531 263.504 442.336 263.848C442.148 264.191 442.008 264.598 441.914 265.066C441.828 265.527 441.785 266.027 441.785 266.566ZM455.836 262.945V273H452.449V260.32H455.625L455.836 262.945ZM455.367 266.215H454.43C454.43 265.332 454.535 264.52 454.746 263.777C454.965 263.027 455.281 262.379 455.695 261.832C456.117 261.277 456.637 260.848 457.254 260.543C457.871 260.238 458.586 260.086 459.398 260.086C459.961 260.086 460.477 260.172 460.945 260.344C461.414 260.508 461.816 260.77 462.152 261.129C462.496 261.48 462.762 261.941 462.949 262.512C463.137 263.074 463.23 263.75 463.23 264.539V273H459.855V264.914C459.855 264.336 459.777 263.891 459.621 263.578C459.465 263.266 459.242 263.047 458.953 262.922C458.672 262.797 458.332 262.734 457.934 262.734C457.496 262.734 457.113 262.824 456.785 263.004C456.465 263.184 456.199 263.434 455.988 263.754C455.777 264.066 455.621 264.434 455.52 264.855C455.418 265.277 455.367 265.73 455.367 266.215ZM462.914 265.828L461.707 265.98C461.707 265.152 461.809 264.383 462.012 263.672C462.223 262.961 462.531 262.336 462.938 261.797C463.352 261.258 463.863 260.84 464.473 260.543C465.082 260.238 465.785 260.086 466.582 260.086C467.191 260.086 467.746 260.176 468.246 260.355C468.746 260.527 469.172 260.805 469.523 261.188C469.883 261.562 470.156 262.055 470.344 262.664C470.539 263.273 470.637 264.02 470.637 264.902V273H467.25V264.902C467.25 264.316 467.172 263.871 467.016 263.566C466.867 263.254 466.648 263.039 466.359 262.922C466.078 262.797 465.742 262.734 465.352 262.734C464.945 262.734 464.59 262.816 464.285 262.98C463.98 263.137 463.727 263.355 463.523 263.637C463.32 263.918 463.168 264.246 463.066 264.621C462.965 264.988 462.914 265.391 462.914 265.828ZM476.812 260.32V273H473.426V260.32H476.812ZM473.215 257.016C473.215 256.523 473.387 256.117 473.73 255.797C474.074 255.477 474.535 255.316 475.113 255.316C475.684 255.316 476.141 255.477 476.484 255.797C476.836 256.117 477.012 256.523 477.012 257.016C477.012 257.508 476.836 257.914 476.484 258.234C476.141 258.555 475.684 258.715 475.113 258.715C474.535 258.715 474.074 258.555 473.73 258.234C473.387 257.914 473.215 257.508 473.215 257.016ZM482.906 263.027V273H479.531V260.32H482.695L482.906 263.027ZM482.414 266.215H481.5C481.5 265.277 481.621 264.434 481.863 263.684C482.105 262.926 482.445 262.281 482.883 261.75C483.32 261.211 483.84 260.801 484.441 260.52C485.051 260.23 485.73 260.086 486.48 260.086C487.074 260.086 487.617 260.172 488.109 260.344C488.602 260.516 489.023 260.789 489.375 261.164C489.734 261.539 490.008 262.035 490.195 262.652C490.391 263.27 490.488 264.023 490.488 264.914V273H487.09V264.902C487.09 264.34 487.012 263.902 486.855 263.59C486.699 263.277 486.469 263.059 486.164 262.934C485.867 262.801 485.5 262.734 485.062 262.734C484.609 262.734 484.215 262.824 483.879 263.004C483.551 263.184 483.277 263.434 483.059 263.754C482.848 264.066 482.688 264.434 482.578 264.855C482.469 265.277 482.414 265.73 482.414 266.215ZM496.617 260.32V273H493.23V260.32H496.617ZM493.02 257.016C493.02 256.523 493.191 256.117 493.535 255.797C493.879 255.477 494.34 255.316 494.918 255.316C495.488 255.316 495.945 255.477 496.289 255.797C496.641 256.117 496.816 256.523 496.816 257.016C496.816 257.508 496.641 257.914 496.289 258.234C495.945 258.555 495.488 258.715 494.918 258.715C494.34 258.715 493.879 258.555 493.535 258.234C493.191 257.914 493.02 257.508 493.02 257.016ZM506.262 269.496C506.262 269.254 506.191 269.035 506.051 268.84C505.91 268.645 505.648 268.465 505.266 268.301C504.891 268.129 504.348 267.973 503.637 267.832C502.996 267.691 502.398 267.516 501.844 267.305C501.297 267.086 500.82 266.824 500.414 266.52C500.016 266.215 499.703 265.855 499.477 265.441C499.25 265.02 499.137 264.539 499.137 264C499.137 263.469 499.25 262.969 499.477 262.5C499.711 262.031 500.043 261.617 500.473 261.258C500.91 260.891 501.441 260.605 502.066 260.402C502.699 260.191 503.41 260.086 504.199 260.086C505.301 260.086 506.246 260.262 507.035 260.613C507.832 260.965 508.441 261.449 508.863 262.066C509.293 262.676 509.508 263.371 509.508 264.152H506.133C506.133 263.824 506.062 263.531 505.922 263.273C505.789 263.008 505.578 262.801 505.289 262.652C505.008 262.496 504.641 262.418 504.188 262.418C503.812 262.418 503.488 262.484 503.215 262.617C502.941 262.742 502.73 262.914 502.582 263.133C502.441 263.344 502.371 263.578 502.371 263.836C502.371 264.031 502.41 264.207 502.488 264.363C502.574 264.512 502.711 264.648 502.898 264.773C503.086 264.898 503.328 265.016 503.625 265.125C503.93 265.227 504.305 265.32 504.75 265.406C505.664 265.594 506.48 265.84 507.199 266.145C507.918 266.441 508.488 266.848 508.91 267.363C509.332 267.871 509.543 268.539 509.543 269.367C509.543 269.93 509.418 270.445 509.168 270.914C508.918 271.383 508.559 271.793 508.09 272.145C507.621 272.488 507.059 272.758 506.402 272.953C505.754 273.141 505.023 273.234 504.211 273.234C503.031 273.234 502.031 273.023 501.211 272.602C500.398 272.18 499.781 271.645 499.359 270.996C498.945 270.34 498.738 269.668 498.738 268.98H501.938C501.953 269.441 502.07 269.812 502.289 270.094C502.516 270.375 502.801 270.578 503.145 270.703C503.496 270.828 503.875 270.891 504.281 270.891C504.719 270.891 505.082 270.832 505.371 270.715C505.66 270.59 505.879 270.426 506.027 270.223C506.184 270.012 506.262 269.77 506.262 269.496ZM517.945 260.32V262.711H510.562V260.32H517.945ZM512.391 257.191H515.766V269.18C515.766 269.547 515.812 269.828 515.906 270.023C516.008 270.219 516.156 270.355 516.352 270.434C516.547 270.504 516.793 270.539 517.09 270.539C517.301 270.539 517.488 270.531 517.652 270.516C517.824 270.492 517.969 270.469 518.086 270.445L518.098 272.93C517.809 273.023 517.496 273.098 517.16 273.152C516.824 273.207 516.453 273.234 516.047 273.234C515.305 273.234 514.656 273.113 514.102 272.871C513.555 272.621 513.133 272.223 512.836 271.676C512.539 271.129 512.391 270.41 512.391 269.52V257.191ZM523.242 263.086V273H519.867V260.32H523.043L523.242 263.086ZM527.062 260.238L527.004 263.367C526.84 263.344 526.641 263.324 526.406 263.309C526.18 263.285 525.973 263.273 525.785 263.273C525.309 263.273 524.895 263.336 524.543 263.461C524.199 263.578 523.91 263.754 523.676 263.988C523.449 264.223 523.277 264.508 523.16 264.844C523.051 265.18 522.988 265.562 522.973 265.992L522.293 265.781C522.293 264.961 522.375 264.207 522.539 263.52C522.703 262.824 522.941 262.219 523.254 261.703C523.574 261.188 523.965 260.789 524.426 260.508C524.887 260.227 525.414 260.086 526.008 260.086C526.195 260.086 526.387 260.102 526.582 260.133C526.777 260.156 526.938 260.191 527.062 260.238ZM535.102 270.141V264.492C535.102 264.086 535.035 263.738 534.902 263.449C534.77 263.152 534.562 262.922 534.281 262.758C534.008 262.594 533.652 262.512 533.215 262.512C532.84 262.512 532.516 262.578 532.242 262.711C531.969 262.836 531.758 263.02 531.609 263.262C531.461 263.496 531.387 263.773 531.387 264.094H528.012C528.012 263.555 528.137 263.043 528.387 262.559C528.637 262.074 529 261.648 529.477 261.281C529.953 260.906 530.52 260.613 531.176 260.402C531.84 260.191 532.582 260.086 533.402 260.086C534.387 260.086 535.262 260.25 536.027 260.578C536.793 260.906 537.395 261.398 537.832 262.055C538.277 262.711 538.5 263.531 538.5 264.516V269.941C538.5 270.637 538.543 271.207 538.629 271.652C538.715 272.09 538.84 272.473 539.004 272.801V273H535.594C535.43 272.656 535.305 272.227 535.219 271.711C535.141 271.188 535.102 270.664 535.102 270.141ZM535.547 265.277L535.57 267.188H533.684C533.238 267.188 532.852 267.238 532.523 267.34C532.195 267.441 531.926 267.586 531.715 267.773C531.504 267.953 531.348 268.164 531.246 268.406C531.152 268.648 531.105 268.914 531.105 269.203C531.105 269.492 531.172 269.754 531.305 269.988C531.438 270.215 531.629 270.395 531.879 270.527C532.129 270.652 532.422 270.715 532.758 270.715C533.266 270.715 533.707 270.613 534.082 270.41C534.457 270.207 534.746 269.957 534.949 269.66C535.16 269.363 535.27 269.082 535.277 268.816L536.168 270.246C536.043 270.566 535.871 270.898 535.652 271.242C535.441 271.586 535.172 271.91 534.844 272.215C534.516 272.512 534.121 272.758 533.66 272.953C533.199 273.141 532.652 273.234 532.02 273.234C531.215 273.234 530.484 273.074 529.828 272.754C529.18 272.426 528.664 271.977 528.281 271.406C527.906 270.828 527.719 270.172 527.719 269.438C527.719 268.773 527.844 268.184 528.094 267.668C528.344 267.152 528.711 266.719 529.195 266.367C529.688 266.008 530.301 265.738 531.035 265.559C531.77 265.371 532.621 265.277 533.59 265.277H535.547ZM547.312 260.32V262.711H539.93V260.32H547.312ZM541.758 257.191H545.133V269.18C545.133 269.547 545.18 269.828 545.273 270.023C545.375 270.219 545.523 270.355 545.719 270.434C545.914 270.504 546.16 270.539 546.457 270.539C546.668 270.539 546.855 270.531 547.02 270.516C547.191 270.492 547.336 270.469 547.453 270.445L547.465 272.93C547.176 273.023 546.863 273.098 546.527 273.152C546.191 273.207 545.82 273.234 545.414 273.234C544.672 273.234 544.023 273.113 543.469 272.871C542.922 272.621 542.5 272.223 542.203 271.676C541.906 271.129 541.758 270.41 541.758 269.52V257.191ZM552.797 260.32V273H549.41V260.32H552.797ZM549.199 257.016C549.199 256.523 549.371 256.117 549.715 255.797C550.059 255.477 550.52 255.316 551.098 255.316C551.668 255.316 552.125 255.477 552.469 255.797C552.82 256.117 552.996 256.523 552.996 257.016C552.996 257.508 552.82 257.914 552.469 258.234C552.125 258.555 551.668 258.715 551.098 258.715C550.52 258.715 550.059 258.555 549.715 258.234C549.371 257.914 549.199 257.508 549.199 257.016ZM555.047 266.789V266.543C555.047 265.613 555.18 264.758 555.445 263.977C555.711 263.188 556.098 262.504 556.605 261.926C557.113 261.348 557.738 260.898 558.48 260.578C559.223 260.25 560.074 260.086 561.035 260.086C561.996 260.086 562.852 260.25 563.602 260.578C564.352 260.898 564.98 261.348 565.488 261.926C566.004 262.504 566.395 263.188 566.66 263.977C566.926 264.758 567.059 265.613 567.059 266.543V266.789C567.059 267.711 566.926 268.566 566.66 269.355C566.395 270.137 566.004 270.82 565.488 271.406C564.98 271.984 564.355 272.434 563.613 272.754C562.871 273.074 562.02 273.234 561.059 273.234C560.098 273.234 559.242 273.074 558.492 272.754C557.75 272.434 557.121 271.984 556.605 271.406C556.098 270.82 555.711 270.137 555.445 269.355C555.18 268.566 555.047 267.711 555.047 266.789ZM558.422 266.543V266.789C558.422 267.32 558.469 267.816 558.562 268.277C558.656 268.738 558.805 269.145 559.008 269.496C559.219 269.84 559.492 270.109 559.828 270.305C560.164 270.5 560.574 270.598 561.059 270.598C561.527 270.598 561.93 270.5 562.266 270.305C562.602 270.109 562.871 269.84 563.074 269.496C563.277 269.145 563.426 268.738 563.52 268.277C563.621 267.816 563.672 267.32 563.672 266.789V266.543C563.672 266.027 563.621 265.543 563.52 265.09C563.426 264.629 563.273 264.223 563.062 263.871C562.859 263.512 562.59 263.23 562.254 263.027C561.918 262.824 561.512 262.723 561.035 262.723C560.559 262.723 560.152 262.824 559.816 263.027C559.488 263.23 559.219 263.512 559.008 263.871C558.805 264.223 558.656 264.629 558.562 265.09C558.469 265.543 558.422 266.027 558.422 266.543ZM572.438 263.027V273H569.062V260.32H572.227L572.438 263.027ZM571.945 266.215H571.031C571.031 265.277 571.152 264.434 571.395 263.684C571.637 262.926 571.977 262.281 572.414 261.75C572.852 261.211 573.371 260.801 573.973 260.52C574.582 260.23 575.262 260.086 576.012 260.086C576.605 260.086 577.148 260.172 577.641 260.344C578.133 260.516 578.555 260.789 578.906 261.164C579.266 261.539 579.539 262.035 579.727 262.652C579.922 263.27 580.02 264.023 580.02 264.914V273H576.621V264.902C576.621 264.34 576.543 263.902 576.387 263.59C576.23 263.277 576 263.059 575.695 262.934C575.398 262.801 575.031 262.734 574.594 262.734C574.141 262.734 573.746 262.824 573.41 263.004C573.082 263.184 572.809 263.434 572.59 263.754C572.379 264.066 572.219 264.434 572.109 264.855C572 265.277 571.945 265.73 571.945 266.215Z" fill="#ED2232"/>
<path d="M862.956 105.456C862.655 105.756 862.655 106.244 862.956 106.544L867.856 111.445C868.156 111.745 868.644 111.745 868.945 111.445C869.245 111.144 869.245 110.657 868.945 110.356L864.589 106L868.945 101.644C869.245 101.344 869.245 100.856 868.945 100.555C868.644 100.255 868.157 100.255 867.856 100.555L862.956 105.456ZM943.044 106.546C943.345 106.245 943.345 105.757 943.044 105.457L938.144 100.556C937.844 100.256 937.356 100.256 937.055 100.556C936.755 100.857 936.755 101.345 937.055 101.645L941.411 106.001L937.055 110.357C936.755 110.658 936.755 111.145 937.055 111.446C937.356 111.746 937.843 111.746 938.144 111.446L943.044 106.546ZM863.5 106.77L942.5 106.771L942.5 105.231L863.5 105.23L863.5 106.77Z" fill="#003366"/>
<path d="M862.956 254.456C862.655 254.756 862.655 255.244 862.956 255.544L867.856 260.445C868.156 260.745 868.644 260.745 868.945 260.445C869.245 260.144 869.245 259.657 868.945 259.356L864.589 255L868.945 250.644C869.245 250.344 869.245 249.856 868.945 249.555C868.644 249.255 868.157 249.255 867.856 249.555L862.956 254.456ZM943.044 255.546C943.345 255.245 943.345 254.757 943.044 254.457L938.144 249.556C937.844 249.256 937.356 249.256 937.055 249.556C936.755 249.857 936.755 250.345 937.055 250.645L941.411 255.001L937.055 259.357C936.755 259.658 936.755 260.145 937.055 260.446C937.356 260.746 937.843 260.746 938.144 260.446L943.044 255.546ZM863.5 255.77L942.5 255.771L942.5 254.231L863.5 254.23L863.5 255.77Z" fill="#003366"/>
<rect width="260.5" height="116" transform="translate(943.5 48)" fill="#003366"/>
<g filter="url(#filter3_i_6578_12666)">
<path d="M968.344 70.9375H970.031C970.488 70.9375 970.875 71.3242 970.875 71.7812V73.4688C970.875 73.9609 970.488 74.3125 970.031 74.3125V77.4062H972C972 76.9492 972.352 76.5625 972.844 76.5625H974.531C974.988 76.5625 975.375 76.9492 975.375 77.4062V79.0938C975.375 79.5859 974.988 79.9375 974.531 79.9375H972.844C972.352 79.9375 972 79.5859 972 79.0938H970.031V82.75C970.031 82.9258 970.137 83.0312 970.312 83.0312H972C972 82.5742 972.352 82.1875 972.844 82.1875H974.531C974.988 82.1875 975.375 82.5742 975.375 83.0312V84.7188C975.375 85.2109 974.988 85.5625 974.531 85.5625H972.844C972.352 85.5625 972 85.2109 972 84.7188H970.312C969.223 84.7188 968.344 83.8398 968.344 82.75V78.25V74.3125C967.852 74.3125 967.5 73.9609 967.5 73.4688V71.7812C967.5 71.3242 967.852 70.9375 968.344 70.9375Z" fill="#E7CF27"/>
</g>
<g filter="url(#filter4_i_6578_12666)">
<path d="M973.125 72.625C973.125 72.0273 973.617 71.5 974.25 71.5H984.375C984.973 71.5 985.5 72.0273 985.5 72.625C985.5 73.2578 984.973 73.75 984.375 73.75H974.25C973.617 73.75 973.125 73.2578 973.125 72.625ZM977.625 78.25C977.625 77.6523 978.117 77.125 978.75 77.125H984.375C984.973 77.125 985.5 77.6523 985.5 78.25C985.5 78.8828 984.973 79.375 984.375 79.375H978.75C978.117 79.375 977.625 78.8828 977.625 78.25ZM978.75 82.75H984.375C984.973 82.75 985.5 83.2773 985.5 83.875C985.5 84.5078 984.973 85 984.375 85H978.75C978.117 85 977.625 84.5078 977.625 83.875C977.625 83.2773 978.117 82.75 978.75 82.75Z" fill="#CCCCCC"/>
</g>
<path d="M975.242 135.258H977.391C977.333 136.018 977.122 136.693 976.758 137.281C976.393 137.865 975.885 138.323 975.234 138.656C974.583 138.99 973.794 139.156 972.867 139.156C972.154 139.156 971.51 139.031 970.938 138.781C970.37 138.526 969.883 138.164 969.477 137.695C969.076 137.221 968.768 136.654 968.555 135.992C968.341 135.326 968.234 134.578 968.234 133.75V132.883C968.234 132.055 968.344 131.307 968.562 130.641C968.781 129.974 969.094 129.406 969.5 128.938C969.911 128.464 970.404 128.099 970.977 127.844C971.555 127.589 972.201 127.461 972.914 127.461C973.841 127.461 974.625 127.633 975.266 127.977C975.906 128.315 976.404 128.781 976.758 129.375C977.112 129.969 977.326 130.651 977.398 131.422H975.25C975.208 130.943 975.104 130.536 974.938 130.203C974.776 129.87 974.531 129.617 974.203 129.445C973.88 129.268 973.451 129.18 972.914 129.18C972.497 129.18 972.13 129.258 971.812 129.414C971.5 129.57 971.24 129.805 971.031 130.117C970.823 130.424 970.667 130.81 970.562 131.273C970.458 131.732 970.406 132.263 970.406 132.867V133.75C970.406 134.328 970.453 134.846 970.547 135.305C970.641 135.763 970.786 136.151 970.984 136.469C971.182 136.786 971.438 137.029 971.75 137.195C972.062 137.362 972.435 137.445 972.867 137.445C973.393 137.445 973.82 137.362 974.148 137.195C974.482 137.029 974.734 136.784 974.906 136.461C975.083 136.138 975.195 135.737 975.242 135.258ZM983.555 137.203V133.305C983.555 133.018 983.505 132.771 983.406 132.562C983.307 132.354 983.156 132.193 982.953 132.078C982.75 131.964 982.492 131.906 982.18 131.906C981.904 131.906 981.661 131.953 981.453 132.047C981.25 132.141 981.094 132.273 980.984 132.445C980.875 132.612 980.82 132.805 980.82 133.023H978.75C978.75 132.674 978.833 132.344 979 132.031C979.167 131.714 979.404 131.432 979.711 131.188C980.023 130.938 980.396 130.742 980.828 130.602C981.266 130.461 981.755 130.391 982.297 130.391C982.938 130.391 983.508 130.5 984.008 130.719C984.513 130.932 984.909 131.255 985.195 131.688C985.487 132.12 985.633 132.664 985.633 133.32V137.008C985.633 137.43 985.659 137.792 985.711 138.094C985.768 138.391 985.852 138.648 985.961 138.867V139H983.859C983.76 138.786 983.685 138.516 983.633 138.188C983.581 137.854 983.555 137.526 983.555 137.203ZM983.844 133.852L983.859 135.078H982.555C982.232 135.078 981.948 135.112 981.703 135.18C981.458 135.242 981.258 135.336 981.102 135.461C980.945 135.581 980.828 135.727 980.75 135.898C980.672 136.065 980.633 136.255 980.633 136.469C980.633 136.677 980.68 136.865 980.773 137.031C980.872 137.198 981.013 137.331 981.195 137.43C981.383 137.523 981.602 137.57 981.852 137.57C982.216 137.57 982.534 137.497 982.805 137.352C983.076 137.201 983.286 137.018 983.438 136.805C983.589 136.591 983.669 136.388 983.68 136.195L984.273 137.086C984.201 137.299 984.091 137.526 983.945 137.766C983.799 138.005 983.612 138.229 983.383 138.438C983.154 138.646 982.878 138.818 982.555 138.953C982.232 139.089 981.857 139.156 981.43 139.156C980.883 139.156 980.393 139.047 979.961 138.828C979.529 138.609 979.188 138.31 978.938 137.93C978.688 137.549 978.562 137.117 978.562 136.633C978.562 136.185 978.646 135.789 978.812 135.445C978.979 135.102 979.227 134.812 979.555 134.578C979.883 134.339 980.289 134.159 980.773 134.039C981.263 133.914 981.823 133.852 982.453 133.852H983.844ZM991.492 130.547V132.031H986.648V130.547H991.492ZM987.945 128.469H990.016V136.562C990.016 136.812 990.049 137.005 990.117 137.141C990.185 137.276 990.286 137.367 990.422 137.414C990.557 137.461 990.719 137.484 990.906 137.484C991.042 137.484 991.167 137.477 991.281 137.461C991.396 137.445 991.492 137.43 991.57 137.414L991.578 138.961C991.406 139.018 991.211 139.065 990.992 139.102C990.779 139.138 990.536 139.156 990.266 139.156C989.802 139.156 989.396 139.078 989.047 138.922C988.698 138.76 988.427 138.503 988.234 138.148C988.042 137.789 987.945 137.315 987.945 136.727V128.469ZM997.523 137.203V133.305C997.523 133.018 997.474 132.771 997.375 132.562C997.276 132.354 997.125 132.193 996.922 132.078C996.719 131.964 996.461 131.906 996.148 131.906C995.872 131.906 995.63 131.953 995.422 132.047C995.219 132.141 995.062 132.273 994.953 132.445C994.844 132.612 994.789 132.805 994.789 133.023H992.719C992.719 132.674 992.802 132.344 992.969 132.031C993.135 131.714 993.372 131.432 993.68 131.188C993.992 130.938 994.365 130.742 994.797 130.602C995.234 130.461 995.724 130.391 996.266 130.391C996.906 130.391 997.477 130.5 997.977 130.719C998.482 130.932 998.878 131.255 999.164 131.688C999.456 132.12 999.602 132.664 999.602 133.32V137.008C999.602 137.43 999.628 137.792 999.68 138.094C999.737 138.391 999.82 138.648 999.93 138.867V139H997.828C997.729 138.786 997.654 138.516 997.602 138.188C997.549 137.854 997.523 137.526 997.523 137.203ZM997.812 133.852L997.828 135.078H996.523C996.201 135.078 995.917 135.112 995.672 135.18C995.427 135.242 995.227 135.336 995.07 135.461C994.914 135.581 994.797 135.727 994.719 135.898C994.641 136.065 994.602 136.255 994.602 136.469C994.602 136.677 994.648 136.865 994.742 137.031C994.841 137.198 994.982 137.331 995.164 137.43C995.352 137.523 995.57 137.57 995.82 137.57C996.185 137.57 996.503 137.497 996.773 137.352C997.044 137.201 997.255 137.018 997.406 136.805C997.557 136.591 997.638 136.388 997.648 136.195L998.242 137.086C998.169 137.299 998.06 137.526 997.914 137.766C997.768 138.005 997.581 138.229 997.352 138.438C997.122 138.646 996.846 138.818 996.523 138.953C996.201 139.089 995.826 139.156 995.398 139.156C994.852 139.156 994.362 139.047 993.93 138.828C993.497 138.609 993.156 138.31 992.906 137.93C992.656 137.549 992.531 137.117 992.531 136.633C992.531 136.185 992.615 135.789 992.781 135.445C992.948 135.102 993.195 134.812 993.523 134.578C993.852 134.339 994.258 134.159 994.742 134.039C995.232 133.914 995.792 133.852 996.422 133.852H997.812ZM1003.65 127V139H1001.58V127H1003.65ZM1005.25 134.859V134.695C1005.25 134.076 1005.34 133.505 1005.52 132.984C1005.69 132.458 1005.95 132.003 1006.29 131.617C1006.63 131.232 1007.04 130.932 1007.53 130.719C1008.02 130.5 1008.58 130.391 1009.2 130.391C1009.84 130.391 1010.4 130.5 1010.89 130.719C1011.39 130.932 1011.8 131.232 1012.14 131.617C1012.48 132.003 1012.74 132.458 1012.91 132.984C1013.09 133.505 1013.18 134.076 1013.18 134.695V134.859C1013.18 135.474 1013.09 136.044 1012.91 136.57C1012.74 137.091 1012.48 137.547 1012.14 137.938C1011.8 138.323 1011.39 138.622 1010.9 138.836C1010.41 139.049 1009.85 139.156 1009.22 139.156C1008.59 139.156 1008.03 139.049 1007.54 138.836C1007.04 138.622 1006.63 138.323 1006.29 137.938C1005.95 137.547 1005.69 137.091 1005.52 136.57C1005.34 136.044 1005.25 135.474 1005.25 134.859ZM1007.31 134.695V134.859C1007.31 135.229 1007.35 135.576 1007.42 135.898C1007.49 136.221 1007.61 136.505 1007.76 136.75C1007.91 136.995 1008.1 137.188 1008.34 137.328C1008.59 137.464 1008.88 137.531 1009.22 137.531C1009.55 137.531 1009.84 137.464 1010.08 137.328C1010.32 137.188 1010.51 136.995 1010.66 136.75C1010.82 136.505 1010.93 136.221 1011.01 135.898C1011.08 135.576 1011.12 135.229 1011.12 134.859V134.695C1011.12 134.331 1011.08 133.99 1011.01 133.672C1010.93 133.349 1010.82 133.065 1010.66 132.82C1010.51 132.57 1010.32 132.375 1010.07 132.234C1009.83 132.089 1009.54 132.016 1009.2 132.016C1008.87 132.016 1008.58 132.089 1008.34 132.234C1008.1 132.375 1007.91 132.57 1007.76 132.82C1007.61 133.065 1007.49 133.349 1007.42 133.672C1007.35 133.99 1007.31 134.331 1007.31 134.695ZM1020.05 130.547H1021.93V138.742C1021.93 139.508 1021.76 140.156 1021.43 140.688C1021.1 141.224 1020.64 141.63 1020.05 141.906C1019.45 142.188 1018.76 142.328 1017.98 142.328C1017.64 142.328 1017.27 142.281 1016.88 142.188C1016.48 142.094 1016.11 141.945 1015.74 141.742C1015.38 141.544 1015.08 141.286 1014.84 140.969L1015.77 139.75C1016.05 140.078 1016.37 140.326 1016.73 140.492C1017.08 140.664 1017.46 140.75 1017.88 140.75C1018.29 140.75 1018.65 140.672 1018.94 140.516C1019.23 140.365 1019.46 140.141 1019.62 139.844C1019.78 139.552 1019.86 139.193 1019.86 138.766V132.477L1020.05 130.547ZM1014.34 134.875V134.711C1014.34 134.065 1014.42 133.479 1014.58 132.953C1014.73 132.422 1014.96 131.966 1015.25 131.586C1015.55 131.206 1015.9 130.911 1016.32 130.703C1016.74 130.495 1017.22 130.391 1017.74 130.391C1018.3 130.391 1018.77 130.492 1019.15 130.695C1019.53 130.898 1019.85 131.188 1020.1 131.562C1020.36 131.938 1020.55 132.383 1020.7 132.898C1020.84 133.409 1020.95 133.971 1021.03 134.586V135.031C1020.96 135.63 1020.84 136.18 1020.68 136.68C1020.52 137.18 1020.32 137.617 1020.05 137.992C1019.79 138.362 1019.47 138.648 1019.09 138.852C1018.7 139.055 1018.25 139.156 1017.73 139.156C1017.21 139.156 1016.74 139.049 1016.32 138.836C1015.9 138.622 1015.55 138.323 1015.25 137.938C1014.96 137.552 1014.73 137.099 1014.58 136.578C1014.42 136.057 1014.34 135.49 1014.34 134.875ZM1016.41 134.711V134.875C1016.41 135.24 1016.44 135.581 1016.52 135.898C1016.59 136.216 1016.7 136.497 1016.85 136.742C1017 136.982 1017.19 137.169 1017.42 137.305C1017.65 137.44 1017.92 137.508 1018.24 137.508C1018.67 137.508 1019.02 137.419 1019.29 137.242C1019.57 137.06 1019.77 136.812 1019.91 136.5C1020.06 136.182 1020.15 135.826 1020.2 135.43V134.203C1020.17 133.891 1020.11 133.602 1020.02 133.336C1019.94 133.07 1019.82 132.841 1019.67 132.648C1019.52 132.456 1019.33 132.305 1019.09 132.195C1018.86 132.086 1018.58 132.031 1018.26 132.031C1017.95 132.031 1017.67 132.102 1017.44 132.242C1017.2 132.378 1017.01 132.568 1016.86 132.812C1016.71 133.057 1016.59 133.341 1016.52 133.664C1016.44 133.987 1016.41 134.336 1016.41 134.711ZM1028.82 136.992V130.547H1030.9V139H1028.95L1028.82 136.992ZM1029.09 135.242L1029.73 135.227C1029.73 135.794 1029.66 136.318 1029.54 136.797C1029.41 137.276 1029.22 137.693 1028.95 138.047C1028.69 138.396 1028.36 138.669 1027.96 138.867C1027.56 139.06 1027.09 139.156 1026.54 139.156C1026.12 139.156 1025.74 139.099 1025.4 138.984C1025.05 138.865 1024.76 138.68 1024.51 138.43C1024.26 138.174 1024.07 137.849 1023.94 137.453C1023.8 137.052 1023.73 136.57 1023.73 136.008V130.547H1025.8V136.023C1025.8 136.305 1025.83 136.539 1025.89 136.727C1025.96 136.914 1026.05 137.068 1026.16 137.188C1026.28 137.302 1026.42 137.385 1026.58 137.438C1026.74 137.484 1026.91 137.508 1027.09 137.508C1027.59 137.508 1027.99 137.409 1028.27 137.211C1028.57 137.008 1028.77 136.737 1028.9 136.398C1029.02 136.055 1029.09 135.669 1029.09 135.242ZM1036.52 139.156C1035.88 139.156 1035.31 139.052 1034.8 138.844C1034.29 138.635 1033.85 138.346 1033.49 137.977C1033.14 137.602 1032.86 137.167 1032.67 136.672C1032.48 136.172 1032.39 135.635 1032.39 135.062V134.75C1032.39 134.099 1032.48 133.508 1032.67 132.977C1032.86 132.44 1033.12 131.979 1033.47 131.594C1033.81 131.208 1034.22 130.911 1034.7 130.703C1035.18 130.495 1035.71 130.391 1036.29 130.391C1036.89 130.391 1037.42 130.492 1037.88 130.695C1038.33 130.893 1038.72 131.174 1039.02 131.539C1039.33 131.904 1039.56 132.341 1039.72 132.852C1039.88 133.357 1039.95 133.917 1039.95 134.531V135.398H1033.33V133.977H1037.92V133.82C1037.91 133.492 1037.85 133.193 1037.73 132.922C1037.62 132.646 1037.44 132.427 1037.2 132.266C1036.96 132.099 1036.65 132.016 1036.27 132.016C1035.97 132.016 1035.7 132.083 1035.47 132.219C1035.24 132.349 1035.06 132.536 1034.91 132.781C1034.76 133.021 1034.65 133.307 1034.58 133.641C1034.51 133.974 1034.47 134.344 1034.47 134.75V135.062C1034.47 135.417 1034.52 135.745 1034.61 136.047C1034.71 136.349 1034.85 136.612 1035.04 136.836C1035.23 137.055 1035.46 137.227 1035.73 137.352C1036 137.471 1036.3 137.531 1036.65 137.531C1037.08 137.531 1037.47 137.448 1037.82 137.281C1038.17 137.109 1038.48 136.857 1038.74 136.523L1039.78 137.602C1039.6 137.862 1039.36 138.112 1039.06 138.352C1038.77 138.591 1038.41 138.786 1037.98 138.938C1037.56 139.083 1037.08 139.156 1036.52 139.156Z" fill="white"/>
<rect width="260.5" height="116" transform="translate(943.5 197)" fill="#003366"/>
<g filter="url(#filter5_i_6578_12666)">
<path d="M968.344 219.938H970.031C970.488 219.938 970.875 220.324 970.875 220.781V222.469C970.875 222.961 970.488 223.312 970.031 223.312V226.406H972C972 225.949 972.352 225.562 972.844 225.562H974.531C974.988 225.562 975.375 225.949 975.375 226.406V228.094C975.375 228.586 974.988 228.938 974.531 228.938H972.844C972.352 228.938 972 228.586 972 228.094H970.031V231.75C970.031 231.926 970.137 232.031 970.312 232.031H972C972 231.574 972.352 231.188 972.844 231.188H974.531C974.988 231.188 975.375 231.574 975.375 232.031V233.719C975.375 234.211 974.988 234.562 974.531 234.562H972.844C972.352 234.562 972 234.211 972 233.719H970.312C969.223 233.719 968.344 232.84 968.344 231.75V227.25V223.312C967.852 223.312 967.5 222.961 967.5 222.469V220.781C967.5 220.324 967.852 219.938 968.344 219.938Z" fill="#EFD425"/>
</g>
<g filter="url(#filter6_i_6578_12666)">
<path d="M973.125 221.625C973.125 221.027 973.617 220.5 974.25 220.5H984.375C984.973 220.5 985.5 221.027 985.5 221.625C985.5 222.258 984.973 222.75 984.375 222.75H974.25C973.617 222.75 973.125 222.258 973.125 221.625ZM977.625 227.25C977.625 226.652 978.117 226.125 978.75 226.125H984.375C984.973 226.125 985.5 226.652 985.5 227.25C985.5 227.883 984.973 228.375 984.375 228.375H978.75C978.117 228.375 977.625 227.883 977.625 227.25ZM978.75 231.75H984.375C984.973 231.75 985.5 232.277 985.5 232.875C985.5 233.508 984.973 234 984.375 234H978.75C978.117 234 977.625 233.508 977.625 232.875C977.625 232.277 978.117 231.75 978.75 231.75Z" fill="#CCCCCC"/>
</g>
<path d="M977.727 276.625V288H975.57L970.734 280.109V288H968.586V276.625H970.734L975.586 284.523V276.625H977.727ZM982.062 276.625V288H979.914V276.625H982.062ZM988.891 276.625L984.328 282.172L981.719 284.961L981.336 282.875L983.148 280.523L986.258 276.625H988.891ZM986.5 288L982.961 282.672L984.5 281.281L989.055 288H986.5ZM999.016 282.023V282.609C999.016 283.469 998.901 284.242 998.672 284.93C998.443 285.612 998.117 286.193 997.695 286.672C997.273 287.151 996.771 287.518 996.188 287.773C995.604 288.029 994.956 288.156 994.242 288.156C993.539 288.156 992.893 288.029 992.305 287.773C991.721 287.518 991.216 287.151 990.789 286.672C990.362 286.193 990.031 285.612 989.797 284.93C989.562 284.242 989.445 283.469 989.445 282.609V282.023C989.445 281.159 989.562 280.385 989.797 279.703C990.031 279.021 990.359 278.44 990.781 277.961C991.203 277.477 991.706 277.107 992.289 276.852C992.878 276.596 993.523 276.469 994.227 276.469C994.94 276.469 995.589 276.596 996.172 276.852C996.755 277.107 997.258 277.477 997.68 277.961C998.107 278.44 998.435 279.021 998.664 279.703C998.898 280.385 999.016 281.159 999.016 282.023ZM996.844 282.609V282.008C996.844 281.388 996.786 280.844 996.672 280.375C996.557 279.901 996.388 279.503 996.164 279.18C995.94 278.857 995.664 278.615 995.336 278.453C995.008 278.286 994.638 278.203 994.227 278.203C993.81 278.203 993.44 278.286 993.117 278.453C992.799 278.615 992.529 278.857 992.305 279.18C992.081 279.503 991.909 279.901 991.789 280.375C991.674 280.844 991.617 281.388 991.617 282.008V282.609C991.617 283.224 991.674 283.768 991.789 284.242C991.909 284.716 992.081 285.117 992.305 285.445C992.534 285.768 992.81 286.013 993.133 286.18C993.456 286.346 993.826 286.43 994.242 286.43C994.659 286.43 995.029 286.346 995.352 286.18C995.674 286.013 995.945 285.768 996.164 285.445C996.388 285.117 996.557 284.716 996.672 284.242C996.786 283.768 996.844 283.224 996.844 282.609ZM1004.23 288H1001.78L1001.8 286.312H1004.23C1004.9 286.312 1005.45 286.167 1005.9 285.875C1006.35 285.578 1006.68 285.154 1006.91 284.602C1007.14 284.044 1007.26 283.378 1007.26 282.602V282.016C1007.26 281.417 1007.19 280.888 1007.06 280.43C1006.93 279.971 1006.74 279.586 1006.48 279.273C1006.23 278.961 1005.92 278.724 1005.55 278.562C1005.18 278.401 1004.76 278.32 1004.28 278.32H1001.73V276.625H1004.28C1005.04 276.625 1005.73 276.753 1006.36 277.008C1006.99 277.263 1007.53 277.63 1007.99 278.109C1008.46 278.583 1008.81 279.151 1009.05 279.812C1009.3 280.474 1009.43 281.214 1009.43 282.031V282.602C1009.43 283.414 1009.3 284.154 1009.05 284.82C1008.81 285.482 1008.46 286.049 1007.99 286.523C1007.53 286.997 1006.99 287.362 1006.35 287.617C1005.72 287.872 1005.01 288 1004.23 288ZM1002.98 276.625V288H1000.84V276.625H1002.98Z" fill="white"/>
<defs>
<filter id="filter0_i_6578_12666" x="72" y="72" width="16" height="18" filterUnits="userSpaceOnUse" color-interpolation-filters="sRGB">
<feFlood flood-opacity="0" result="BackgroundImageFix"/>
<feBlend mode="normal" in="SourceGraphic" in2="BackgroundImageFix" result="shape"/>
<feColorMatrix in="SourceAlpha" type="matrix" values="0 0 0 0 0 0 0 0 0 0 0 0 0 0 0 0 0 0 127 0" result="hardAlpha"/>
<feOffset dy="4"/>
<feGaussianBlur stdDeviation="2"/>
<feComposite in2="hardAlpha" operator="arithmetic" k2="-1" k3="1"/>
<feColorMatrix type="matrix" values="0 0 0 0 0 0 0 0 0 0.2 0 0 0 0 0.4 0 0 0 0.1 0"/>
<feBlend mode="normal" in2="shape" result="effect1_innerShadow_6578_12666"/>
</filter>
<filter id="filter1_i_6578_12666" x="72" y="221.25" width="15.75" height="22" filterUnits="userSpaceOnUse" color-interpolation-filters="sRGB">
<feFlood flood-opacity="0" result="BackgroundImageFix"/>
<feBlend mode="normal" in="SourceGraphic" in2="BackgroundImageFix" result="shape"/>
<feColorMatrix in="SourceAlpha" type="matrix" values="0 0 0 0 0 0 0 0 0 0 0 0 0 0 0 0 0 0 127 0" result="hardAlpha"/>
<feOffset dy="4"/>
<feGaussianBlur stdDeviation="2"/>
<feComposite in2="hardAlpha" operator="arithmetic" k2="-1" k3="1"/>
<feColorMatrix type="matrix" values="0 0 0 0 0 0 0 0 0 0.2 0 0 0 0 0.4 0 0 0 0.1 0"/>
<feBlend mode="normal" in2="shape" result="effect1_innerShadow_6578_12666"/>
</filter>
<filter id="filter2_i_6578_12666" x="421.5" y="84" width="27" height="28" filterUnits="userSpaceOnUse" color-interpolation-filters="sRGB">
<feFlood flood-opacity="0" result="BackgroundImageFix"/>
<feBlend mode="normal" in="SourceGraphic" in2="BackgroundImageFix" result="shape"/>
<feColorMatrix in="SourceAlpha" type="matrix" values="0 0 0 0 0 0 0 0 0 0 0 0 0 0 0 0 0 0 127 0" result="hardAlpha"/>
<feOffset dy="4"/>
<feGaussianBlur stdDeviation="2"/>
<feComposite in2="hardAlpha" operator="arithmetic" k2="-1" k3="1"/>
<feColorMatrix type="matrix" values="0 0 0 0 0 0 0 0 0 0.2 0 0 0 0 0.4 0 0 0 0.1 0"/>
<feBlend mode="normal" in2="shape" result="effect1_innerShadow_6578_12666"/>
</filter>
<filter id="filter3_i_6578_12666" x="967.5" y="70.9375" width="7.875" height="18.625" filterUnits="userSpaceOnUse" color-interpolation-filters="sRGB">
<feFlood flood-opacity="0" result="BackgroundImageFix"/>
<feBlend mode="normal" in="SourceGraphic" in2="BackgroundImageFix" result="shape"/>
<feColorMatrix in="SourceAlpha" type="matrix" values="0 0 0 0 0 0 0 0 0 0 0 0 0 0 0 0 0 0 127 0" result="hardAlpha"/>
<feOffset dy="4"/>
<feGaussianBlur stdDeviation="2"/>
<feComposite in2="hardAlpha" operator="arithmetic" k2="-1" k3="1"/>
<feColorMatrix type="matrix" values="0 0 0 0 0 0 0 0 0 0.2 0 0 0 0 0.4 0 0 0 0.1 0"/>
<feBlend mode="normal" in2="shape" result="effect1_innerShadow_6578_12666"/>
</filter>
<filter id="filter4_i_6578_12666" x="973.125" y="71.5" width="12.375" height="17.5" filterUnits="userSpaceOnUse" color-interpolation-filters="sRGB">
<feFlood flood-opacity="0" result="BackgroundImageFix"/>
<feBlend mode="normal" in="SourceGraphic" in2="BackgroundImageFix" result="shape"/>
<feColorMatrix in="SourceAlpha" type="matrix" values="0 0 0 0 0 0 0 0 0 0 0 0 0 0 0 0 0 0 127 0" result="hardAlpha"/>
<feOffset dy="4"/>
<feGaussianBlur stdDeviation="2"/>
<feComposite in2="hardAlpha" operator="arithmetic" k2="-1" k3="1"/>
<feColorMatrix type="matrix" values="0 0 0 0 0 0 0 0 0 0.2 0 0 0 0 0.4 0 0 0 0.1 0"/>
<feBlend mode="normal" in2="shape" result="effect1_innerShadow_6578_12666"/>
</filter>
<filter id="filter5_i_6578_12666" x="967.5" y="219.938" width="7.875" height="18.625" filterUnits="userSpaceOnUse" color-interpolation-filters="sRGB">
<feFlood flood-opacity="0" result="BackgroundImageFix"/>
<feBlend mode="normal" in="SourceGraphic" in2="BackgroundImageFix" result="shape"/>
<feColorMatrix in="SourceAlpha" type="matrix" values="0 0 0 0 0 0 0 0 0 0 0 0 0 0 0 0 0 0 127 0" result="hardAlpha"/>
<feOffset dy="4"/>
<feGaussianBlur stdDeviation="2"/>
<feComposite in2="hardAlpha" operator="arithmetic" k2="-1" k3="1"/>
<feColorMatrix type="matrix" values="0 0 0 0 0 0 0 0 0 0.2 0 0 0 0 0.4 0 0 0 0.1 0"/>
<feBlend mode="normal" in2="shape" result="effect1_innerShadow_6578_12666"/>
</filter>
<filter id="filter6_i_6578_12666" x="973.125" y="220.5" width="12.375" height="17.5" filterUnits="userSpaceOnUse" color-interpolation-filters="sRGB">
<feFlood flood-opacity="0" result="BackgroundImageFix"/>
<feBlend mode="normal" in="SourceGraphic" in2="BackgroundImageFix" result="shape"/>
<feColorMatrix in="SourceAlpha" type="matrix" values="0 0 0 0 0 0 0 0 0 0 0 0 0 0 0 0 0 0 127 0" result="hardAlpha"/>
<feOffset dy="4"/>
<feGaussianBlur stdDeviation="2"/>
<feComposite in2="hardAlpha" operator="arithmetic" k2="-1" k3="1"/>
<feColorMatrix type="matrix" values="0 0 0 0 0 0 0 0 0 0.2 0 0 0 0 0.4 0 0 0 0.1 0"/>
<feBlend mode="normal" in2="shape" result="effect1_innerShadow_6578_12666"/>
</filter>
</defs>
</svg>
