<?xml version="1.0" encoding="utf-8"?>
<svg width="20" height="20" viewBox="0 0 20 20" fill="none" xmlns="http://www.w3.org/2000/svg">
  <line x1="2.539" y1="2.539" x2="17.597" y2="17.596" stroke="#003366" stroke-width="2" stroke-linecap="square" style=""/>
  <line x1="17.596" y1="2.539" x2="2.539" y2="17.597" stroke="#003366" stroke-width="2" stroke-linecap="square" style=""/>
</svg>