<svg width="114" height="45" viewBox="0 0 114 45" fill="none" xmlns="http://www.w3.org/2000/svg">
<g clip-path="url(#clip0_5440_21539)">
<mask id="mask0_5440_21539" style="mask-type:luminance" maskUnits="userSpaceOnUse" x="0" y="0" width="114" height="45">
<path d="M0 1.20674e-06H114V45H0V1.20674e-06Z" fill="white"/>
</mask>
<g mask="url(#mask0_5440_21539)">
<path d="M19.9343 36.2083C16.0699 36.2083 14.0558 32.8155 14.0558 27.7261C14.0558 22.6367 16.0699 19.1891 19.9343 19.1891C23.7987 19.1891 25.8671 22.6367 25.8671 27.7261C25.8671 32.8155 23.7987 36.2083 19.9343 36.2083ZM19.9888 42.5469C28.9656 42.5469 34.836 36.1535 34.836 27.7261C34.836 19.2985 28.9656 12.9051 19.9888 12.9051C11.0661 12.9051 5.08691 19.2985 5.08691 27.7261C5.08691 36.1535 11.0661 42.5469 19.9888 42.5469ZM37.8343 41.6717H46.6945V13.6709H37.8343V41.6717ZM37.8343 9.78021H46.6945V2.56646H37.8343V9.78021ZM64.4825 42.5469C72.3704 42.5469 77.4838 37.5194 77.7013 31.0643H69.2152C68.8344 34.2384 67.1481 35.8801 64.3737 35.8801C60.5658 35.8801 58.662 32.7061 58.662 27.7261C58.662 22.6367 60.5658 19.4625 64.3737 19.4625C66.876 19.4625 68.3992 21.1044 68.9434 23.6217H77.4838C76.6678 17.3314 71.8263 12.9051 64.2649 12.9051C55.4549 12.9051 49.693 19.2985 49.693 27.7261C49.693 36.1533 55.5092 42.5469 64.4825 42.5469Z" fill="url(#paint0_linear_5440_21539)" fill-opacity="0.4"/>
<path d="M91.572 42C93.9655 42 95.6519 41.7814 96.4134 41.5628V35.0596C96.0871 35.0596 95.2166 35.1142 94.4551 35.1142C92.5512 35.1142 91.3544 34.5671 91.3544 32.378V19.2438H96.4134V13.671H91.3544V4.80924H82.7118V13.671H79.0127V19.2438H82.7118V34.2935C82.7118 40.3059 86.4079 42 91.572 42ZM99.7925 41.6718H109.088V32.4886H99.7925V41.6718Z" fill="url(#paint1_linear_5440_21539)" fill-opacity="0.4"/>
</g>
</g>
<defs>
<linearGradient id="paint0_linear_5440_21539" x1="77.8829" y1="42.5469" x2="44.1442" y2="-18.8842" gradientUnits="userSpaceOnUse">
<stop stop-color="#96AAB7"/>
<stop offset="1" stop-color="#728896"/>
</linearGradient>
<linearGradient id="paint1_linear_5440_21539" x1="109.163" y1="42" x2="72.7764" y2="12.5018" gradientUnits="userSpaceOnUse">
<stop stop-color="#96AAB7"/>
<stop offset="1" stop-color="#728896"/>
</linearGradient>
<clipPath id="clip0_5440_21539">
<rect width="114" height="45" fill="white"/>
</clipPath>
</defs>
</svg>
