<svg width="65" height="64" viewBox="0 0 65 64" fill="none" xmlns="http://www.w3.org/2000/svg">
<g filter="url(#filter0_i_363_10756)">
<path d="M0.5 32C0.5 14.375 14.75 0 32.5 0C50.125 0 64.5 14.375 64.5 32C64.5 49.75 50.125 64 32.5 64C14.75 64 0.5 49.75 0.5 32ZM20.375 48.625C21.875 43.75 26.625 40 32.5 40C38.25 40 43 43.75 44.5 48.625C44.875 49.75 46 50.25 47 50C48.125 49.625 48.625 48.5 48.375 47.5C46.25 40.875 39.875 36 32.5 36C25 36 18.625 40.875 16.5 47.5C16.25 48.5 16.75 49.625 17.875 50C18.875 50.25 20 49.75 20.375 48.625ZM22.5 22C20.25 22 18.5 23.875 18.5 26C18.5 28.25 20.25 30 22.5 30C24.75 30 26.5 28.25 26.5 26C26.5 23.875 24.75 22 22.5 22ZM42.5 30C44.75 30 46.5 28.25 46.5 26C46.5 23.875 44.75 22 42.5 22C40.25 22 38.5 23.875 38.5 26C38.5 28.25 40.25 30 42.5 30Z" fill="url(#paint0_linear_363_10756)" fill-opacity="0.4"/>
</g>
<defs>
<filter id="filter0_i_363_10756" x="0.5" y="0" width="64" height="68" filterUnits="userSpaceOnUse" color-interpolation-filters="sRGB">
<feFlood flood-opacity="0" result="BackgroundImageFix"/>
<feBlend mode="normal" in="SourceGraphic" in2="BackgroundImageFix" result="shape"/>
<feColorMatrix in="SourceAlpha" type="matrix" values="0 0 0 0 0 0 0 0 0 0 0 0 0 0 0 0 0 0 127 0" result="hardAlpha"/>
<feOffset dy="4"/>
<feGaussianBlur stdDeviation="2"/>
<feComposite in2="hardAlpha" operator="arithmetic" k2="-1" k3="1"/>
<feColorMatrix type="matrix" values="0 0 0 0 0 0 0 0 0 0.2 0 0 0 0 0.4 0 0 0 0.1 0"/>
<feBlend mode="normal" in2="shape" result="effect1_innerShadow_363_10756"/>
</filter>
<linearGradient id="paint0_linear_363_10756" x1="64.66" y1="7.63142e-07" x2="0.660202" y2="64.1598" gradientUnits="userSpaceOnUse">
<stop stop-color="#96AAB7"/>
<stop offset="1" stop-color="#728896"/>
</linearGradient>
</defs>
</svg>
