<?xml version="1.0" encoding="UTF-8"?>
<svg id="barva" xmlns="http://www.w3.org/2000/svg" viewBox="0 0 500 500">
  <defs>
    <style>
      .cls-1 {
        fill: #000dff;
      }
    </style>
  </defs>
  <path class="cls-1" d="M154.55,173c29.02,0,52.54-30.57,52.54-68.3s-23.52-68.3-52.54-68.3-52.53,30.57-52.53,68.3,23.52,68.3,52.53,68.3"/>
  <polygon class="cls-1" points="285.61 112.42 295.36 154.85 442.37 138.65 425.54 65.42 285.61 112.42"/>
  <path class="cls-1" d="M351.98,290.12c0,56.35-43,100.81-104.17,100.82h-.02c-61.17,0-104.17-44.47-104.17-100.82l.19-29.7H57.63v20.75c0,100.72,78.44,182.36,190.08,182.41h.25c111.61-.08,190.02-81.72,190.02-182.41v-20.75h-86.19s.19,29.7,.19,29.7Z"/>
</svg>
