<?xml version="1.0" encoding="utf-8"?>
<svg width="32px" height="32" viewBox="0 0 32 32" fill="none" xmlns="http://www.w3.org/2000/svg">
  <g filter="url(#filter0_i_767_10408)" transform="matrix(1, 0, 0, 1, 1.525844, -0.051429)">
    <path d="M25.0469 9.34375C26.2656 8.07812 26.5938 6.01562 26.4531 4.09375C25.0938 4 22.7031 4.09375 21.1562 5.5C19.4219 7.23438 19.75 10.375 19.7969 10.75C21.7188 10.8906 23.7812 10.5625 25.0469 9.34375ZM23.0312 11.9688C21.0156 12.4375 19.6094 12.25 18.4844 12.1562C18.4375 11.8281 17.9219 9.71875 18.5312 7.42188C17.9219 5.92188 16.6094 4.79688 16.375 4.65625C15.0625 5.78125 13.9844 7.28125 13.9375 8.82812C13.9844 10.1406 14.8281 11.4531 15.8594 12.5312L13.8906 14.4531C13.9844 14.2188 14.0312 13.8906 14.0312 13.6094C14.0312 11.4062 11.875 9.625 11.5938 9.39062C10.2812 10.5625 9.20312 11.9688 9.20312 13.6094C9.20312 14.9219 10.0469 16.2344 11.0781 17.3125L9.15625 19.2344C9.20312 18.9531 9.25 18.6719 9.29688 18.3906C9.25 16.1875 7.09375 14.4531 6.8125 14.1719C5.5 15.2969 4.42188 16.7969 4.375 18.3906C4.42188 19.7031 5.26562 21.0156 6.29688 22.0938L2.92188 25.4688C2.3125 26.0312 2.3125 27.0156 2.92188 27.5781C3.48438 28.1875 4.46875 28.1875 5.03125 27.5781L8.40625 24.2031C9.48438 25.2812 10.7969 26.0781 12.1562 26.125C13.7031 26.0781 15.2031 24.9531 16.3281 23.6875C15.5312 22.75 13.9844 21.2969 12.1562 21.2969C11.8281 21.2969 11.5469 21.3438 11.2656 21.3906L13.1875 19.4688C14.2656 20.5469 15.5312 21.3438 16.9375 21.3906C18.4844 21.3438 19.9844 20.2188 21.1094 18.9531C20.3594 18.0156 18.7656 16.5625 16.9375 16.5156C16.6094 16.5156 16.3281 16.5625 16.0469 16.6094L17.9688 14.6875C19.0469 15.7656 20.3125 16.5625 21.6719 16.6094C23.2656 16.5625 24.7656 15.4375 25.8906 14.1719C25.2812 13.4219 24.25 12.4375 23.0312 11.9688Z" fill="url(#paint0_linear_767_10408)" fill-opacity="0.4"/>
  </g>
  <defs>
    <filter id="filter0_i_767_10408" x="2.3125" y="4" width="24.2812" height="28.1875" filterUnits="userSpaceOnUse" color-interpolation-filters="sRGB">
      <feFlood flood-opacity="0" result="BackgroundImageFix"/>
      <feBlend mode="normal" in="SourceGraphic" in2="BackgroundImageFix" result="shape"/>
      <feColorMatrix in="SourceAlpha" type="matrix" values="0 0 0 0 0 0 0 0 0 0 0 0 0 0 0 0 0 0 127 0" result="hardAlpha"/>
      <feOffset dy="4"/>
      <feGaussianBlur stdDeviation="2"/>
      <feComposite in2="hardAlpha" operator="arithmetic" k2="-1" k3="1"/>
      <feColorMatrix type="matrix" values="0 0 0 0 0 0 0 0 0 0.2 0 0 0 0 0.4 0 0 0 0.1 0"/>
      <feBlend mode="normal" in2="shape" result="effect1_innerShadow_767_10408"/>
    </filter>
    <linearGradient id="paint0_linear_767_10408" x1="26.56" y1="2" x2="-1.12107" y2="25.786" gradientUnits="userSpaceOnUse">
      <stop stop-color="#96AAB7"/>
      <stop offset="1" stop-color="#728896"/>
    </linearGradient>
  </defs>
</svg>