<svg width="343" height="707" viewBox="0 0 343 707" fill="none" xmlns="http://www.w3.org/2000/svg">
<rect width="343" height="707" fill="white"/>
<rect x="25" y="33" width="293" height="98" stroke="#5C7499" stroke-opacity="0.48" stroke-width="2" stroke-dasharray="14 14"/>
<g filter="url(#filter0_i_6578_12715)">
<path d="M50 56H62C63.0938 56 64 56.9062 64 58V60C64 61.125 63.0938 62 62 62H50C48.875 62 48 61.125 48 60V58C48 56.9062 48.875 56 50 56ZM58.75 58.25C58.3125 58.25 58 58.5938 58 59C58 59.4375 58.3125 59.75 58.75 59.75C59.1562 59.75 59.5 59.4375 59.5 59C59.5 58.5938 59.1562 58.25 58.75 58.25ZM60.25 59C60.25 59.4375 60.5625 59.75 61 59.75C61.4062 59.75 61.75 59.4375 61.75 59C61.75 58.5938 61.4062 58.25 61 58.25C60.5625 58.25 60.25 58.5938 60.25 59ZM50 64H62C63.0938 64 64 64.9062 64 66V68C64 69.125 63.0938 70 62 70H50C48.875 70 48 69.125 48 68V66C48 64.9062 48.875 64 50 64ZM58.75 66.25C58.3125 66.25 58 66.5938 58 67C58 67.4375 58.3125 67.75 58.75 67.75C59.1562 67.75 59.5 67.4375 59.5 67C59.5 66.5938 59.1562 66.25 58.75 66.25ZM60.5 67C60.5 67.4375 60.8125 67.75 61.25 67.75C61.6562 67.75 62 67.4375 62 67C62 66.5938 61.6562 66.25 61.25 66.25C60.8125 66.25 60.5 66.5938 60.5 67Z" fill="#5C7499"/>
</g>
<path d="M51.3594 91.625V103H49.0156V91.625H51.3594ZM55.8906 96.4844V98.3125H50.7188V96.4844H55.8906ZM56.4375 91.625V93.4609H50.7188V91.625H56.4375ZM63.0391 91.625V103H60.7031V91.625H63.0391ZM66.5391 91.625V93.4609H57.2578V91.625H66.5391ZM72.3047 98.9453H69.4062V97.1172H72.3047C72.7526 97.1172 73.1172 97.0443 73.3984 96.8984C73.6797 96.7474 73.8854 96.5391 74.0156 96.2734C74.1458 96.0078 74.2109 95.7083 74.2109 95.375C74.2109 95.0365 74.1458 94.7214 74.0156 94.4297C73.8854 94.138 73.6797 93.9036 73.3984 93.7266C73.1172 93.5495 72.7526 93.4609 72.3047 93.4609H70.2188V103H67.875V91.625H72.3047C73.1953 91.625 73.9583 91.7865 74.5938 92.1094C75.2344 92.4271 75.724 92.8672 76.0625 93.4297C76.401 93.9922 76.5703 94.6354 76.5703 95.3594C76.5703 96.0938 76.401 96.7292 76.0625 97.2656C75.724 97.8021 75.2344 98.2161 74.5938 98.5078C73.9583 98.7995 73.1953 98.9453 72.3047 98.9453Z" fill="#003366"/>
<rect x="25" y="154" width="293" height="98" stroke="#5C7499" stroke-opacity="0.48" stroke-width="2" stroke-dasharray="14 14"/>
<g filter="url(#filter1_i_6578_12715)">
<path d="M63.75 180.062V181.75C63.75 183.332 60.1992 184.562 55.875 184.562C51.5156 184.562 48 183.332 48 181.75V180.062C48 178.516 51.5156 177.25 55.875 177.25C60.1992 177.25 63.75 178.516 63.75 180.062ZM61.8164 184.809C62.5547 184.562 63.2227 184.211 63.75 183.824V187.375C63.75 188.957 60.1992 190.188 55.875 190.188C51.5156 190.188 48 188.957 48 187.375V183.824C48.4922 184.211 49.1953 184.562 49.8984 184.809C51.4805 185.371 53.5898 185.688 55.875 185.688C58.125 185.688 60.2344 185.371 61.8164 184.809ZM48 189.449C48.4922 189.836 49.1953 190.188 49.8984 190.434C51.4805 190.996 53.5898 191.312 55.875 191.312C58.125 191.312 60.2344 190.996 61.8164 190.434C62.5547 190.188 63.2227 189.836 63.75 189.449V192.438C63.75 194.02 60.1992 195.25 55.875 195.25C51.5156 195.25 48 194.02 48 192.438V189.449Z" fill="#5C7499"/>
</g>
<path d="M55.0391 225.047C55.0391 224.828 55.0052 224.633 54.9375 224.461C54.875 224.284 54.7578 224.125 54.5859 223.984C54.4193 223.839 54.1823 223.698 53.875 223.562C53.5729 223.422 53.1823 223.276 52.7031 223.125C52.1719 222.958 51.6771 222.771 51.2188 222.562C50.7604 222.354 50.3568 222.112 50.0078 221.836C49.6641 221.56 49.3958 221.242 49.2031 220.883C49.0104 220.518 48.9141 220.096 48.9141 219.617C48.9141 219.148 49.013 218.721 49.2109 218.336C49.4141 217.951 49.7005 217.62 50.0703 217.344C50.4401 217.062 50.875 216.846 51.375 216.695C51.8802 216.544 52.4375 216.469 53.0469 216.469C53.8906 216.469 54.6198 216.622 55.2344 216.93C55.8542 217.237 56.3333 217.654 56.6719 218.18C57.0104 218.706 57.1797 219.297 57.1797 219.953H55.0391C55.0391 219.599 54.9635 219.286 54.8125 219.016C54.6667 218.745 54.4427 218.531 54.1406 218.375C53.8438 218.219 53.4688 218.141 53.0156 218.141C52.5781 218.141 52.2135 218.206 51.9219 218.336C51.6354 218.466 51.4193 218.643 51.2734 218.867C51.1328 219.091 51.0625 219.341 51.0625 219.617C51.0625 219.826 51.112 220.013 51.2109 220.18C51.3099 220.341 51.4583 220.495 51.6562 220.641C51.8542 220.781 52.099 220.914 52.3906 221.039C52.6875 221.159 53.0312 221.279 53.4219 221.398C54.0469 221.586 54.5938 221.794 55.0625 222.023C55.5365 222.253 55.9297 222.513 56.2422 222.805C56.5599 223.096 56.7969 223.424 56.9531 223.789C57.1146 224.154 57.1953 224.568 57.1953 225.031C57.1953 225.521 57.099 225.958 56.9062 226.344C56.7135 226.729 56.4375 227.057 56.0781 227.328C55.7188 227.599 55.2865 227.805 54.7812 227.945C54.2812 228.086 53.7214 228.156 53.1016 228.156C52.5495 228.156 52.0026 228.083 51.4609 227.938C50.9245 227.786 50.4375 227.562 50 227.266C49.5625 226.964 49.2135 226.583 48.9531 226.125C48.6927 225.661 48.5625 225.12 48.5625 224.5H50.7188C50.7188 224.859 50.776 225.167 50.8906 225.422C51.0104 225.672 51.1771 225.878 51.3906 226.039C51.6094 226.195 51.8646 226.31 52.1562 226.383C52.4479 226.456 52.763 226.492 53.1016 226.492C53.5391 226.492 53.8984 226.432 54.1797 226.312C54.4661 226.188 54.6797 226.016 54.8203 225.797C54.9661 225.578 55.0391 225.328 55.0391 225.047ZM63.2266 223.852H60.2969V222.164H63.2266C63.7057 222.164 64.0938 222.086 64.3906 221.93C64.6927 221.768 64.9141 221.549 65.0547 221.273C65.1953 220.992 65.2656 220.672 65.2656 220.312C65.2656 219.964 65.1953 219.638 65.0547 219.336C64.9141 219.034 64.6927 218.789 64.3906 218.602C64.0938 218.414 63.7057 218.32 63.2266 218.32H61V228H58.8516V216.625H63.2266C64.112 216.625 64.8672 216.784 65.4922 217.102C66.1224 217.414 66.6016 217.849 66.9297 218.406C67.263 218.958 67.4297 219.589 67.4297 220.297C67.4297 221.031 67.263 221.664 66.9297 222.195C66.6016 222.727 66.1224 223.135 65.4922 223.422C64.8672 223.708 64.112 223.852 63.2266 223.852ZM72.4062 218.352L69.1641 228H66.8906L71.1406 216.625H72.5938L72.4062 218.352ZM75.1172 228L71.8594 218.352L71.6641 216.625H73.125L77.3984 228H75.1172ZM74.9688 223.773V225.469H68.8672V223.773H74.9688ZM78.5703 216.625H82.7031C83.5677 216.625 84.3099 216.755 84.9297 217.016C85.5495 217.276 86.026 217.661 86.3594 218.172C86.6927 218.682 86.8594 219.31 86.8594 220.055C86.8594 220.643 86.7552 221.154 86.5469 221.586C86.3385 222.018 86.0443 222.38 85.6641 222.672C85.2891 222.964 84.8464 223.193 84.3359 223.359L83.6641 223.703H80.0156L80 222.008H82.7266C83.1693 222.008 83.5365 221.93 83.8281 221.773C84.1198 221.617 84.3385 221.401 84.4844 221.125C84.6354 220.849 84.7109 220.534 84.7109 220.18C84.7109 219.799 84.638 219.471 84.4922 219.195C84.3464 218.914 84.125 218.698 83.8281 218.547C83.5312 218.396 83.1562 218.32 82.7031 218.32H80.7188V228H78.5703V216.625ZM84.9922 228L82.3594 222.906L84.6328 222.898L87.2969 227.891V228H84.9922ZM94.8438 226.398L97.875 228.805L96.5 230L93.5156 227.609L94.8438 226.398ZM97.9297 222.023V222.609C97.9297 223.469 97.8151 224.242 97.5859 224.93C97.3568 225.612 97.0286 226.193 96.6016 226.672C96.1797 227.151 95.6771 227.518 95.0938 227.773C94.5104 228.029 93.8646 228.156 93.1562 228.156C92.4531 228.156 91.8073 228.029 91.2188 227.773C90.6354 227.518 90.1302 227.151 89.7031 226.672C89.276 226.193 88.9453 225.612 88.7109 224.93C88.4766 224.242 88.3594 223.469 88.3594 222.609V222.023C88.3594 221.159 88.474 220.385 88.7031 219.703C88.9375 219.021 89.2656 218.44 89.6875 217.961C90.1146 217.477 90.6198 217.107 91.2031 216.852C91.7917 216.596 92.4375 216.469 93.1406 216.469C93.849 216.469 94.4948 216.596 95.0781 216.852C95.6667 217.107 96.1719 217.477 96.5938 217.961C97.0208 218.44 97.349 219.021 97.5781 219.703C97.8125 220.385 97.9297 221.159 97.9297 222.023ZM95.7578 222.609V222.008C95.7578 221.388 95.7005 220.844 95.5859 220.375C95.4714 219.901 95.2995 219.503 95.0703 219.18C94.8464 218.857 94.5729 218.615 94.25 218.453C93.9271 218.286 93.5573 218.203 93.1406 218.203C92.7292 218.203 92.362 218.286 92.0391 218.453C91.7161 218.615 91.4427 218.857 91.2188 219.18C90.9948 219.503 90.8229 219.901 90.7031 220.375C90.5885 220.844 90.5312 221.388 90.5312 222.008V222.609C90.5312 223.224 90.5885 223.768 90.7031 224.242C90.8229 224.716 90.9948 225.117 91.2188 225.445C91.4479 225.768 91.724 226.013 92.0469 226.18C92.375 226.346 92.7448 226.43 93.1562 226.43C93.5729 226.43 93.9427 226.346 94.2656 226.18C94.5885 226.013 94.8594 225.768 95.0781 225.445C95.3021 225.117 95.4714 224.716 95.5859 224.242C95.7005 223.768 95.7578 223.224 95.7578 222.609ZM106.992 226.312V228H101.273V226.312H106.992ZM101.922 216.625V228H99.7734V216.625H101.922Z" fill="#003366"/>
<rect x="24.5" y="274.5" width="294" height="158" stroke="#D61A29"/>
<g filter="url(#filter2_i_6578_12715)">
<path d="M51 302H72C73.6406 302 75 303.359 75 305V318.5C75 320.188 73.6406 321.5 72 321.5H63.75L64.2188 323H67.5C68.2969 323 69 323.703 69 324.5C69 325.344 68.2969 326 67.5 326H55.5C54.6562 326 54 325.344 54 324.5C54 323.703 54.6562 323 55.5 323H58.7344L59.25 321.5H51C49.3125 321.5 48 320.188 48 318.5V305C48 303.359 49.3125 302 51 302ZM72 305H51V315.5H72V305Z" fill="#ED2232"/>
</g>
<path d="M56.4609 386.855L51.8203 401H48.082L54.4219 383.938H56.8008L56.4609 386.855ZM60.3164 401L55.6641 386.855L55.2891 383.938H57.6914L64.0664 401H60.3164ZM60.1055 394.648V397.402H51.0938V394.648H60.1055ZM72.9258 398.234V383H76.3242V401H73.2656L72.9258 398.234ZM64.9102 394.812V394.566C64.9102 393.598 65.0195 392.719 65.2383 391.93C65.457 391.133 65.7773 390.449 66.1992 389.879C66.6211 389.309 67.1406 388.867 67.7578 388.555C68.375 388.242 69.0781 388.086 69.8672 388.086C70.6094 388.086 71.2578 388.242 71.8125 388.555C72.375 388.867 72.8516 389.312 73.2422 389.891C73.6406 390.461 73.9609 391.137 74.2031 391.918C74.4453 392.691 74.6211 393.539 74.7305 394.461V395C74.6211 395.883 74.4453 396.703 74.2031 397.461C73.9609 398.219 73.6406 398.883 73.2422 399.453C72.8516 400.016 72.375 400.453 71.8125 400.766C71.25 401.078 70.5938 401.234 69.8438 401.234C69.0547 401.234 68.3516 401.074 67.7344 400.754C67.125 400.434 66.6094 399.984 66.1875 399.406C65.7734 398.828 65.457 398.148 65.2383 397.367C65.0195 396.586 64.9102 395.734 64.9102 394.812ZM68.2852 394.566V394.812C68.2852 395.336 68.3242 395.824 68.4023 396.277C68.4883 396.73 68.625 397.133 68.8125 397.484C69.0078 397.828 69.2578 398.098 69.5625 398.293C69.875 398.48 70.2539 398.574 70.6992 398.574C71.2773 398.574 71.7539 398.445 72.1289 398.188C72.5039 397.922 72.7891 397.559 72.9844 397.098C73.1875 396.637 73.3047 396.105 73.3359 395.504V393.969C73.3125 393.477 73.2422 393.035 73.125 392.645C73.0156 392.246 72.8516 391.906 72.6328 391.625C72.4219 391.344 72.1562 391.125 71.8359 390.969C71.5234 390.812 71.1523 390.734 70.7227 390.734C70.2852 390.734 69.9102 390.836 69.5977 391.039C69.2852 391.234 69.0312 391.504 68.8359 391.848C68.6484 392.191 68.5078 392.598 68.4141 393.066C68.3281 393.527 68.2852 394.027 68.2852 394.566ZM82.3359 390.945V401H78.9492V388.32H82.125L82.3359 390.945ZM81.8672 394.215H80.9297C80.9297 393.332 81.0352 392.52 81.2461 391.777C81.4648 391.027 81.7812 390.379 82.1953 389.832C82.6172 389.277 83.1367 388.848 83.7539 388.543C84.3711 388.238 85.0859 388.086 85.8984 388.086C86.4609 388.086 86.9766 388.172 87.4453 388.344C87.9141 388.508 88.3164 388.77 88.6523 389.129C88.9961 389.48 89.2617 389.941 89.4492 390.512C89.6367 391.074 89.7305 391.75 89.7305 392.539V401H86.3555V392.914C86.3555 392.336 86.2773 391.891 86.1211 391.578C85.9648 391.266 85.7422 391.047 85.4531 390.922C85.1719 390.797 84.832 390.734 84.4336 390.734C83.9961 390.734 83.6133 390.824 83.2852 391.004C82.9648 391.184 82.6992 391.434 82.4883 391.754C82.2773 392.066 82.1211 392.434 82.0195 392.855C81.918 393.277 81.8672 393.73 81.8672 394.215ZM89.4141 393.828L88.207 393.98C88.207 393.152 88.3086 392.383 88.5117 391.672C88.7227 390.961 89.0312 390.336 89.4375 389.797C89.8516 389.258 90.3633 388.84 90.9727 388.543C91.582 388.238 92.2852 388.086 93.082 388.086C93.6914 388.086 94.2461 388.176 94.7461 388.355C95.2461 388.527 95.6719 388.805 96.0234 389.188C96.3828 389.562 96.6562 390.055 96.8438 390.664C97.0391 391.273 97.1367 392.02 97.1367 392.902V401H93.75V392.902C93.75 392.316 93.6719 391.871 93.5156 391.566C93.3672 391.254 93.1484 391.039 92.8594 390.922C92.5781 390.797 92.2422 390.734 91.8516 390.734C91.4453 390.734 91.0898 390.816 90.7852 390.98C90.4805 391.137 90.2266 391.355 90.0234 391.637C89.8203 391.918 89.668 392.246 89.5664 392.621C89.4648 392.988 89.4141 393.391 89.4141 393.828ZM103.312 388.32V401H99.9258V388.32H103.312ZM99.7148 385.016C99.7148 384.523 99.8867 384.117 100.23 383.797C100.574 383.477 101.035 383.316 101.613 383.316C102.184 383.316 102.641 383.477 102.984 383.797C103.336 384.117 103.512 384.523 103.512 385.016C103.512 385.508 103.336 385.914 102.984 386.234C102.641 386.555 102.184 386.715 101.613 386.715C101.035 386.715 100.574 386.555 100.23 386.234C99.8867 385.914 99.7148 385.508 99.7148 385.016ZM109.406 391.027V401H106.031V388.32H109.195L109.406 391.027ZM108.914 394.215H108C108 393.277 108.121 392.434 108.363 391.684C108.605 390.926 108.945 390.281 109.383 389.75C109.82 389.211 110.34 388.801 110.941 388.52C111.551 388.23 112.23 388.086 112.98 388.086C113.574 388.086 114.117 388.172 114.609 388.344C115.102 388.516 115.523 388.789 115.875 389.164C116.234 389.539 116.508 390.035 116.695 390.652C116.891 391.27 116.988 392.023 116.988 392.914V401H113.59V392.902C113.59 392.34 113.512 391.902 113.355 391.59C113.199 391.277 112.969 391.059 112.664 390.934C112.367 390.801 112 390.734 111.562 390.734C111.109 390.734 110.715 390.824 110.379 391.004C110.051 391.184 109.777 391.434 109.559 391.754C109.348 392.066 109.188 392.434 109.078 392.855C108.969 393.277 108.914 393.73 108.914 394.215ZM123.117 388.32V401H119.73V388.32H123.117ZM119.52 385.016C119.52 384.523 119.691 384.117 120.035 383.797C120.379 383.477 120.84 383.316 121.418 383.316C121.988 383.316 122.445 383.477 122.789 383.797C123.141 384.117 123.316 384.523 123.316 385.016C123.316 385.508 123.141 385.914 122.789 386.234C122.445 386.555 121.988 386.715 121.418 386.715C120.84 386.715 120.379 386.555 120.035 386.234C119.691 385.914 119.52 385.508 119.52 385.016ZM132.762 397.496C132.762 397.254 132.691 397.035 132.551 396.84C132.41 396.645 132.148 396.465 131.766 396.301C131.391 396.129 130.848 395.973 130.137 395.832C129.496 395.691 128.898 395.516 128.344 395.305C127.797 395.086 127.32 394.824 126.914 394.52C126.516 394.215 126.203 393.855 125.977 393.441C125.75 393.02 125.637 392.539 125.637 392C125.637 391.469 125.75 390.969 125.977 390.5C126.211 390.031 126.543 389.617 126.973 389.258C127.41 388.891 127.941 388.605 128.566 388.402C129.199 388.191 129.91 388.086 130.699 388.086C131.801 388.086 132.746 388.262 133.535 388.613C134.332 388.965 134.941 389.449 135.363 390.066C135.793 390.676 136.008 391.371 136.008 392.152H132.633C132.633 391.824 132.562 391.531 132.422 391.273C132.289 391.008 132.078 390.801 131.789 390.652C131.508 390.496 131.141 390.418 130.688 390.418C130.312 390.418 129.988 390.484 129.715 390.617C129.441 390.742 129.23 390.914 129.082 391.133C128.941 391.344 128.871 391.578 128.871 391.836C128.871 392.031 128.91 392.207 128.988 392.363C129.074 392.512 129.211 392.648 129.398 392.773C129.586 392.898 129.828 393.016 130.125 393.125C130.43 393.227 130.805 393.32 131.25 393.406C132.164 393.594 132.98 393.84 133.699 394.145C134.418 394.441 134.988 394.848 135.41 395.363C135.832 395.871 136.043 396.539 136.043 397.367C136.043 397.93 135.918 398.445 135.668 398.914C135.418 399.383 135.059 399.793 134.59 400.145C134.121 400.488 133.559 400.758 132.902 400.953C132.254 401.141 131.523 401.234 130.711 401.234C129.531 401.234 128.531 401.023 127.711 400.602C126.898 400.18 126.281 399.645 125.859 398.996C125.445 398.34 125.238 397.668 125.238 396.98H128.438C128.453 397.441 128.57 397.812 128.789 398.094C129.016 398.375 129.301 398.578 129.645 398.703C129.996 398.828 130.375 398.891 130.781 398.891C131.219 398.891 131.582 398.832 131.871 398.715C132.16 398.59 132.379 398.426 132.527 398.223C132.684 398.012 132.762 397.77 132.762 397.496ZM144.445 388.32V390.711H137.062V388.32H144.445ZM138.891 385.191H142.266V397.18C142.266 397.547 142.312 397.828 142.406 398.023C142.508 398.219 142.656 398.355 142.852 398.434C143.047 398.504 143.293 398.539 143.59 398.539C143.801 398.539 143.988 398.531 144.152 398.516C144.324 398.492 144.469 398.469 144.586 398.445L144.598 400.93C144.309 401.023 143.996 401.098 143.66 401.152C143.324 401.207 142.953 401.234 142.547 401.234C141.805 401.234 141.156 401.113 140.602 400.871C140.055 400.621 139.633 400.223 139.336 399.676C139.039 399.129 138.891 398.41 138.891 397.52V385.191ZM149.742 391.086V401H146.367V388.32H149.543L149.742 391.086ZM153.562 388.238L153.504 391.367C153.34 391.344 153.141 391.324 152.906 391.309C152.68 391.285 152.473 391.273 152.285 391.273C151.809 391.273 151.395 391.336 151.043 391.461C150.699 391.578 150.41 391.754 150.176 391.988C149.949 392.223 149.777 392.508 149.66 392.844C149.551 393.18 149.488 393.562 149.473 393.992L148.793 393.781C148.793 392.961 148.875 392.207 149.039 391.52C149.203 390.824 149.441 390.219 149.754 389.703C150.074 389.188 150.465 388.789 150.926 388.508C151.387 388.227 151.914 388.086 152.508 388.086C152.695 388.086 152.887 388.102 153.082 388.133C153.277 388.156 153.438 388.191 153.562 388.238ZM161.602 398.141V392.492C161.602 392.086 161.535 391.738 161.402 391.449C161.27 391.152 161.062 390.922 160.781 390.758C160.508 390.594 160.152 390.512 159.715 390.512C159.34 390.512 159.016 390.578 158.742 390.711C158.469 390.836 158.258 391.02 158.109 391.262C157.961 391.496 157.887 391.773 157.887 392.094H154.512C154.512 391.555 154.637 391.043 154.887 390.559C155.137 390.074 155.5 389.648 155.977 389.281C156.453 388.906 157.02 388.613 157.676 388.402C158.34 388.191 159.082 388.086 159.902 388.086C160.887 388.086 161.762 388.25 162.527 388.578C163.293 388.906 163.895 389.398 164.332 390.055C164.777 390.711 165 391.531 165 392.516V397.941C165 398.637 165.043 399.207 165.129 399.652C165.215 400.09 165.34 400.473 165.504 400.801V401H162.094C161.93 400.656 161.805 400.227 161.719 399.711C161.641 399.188 161.602 398.664 161.602 398.141ZM162.047 393.277L162.07 395.188H160.184C159.738 395.188 159.352 395.238 159.023 395.34C158.695 395.441 158.426 395.586 158.215 395.773C158.004 395.953 157.848 396.164 157.746 396.406C157.652 396.648 157.605 396.914 157.605 397.203C157.605 397.492 157.672 397.754 157.805 397.988C157.938 398.215 158.129 398.395 158.379 398.527C158.629 398.652 158.922 398.715 159.258 398.715C159.766 398.715 160.207 398.613 160.582 398.41C160.957 398.207 161.246 397.957 161.449 397.66C161.66 397.363 161.77 397.082 161.777 396.816L162.668 398.246C162.543 398.566 162.371 398.898 162.152 399.242C161.941 399.586 161.672 399.91 161.344 400.215C161.016 400.512 160.621 400.758 160.16 400.953C159.699 401.141 159.152 401.234 158.52 401.234C157.715 401.234 156.984 401.074 156.328 400.754C155.68 400.426 155.164 399.977 154.781 399.406C154.406 398.828 154.219 398.172 154.219 397.438C154.219 396.773 154.344 396.184 154.594 395.668C154.844 395.152 155.211 394.719 155.695 394.367C156.188 394.008 156.801 393.738 157.535 393.559C158.27 393.371 159.121 393.277 160.09 393.277H162.047ZM173.812 388.32V390.711H166.43V388.32H173.812ZM168.258 385.191H171.633V397.18C171.633 397.547 171.68 397.828 171.773 398.023C171.875 398.219 172.023 398.355 172.219 398.434C172.414 398.504 172.66 398.539 172.957 398.539C173.168 398.539 173.355 398.531 173.52 398.516C173.691 398.492 173.836 398.469 173.953 398.445L173.965 400.93C173.676 401.023 173.363 401.098 173.027 401.152C172.691 401.207 172.32 401.234 171.914 401.234C171.172 401.234 170.523 401.113 169.969 400.871C169.422 400.621 169 400.223 168.703 399.676C168.406 399.129 168.258 398.41 168.258 397.52V385.191ZM179.297 388.32V401H175.91V388.32H179.297ZM175.699 385.016C175.699 384.523 175.871 384.117 176.215 383.797C176.559 383.477 177.02 383.316 177.598 383.316C178.168 383.316 178.625 383.477 178.969 383.797C179.32 384.117 179.496 384.523 179.496 385.016C179.496 385.508 179.32 385.914 178.969 386.234C178.625 386.555 178.168 386.715 177.598 386.715C177.02 386.715 176.559 386.555 176.215 386.234C175.871 385.914 175.699 385.508 175.699 385.016ZM181.547 394.789V394.543C181.547 393.613 181.68 392.758 181.945 391.977C182.211 391.188 182.598 390.504 183.105 389.926C183.613 389.348 184.238 388.898 184.98 388.578C185.723 388.25 186.574 388.086 187.535 388.086C188.496 388.086 189.352 388.25 190.102 388.578C190.852 388.898 191.48 389.348 191.988 389.926C192.504 390.504 192.895 391.188 193.16 391.977C193.426 392.758 193.559 393.613 193.559 394.543V394.789C193.559 395.711 193.426 396.566 193.16 397.355C192.895 398.137 192.504 398.82 191.988 399.406C191.48 399.984 190.855 400.434 190.113 400.754C189.371 401.074 188.52 401.234 187.559 401.234C186.598 401.234 185.742 401.074 184.992 400.754C184.25 400.434 183.621 399.984 183.105 399.406C182.598 398.82 182.211 398.137 181.945 397.355C181.68 396.566 181.547 395.711 181.547 394.789ZM184.922 394.543V394.789C184.922 395.32 184.969 395.816 185.062 396.277C185.156 396.738 185.305 397.145 185.508 397.496C185.719 397.84 185.992 398.109 186.328 398.305C186.664 398.5 187.074 398.598 187.559 398.598C188.027 398.598 188.43 398.5 188.766 398.305C189.102 398.109 189.371 397.84 189.574 397.496C189.777 397.145 189.926 396.738 190.02 396.277C190.121 395.816 190.172 395.32 190.172 394.789V394.543C190.172 394.027 190.121 393.543 190.02 393.09C189.926 392.629 189.773 392.223 189.562 391.871C189.359 391.512 189.09 391.23 188.754 391.027C188.418 390.824 188.012 390.723 187.535 390.723C187.059 390.723 186.652 390.824 186.316 391.027C185.988 391.23 185.719 391.512 185.508 391.871C185.305 392.223 185.156 392.629 185.062 393.09C184.969 393.543 184.922 394.027 184.922 394.543ZM198.938 391.027V401H195.562V388.32H198.727L198.938 391.027ZM198.445 394.215H197.531C197.531 393.277 197.652 392.434 197.895 391.684C198.137 390.926 198.477 390.281 198.914 389.75C199.352 389.211 199.871 388.801 200.473 388.52C201.082 388.23 201.762 388.086 202.512 388.086C203.105 388.086 203.648 388.172 204.141 388.344C204.633 388.516 205.055 388.789 205.406 389.164C205.766 389.539 206.039 390.035 206.227 390.652C206.422 391.27 206.52 392.023 206.52 392.914V401H203.121V392.902C203.121 392.34 203.043 391.902 202.887 391.59C202.73 391.277 202.5 391.059 202.195 390.934C201.898 390.801 201.531 390.734 201.094 390.734C200.641 390.734 200.246 390.824 199.91 391.004C199.582 391.184 199.309 391.434 199.09 391.754C198.879 392.066 198.719 392.434 198.609 392.855C198.5 393.277 198.445 393.73 198.445 394.215Z" fill="#ED2232"/>
<rect width="295" height="100" transform="translate(24 454)" fill="#003366"/>
<g filter="url(#filter3_i_6578_12715)">
<path d="M48.8438 476.938H50.5312C50.9883 476.938 51.375 477.324 51.375 477.781V479.469C51.375 479.961 50.9883 480.312 50.5312 480.312V483.406H52.5C52.5 482.949 52.8516 482.562 53.3438 482.562H55.0312C55.4883 482.562 55.875 482.949 55.875 483.406V485.094C55.875 485.586 55.4883 485.938 55.0312 485.938H53.3438C52.8516 485.938 52.5 485.586 52.5 485.094H50.5312V488.75C50.5312 488.926 50.6367 489.031 50.8125 489.031H52.5C52.5 488.574 52.8516 488.188 53.3438 488.188H55.0312C55.4883 488.188 55.875 488.574 55.875 489.031V490.719C55.875 491.211 55.4883 491.562 55.0312 491.562H53.3438C52.8516 491.562 52.5 491.211 52.5 490.719H50.8125C49.7227 490.719 48.8438 489.84 48.8438 488.75V484.25V480.312C48.3516 480.312 48 479.961 48 479.469V477.781C48 477.324 48.3516 476.938 48.8438 476.938Z" fill="#E7CF27"/>
</g>
<g filter="url(#filter4_i_6578_12715)">
<path d="M53.625 478.625C53.625 478.027 54.1172 477.5 54.75 477.5H64.875C65.4727 477.5 66 478.027 66 478.625C66 479.258 65.4727 479.75 64.875 479.75H54.75C54.1172 479.75 53.625 479.258 53.625 478.625ZM58.125 484.25C58.125 483.652 58.6172 483.125 59.25 483.125H64.875C65.4727 483.125 66 483.652 66 484.25C66 484.883 65.4727 485.375 64.875 485.375H59.25C58.6172 485.375 58.125 484.883 58.125 484.25ZM59.25 488.75H64.875C65.4727 488.75 66 489.277 66 489.875C66 490.508 65.4727 491 64.875 491H59.25C58.6172 491 58.125 490.508 58.125 489.875C58.125 489.277 58.6172 488.75 59.25 488.75Z" fill="#CCCCCC"/>
</g>
<path d="M55.7422 525.258H57.8906C57.8333 526.018 57.6224 526.693 57.2578 527.281C56.8932 527.865 56.3854 528.323 55.7344 528.656C55.0833 528.99 54.2943 529.156 53.3672 529.156C52.6536 529.156 52.0104 529.031 51.4375 528.781C50.8698 528.526 50.3828 528.164 49.9766 527.695C49.5755 527.221 49.2682 526.654 49.0547 525.992C48.8411 525.326 48.7344 524.578 48.7344 523.75V522.883C48.7344 522.055 48.8438 521.307 49.0625 520.641C49.2812 519.974 49.5938 519.406 50 518.938C50.4115 518.464 50.9036 518.099 51.4766 517.844C52.0547 517.589 52.7005 517.461 53.4141 517.461C54.3411 517.461 55.125 517.633 55.7656 517.977C56.4062 518.315 56.9036 518.781 57.2578 519.375C57.612 519.969 57.8255 520.651 57.8984 521.422H55.75C55.7083 520.943 55.6042 520.536 55.4375 520.203C55.276 519.87 55.0312 519.617 54.7031 519.445C54.3802 519.268 53.9505 519.18 53.4141 519.18C52.9974 519.18 52.6302 519.258 52.3125 519.414C52 519.57 51.7396 519.805 51.5312 520.117C51.3229 520.424 51.1667 520.81 51.0625 521.273C50.9583 521.732 50.9062 522.263 50.9062 522.867V523.75C50.9062 524.328 50.9531 524.846 51.0469 525.305C51.1406 525.763 51.2865 526.151 51.4844 526.469C51.6823 526.786 51.9375 527.029 52.25 527.195C52.5625 527.362 52.9349 527.445 53.3672 527.445C53.8932 527.445 54.3203 527.362 54.6484 527.195C54.9818 527.029 55.2344 526.784 55.4062 526.461C55.5833 526.138 55.6953 525.737 55.7422 525.258ZM64.0547 527.203V523.305C64.0547 523.018 64.0052 522.771 63.9062 522.562C63.8073 522.354 63.6562 522.193 63.4531 522.078C63.25 521.964 62.9922 521.906 62.6797 521.906C62.4036 521.906 62.1615 521.953 61.9531 522.047C61.75 522.141 61.5938 522.273 61.4844 522.445C61.375 522.612 61.3203 522.805 61.3203 523.023H59.25C59.25 522.674 59.3333 522.344 59.5 522.031C59.6667 521.714 59.9036 521.432 60.2109 521.188C60.5234 520.938 60.8958 520.742 61.3281 520.602C61.7656 520.461 62.2552 520.391 62.7969 520.391C63.4375 520.391 64.0078 520.5 64.5078 520.719C65.013 520.932 65.4089 521.255 65.6953 521.688C65.987 522.12 66.1328 522.664 66.1328 523.32V527.008C66.1328 527.43 66.1589 527.792 66.2109 528.094C66.2682 528.391 66.3516 528.648 66.4609 528.867V529H64.3594C64.2604 528.786 64.1849 528.516 64.1328 528.188C64.0807 527.854 64.0547 527.526 64.0547 527.203ZM64.3438 523.852L64.3594 525.078H63.0547C62.7318 525.078 62.4479 525.112 62.2031 525.18C61.9583 525.242 61.7578 525.336 61.6016 525.461C61.4453 525.581 61.3281 525.727 61.25 525.898C61.1719 526.065 61.1328 526.255 61.1328 526.469C61.1328 526.677 61.1797 526.865 61.2734 527.031C61.3724 527.198 61.513 527.331 61.6953 527.43C61.8828 527.523 62.1016 527.57 62.3516 527.57C62.7161 527.57 63.0339 527.497 63.3047 527.352C63.5755 527.201 63.7865 527.018 63.9375 526.805C64.0885 526.591 64.1693 526.388 64.1797 526.195L64.7734 527.086C64.7005 527.299 64.5911 527.526 64.4453 527.766C64.2995 528.005 64.112 528.229 63.8828 528.438C63.6536 528.646 63.3776 528.818 63.0547 528.953C62.7318 529.089 62.3568 529.156 61.9297 529.156C61.3828 529.156 60.8932 529.047 60.4609 528.828C60.0286 528.609 59.6875 528.31 59.4375 527.93C59.1875 527.549 59.0625 527.117 59.0625 526.633C59.0625 526.185 59.1458 525.789 59.3125 525.445C59.4792 525.102 59.7266 524.812 60.0547 524.578C60.3828 524.339 60.7891 524.159 61.2734 524.039C61.763 523.914 62.3229 523.852 62.9531 523.852H64.3438ZM71.9922 520.547V522.031H67.1484V520.547H71.9922ZM68.4453 518.469H70.5156V526.562C70.5156 526.812 70.5495 527.005 70.6172 527.141C70.6849 527.276 70.7865 527.367 70.9219 527.414C71.0573 527.461 71.2188 527.484 71.4062 527.484C71.5417 527.484 71.6667 527.477 71.7812 527.461C71.8958 527.445 71.9922 527.43 72.0703 527.414L72.0781 528.961C71.9062 529.018 71.7109 529.065 71.4922 529.102C71.2786 529.138 71.0365 529.156 70.7656 529.156C70.3021 529.156 69.8958 529.078 69.5469 528.922C69.1979 528.76 68.9271 528.503 68.7344 528.148C68.5417 527.789 68.4453 527.315 68.4453 526.727V518.469ZM78.0234 527.203V523.305C78.0234 523.018 77.974 522.771 77.875 522.562C77.776 522.354 77.625 522.193 77.4219 522.078C77.2188 521.964 76.9609 521.906 76.6484 521.906C76.3724 521.906 76.1302 521.953 75.9219 522.047C75.7188 522.141 75.5625 522.273 75.4531 522.445C75.3438 522.612 75.2891 522.805 75.2891 523.023H73.2188C73.2188 522.674 73.3021 522.344 73.4688 522.031C73.6354 521.714 73.8724 521.432 74.1797 521.188C74.4922 520.938 74.8646 520.742 75.2969 520.602C75.7344 520.461 76.224 520.391 76.7656 520.391C77.4062 520.391 77.9766 520.5 78.4766 520.719C78.9818 520.932 79.3776 521.255 79.6641 521.688C79.9557 522.12 80.1016 522.664 80.1016 523.32V527.008C80.1016 527.43 80.1276 527.792 80.1797 528.094C80.237 528.391 80.3203 528.648 80.4297 528.867V529H78.3281C78.2292 528.786 78.1536 528.516 78.1016 528.188C78.0495 527.854 78.0234 527.526 78.0234 527.203ZM78.3125 523.852L78.3281 525.078H77.0234C76.7005 525.078 76.4167 525.112 76.1719 525.18C75.9271 525.242 75.7266 525.336 75.5703 525.461C75.4141 525.581 75.2969 525.727 75.2188 525.898C75.1406 526.065 75.1016 526.255 75.1016 526.469C75.1016 526.677 75.1484 526.865 75.2422 527.031C75.3411 527.198 75.4818 527.331 75.6641 527.43C75.8516 527.523 76.0703 527.57 76.3203 527.57C76.6849 527.57 77.0026 527.497 77.2734 527.352C77.5443 527.201 77.7552 527.018 77.9062 526.805C78.0573 526.591 78.138 526.388 78.1484 526.195L78.7422 527.086C78.6693 527.299 78.5599 527.526 78.4141 527.766C78.2682 528.005 78.0807 528.229 77.8516 528.438C77.6224 528.646 77.3464 528.818 77.0234 528.953C76.7005 529.089 76.3255 529.156 75.8984 529.156C75.3516 529.156 74.862 529.047 74.4297 528.828C73.9974 528.609 73.6562 528.31 73.4062 527.93C73.1562 527.549 73.0312 527.117 73.0312 526.633C73.0312 526.185 73.1146 525.789 73.2812 525.445C73.4479 525.102 73.6953 524.812 74.0234 524.578C74.3516 524.339 74.7578 524.159 75.2422 524.039C75.7318 523.914 76.2917 523.852 76.9219 523.852H78.3125ZM84.1484 517V529H82.0781V517H84.1484ZM85.75 524.859V524.695C85.75 524.076 85.8385 523.505 86.0156 522.984C86.1927 522.458 86.4505 522.003 86.7891 521.617C87.1276 521.232 87.5417 520.932 88.0312 520.719C88.5208 520.5 89.0781 520.391 89.7031 520.391C90.3385 520.391 90.901 520.5 91.3906 520.719C91.8854 520.932 92.3021 521.232 92.6406 521.617C92.9792 522.003 93.237 522.458 93.4141 522.984C93.5911 523.505 93.6797 524.076 93.6797 524.695V524.859C93.6797 525.474 93.5911 526.044 93.4141 526.57C93.237 527.091 92.9792 527.547 92.6406 527.938C92.3021 528.323 91.888 528.622 91.3984 528.836C90.9089 529.049 90.349 529.156 89.7188 529.156C89.0938 529.156 88.5339 529.049 88.0391 528.836C87.5443 528.622 87.1276 528.323 86.7891 527.938C86.4505 527.547 86.1927 527.091 86.0156 526.57C85.8385 526.044 85.75 525.474 85.75 524.859ZM87.8125 524.695V524.859C87.8125 525.229 87.849 525.576 87.9219 525.898C87.9948 526.221 88.1068 526.505 88.2578 526.75C88.4089 526.995 88.6042 527.188 88.8438 527.328C89.0885 527.464 89.3802 527.531 89.7188 527.531C90.0521 527.531 90.3385 527.464 90.5781 527.328C90.8177 527.188 91.013 526.995 91.1641 526.75C91.3203 526.505 91.4349 526.221 91.5078 525.898C91.5807 525.576 91.6172 525.229 91.6172 524.859V524.695C91.6172 524.331 91.5807 523.99 91.5078 523.672C91.4349 523.349 91.3203 523.065 91.1641 522.82C91.013 522.57 90.8151 522.375 90.5703 522.234C90.3307 522.089 90.0417 522.016 89.7031 522.016C89.3698 522.016 89.0833 522.089 88.8438 522.234C88.6042 522.375 88.4089 522.57 88.2578 522.82C88.1068 523.065 87.9948 523.349 87.9219 523.672C87.849 523.99 87.8125 524.331 87.8125 524.695ZM100.555 520.547H102.43V528.742C102.43 529.508 102.263 530.156 101.93 530.688C101.602 531.224 101.141 531.63 100.547 531.906C99.9531 532.188 99.263 532.328 98.4766 532.328C98.138 532.328 97.7708 532.281 97.375 532.188C96.9844 532.094 96.6068 531.945 96.2422 531.742C95.8828 531.544 95.5833 531.286 95.3438 530.969L96.2734 529.75C96.5547 530.078 96.8724 530.326 97.2266 530.492C97.5807 530.664 97.9635 530.75 98.375 530.75C98.7917 530.75 99.1458 530.672 99.4375 530.516C99.7344 530.365 99.9609 530.141 100.117 529.844C100.279 529.552 100.359 529.193 100.359 528.766V522.477L100.555 520.547ZM94.8438 524.875V524.711C94.8438 524.065 94.9219 523.479 95.0781 522.953C95.2344 522.422 95.4583 521.966 95.75 521.586C96.0469 521.206 96.4036 520.911 96.8203 520.703C97.2422 520.495 97.7161 520.391 98.2422 520.391C98.7995 520.391 99.2682 520.492 99.6484 520.695C100.034 520.898 100.352 521.188 100.602 521.562C100.857 521.938 101.055 522.383 101.195 522.898C101.341 523.409 101.453 523.971 101.531 524.586V525.031C101.458 525.63 101.341 526.18 101.18 526.68C101.023 527.18 100.815 527.617 100.555 527.992C100.294 528.362 99.9714 528.648 99.5859 528.852C99.2005 529.055 98.7474 529.156 98.2266 529.156C97.7057 529.156 97.237 529.049 96.8203 528.836C96.4036 528.622 96.0469 528.323 95.75 527.938C95.4583 527.552 95.2344 527.099 95.0781 526.578C94.9219 526.057 94.8438 525.49 94.8438 524.875ZM96.9062 524.711V524.875C96.9062 525.24 96.9427 525.581 97.0156 525.898C97.0885 526.216 97.2005 526.497 97.3516 526.742C97.5026 526.982 97.6927 527.169 97.9219 527.305C98.151 527.44 98.4245 527.508 98.7422 527.508C99.1693 527.508 99.5182 527.419 99.7891 527.242C100.065 527.06 100.273 526.812 100.414 526.5C100.56 526.182 100.654 525.826 100.695 525.43V524.203C100.669 523.891 100.612 523.602 100.523 523.336C100.44 523.07 100.323 522.841 100.172 522.648C100.021 522.456 99.8281 522.305 99.5938 522.195C99.3594 522.086 99.0807 522.031 98.7578 522.031C98.4453 522.031 98.1719 522.102 97.9375 522.242C97.7031 522.378 97.5104 522.568 97.3594 522.812C97.2083 523.057 97.0938 523.341 97.0156 523.664C96.9427 523.987 96.9062 524.336 96.9062 524.711ZM109.32 526.992V520.547H111.398V529H109.445L109.32 526.992ZM109.586 525.242L110.227 525.227C110.227 525.794 110.164 526.318 110.039 526.797C109.914 527.276 109.719 527.693 109.453 528.047C109.193 528.396 108.862 528.669 108.461 528.867C108.06 529.06 107.586 529.156 107.039 529.156C106.622 529.156 106.242 529.099 105.898 528.984C105.555 528.865 105.258 528.68 105.008 528.43C104.763 528.174 104.573 527.849 104.438 527.453C104.302 527.052 104.234 526.57 104.234 526.008V520.547H106.297V526.023C106.297 526.305 106.328 526.539 106.391 526.727C106.458 526.914 106.549 527.068 106.664 527.188C106.784 527.302 106.922 527.385 107.078 527.438C107.24 527.484 107.411 527.508 107.594 527.508C108.094 527.508 108.487 527.409 108.773 527.211C109.065 527.008 109.273 526.737 109.398 526.398C109.523 526.055 109.586 525.669 109.586 525.242ZM117.023 529.156C116.383 529.156 115.807 529.052 115.297 528.844C114.786 528.635 114.352 528.346 113.992 527.977C113.638 527.602 113.365 527.167 113.172 526.672C112.984 526.172 112.891 525.635 112.891 525.062V524.75C112.891 524.099 112.984 523.508 113.172 522.977C113.359 522.44 113.625 521.979 113.969 521.594C114.312 521.208 114.724 520.911 115.203 520.703C115.682 520.495 116.211 520.391 116.789 520.391C117.388 520.391 117.917 520.492 118.375 520.695C118.833 520.893 119.216 521.174 119.523 521.539C119.831 521.904 120.062 522.341 120.219 522.852C120.375 523.357 120.453 523.917 120.453 524.531V525.398H113.828V523.977H118.422V523.82C118.411 523.492 118.349 523.193 118.234 522.922C118.12 522.646 117.943 522.427 117.703 522.266C117.464 522.099 117.154 522.016 116.773 522.016C116.466 522.016 116.198 522.083 115.969 522.219C115.745 522.349 115.557 522.536 115.406 522.781C115.26 523.021 115.151 523.307 115.078 523.641C115.005 523.974 114.969 524.344 114.969 524.75V525.062C114.969 525.417 115.016 525.745 115.109 526.047C115.208 526.349 115.352 526.612 115.539 526.836C115.732 527.055 115.961 527.227 116.227 527.352C116.497 527.471 116.805 527.531 117.148 527.531C117.581 527.531 117.971 527.448 118.32 527.281C118.674 527.109 118.982 526.857 119.242 526.523L120.281 527.602C120.104 527.862 119.865 528.112 119.562 528.352C119.266 528.591 118.906 528.786 118.484 528.938C118.062 529.083 117.576 529.156 117.023 529.156Z" fill="white"/>
<rect width="295" height="100" transform="translate(24 575)" fill="#003366"/>
<g filter="url(#filter5_i_6578_12715)">
<path d="M48.8438 597.938H50.5312C50.9883 597.938 51.375 598.324 51.375 598.781V600.469C51.375 600.961 50.9883 601.312 50.5312 601.312V604.406H52.5C52.5 603.949 52.8516 603.562 53.3438 603.562H55.0312C55.4883 603.562 55.875 603.949 55.875 604.406V606.094C55.875 606.586 55.4883 606.938 55.0312 606.938H53.3438C52.8516 606.938 52.5 606.586 52.5 606.094H50.5312V609.75C50.5312 609.926 50.6367 610.031 50.8125 610.031H52.5C52.5 609.574 52.8516 609.188 53.3438 609.188H55.0312C55.4883 609.188 55.875 609.574 55.875 610.031V611.719C55.875 612.211 55.4883 612.562 55.0312 612.562H53.3438C52.8516 612.562 52.5 612.211 52.5 611.719H50.8125C49.7227 611.719 48.8438 610.84 48.8438 609.75V605.25V601.312C48.3516 601.312 48 600.961 48 600.469V598.781C48 598.324 48.3516 597.938 48.8438 597.938Z" fill="#EFD425"/>
</g>
<g filter="url(#filter6_i_6578_12715)">
<path d="M53.625 599.625C53.625 599.027 54.1172 598.5 54.75 598.5H64.875C65.4727 598.5 66 599.027 66 599.625C66 600.258 65.4727 600.75 64.875 600.75H54.75C54.1172 600.75 53.625 600.258 53.625 599.625ZM58.125 605.25C58.125 604.652 58.6172 604.125 59.25 604.125H64.875C65.4727 604.125 66 604.652 66 605.25C66 605.883 65.4727 606.375 64.875 606.375H59.25C58.6172 606.375 58.125 605.883 58.125 605.25ZM59.25 609.75H64.875C65.4727 609.75 66 610.277 66 610.875C66 611.508 65.4727 612 64.875 612H59.25C58.6172 612 58.125 611.508 58.125 610.875C58.125 610.277 58.6172 609.75 59.25 609.75Z" fill="#CCCCCC"/>
</g>
<path d="M58.2266 638.625V650H56.0703L51.2344 642.109V650H49.0859V638.625H51.2344L56.0859 646.523V638.625H58.2266ZM62.5625 638.625V650H60.4141V638.625H62.5625ZM69.3906 638.625L64.8281 644.172L62.2188 646.961L61.8359 644.875L63.6484 642.523L66.7578 638.625H69.3906ZM67 650L63.4609 644.672L65 643.281L69.5547 650H67ZM79.5156 644.023V644.609C79.5156 645.469 79.401 646.242 79.1719 646.93C78.9427 647.612 78.6172 648.193 78.1953 648.672C77.7734 649.151 77.2708 649.518 76.6875 649.773C76.1042 650.029 75.4557 650.156 74.7422 650.156C74.0391 650.156 73.3932 650.029 72.8047 649.773C72.2214 649.518 71.7161 649.151 71.2891 648.672C70.862 648.193 70.5312 647.612 70.2969 646.93C70.0625 646.242 69.9453 645.469 69.9453 644.609V644.023C69.9453 643.159 70.0625 642.385 70.2969 641.703C70.5312 641.021 70.8594 640.44 71.2812 639.961C71.7031 639.477 72.2057 639.107 72.7891 638.852C73.3776 638.596 74.0234 638.469 74.7266 638.469C75.4401 638.469 76.0885 638.596 76.6719 638.852C77.2552 639.107 77.7578 639.477 78.1797 639.961C78.6068 640.44 78.9349 641.021 79.1641 641.703C79.3984 642.385 79.5156 643.159 79.5156 644.023ZM77.3438 644.609V644.008C77.3438 643.388 77.2865 642.844 77.1719 642.375C77.0573 641.901 76.888 641.503 76.6641 641.18C76.4401 640.857 76.1641 640.615 75.8359 640.453C75.5078 640.286 75.138 640.203 74.7266 640.203C74.3099 640.203 73.9401 640.286 73.6172 640.453C73.2995 640.615 73.0286 640.857 72.8047 641.18C72.5807 641.503 72.4089 641.901 72.2891 642.375C72.1745 642.844 72.1172 643.388 72.1172 644.008V644.609C72.1172 645.224 72.1745 645.768 72.2891 646.242C72.4089 646.716 72.5807 647.117 72.8047 647.445C73.0339 647.768 73.3099 648.013 73.6328 648.18C73.9557 648.346 74.3255 648.43 74.7422 648.43C75.1589 648.43 75.5286 648.346 75.8516 648.18C76.1745 648.013 76.4453 647.768 76.6641 647.445C76.888 647.117 77.0573 646.716 77.1719 646.242C77.2865 645.768 77.3438 645.224 77.3438 644.609ZM84.7344 650H82.2812L82.2969 648.312H84.7344C85.3958 648.312 85.9505 648.167 86.3984 647.875C86.8464 647.578 87.1849 647.154 87.4141 646.602C87.6432 646.044 87.7578 645.378 87.7578 644.602V644.016C87.7578 643.417 87.6927 642.888 87.5625 642.43C87.4323 641.971 87.2396 641.586 86.9844 641.273C86.7344 640.961 86.4245 640.724 86.0547 640.562C85.6849 640.401 85.2604 640.32 84.7812 640.32H82.2344V638.625H84.7812C85.5417 638.625 86.2344 638.753 86.8594 639.008C87.4896 639.263 88.0339 639.63 88.4922 640.109C88.9557 640.583 89.3099 641.151 89.5547 641.812C89.8047 642.474 89.9297 643.214 89.9297 644.031V644.602C89.9297 645.414 89.8047 646.154 89.5547 646.82C89.3099 647.482 88.9557 648.049 88.4922 648.523C88.0339 648.997 87.487 649.362 86.8516 649.617C86.2161 649.872 85.5104 650 84.7344 650ZM83.4844 638.625V650H81.3359V638.625H83.4844Z" fill="white"/>
<path d="M328 397H328.77V396.23H328V397ZM328 625V625.77H328.77V625H328ZM319.456 396.456C319.155 396.756 319.155 397.244 319.456 397.544L324.356 402.445C324.656 402.745 325.144 402.745 325.445 402.445C325.745 402.144 325.745 401.656 325.445 401.356L321.089 397L325.445 392.644C325.745 392.344 325.745 391.856 325.445 391.555C325.144 391.255 324.656 391.255 324.356 391.555L319.456 396.456ZM327.23 397V625H328.77V397H327.23ZM328 624.23H319V625.77H328V624.23ZM328 396.23H320V397.77H328V396.23Z" fill="#003366"/>
<path d="M328 314H328.77V314.77H328V314ZM328 82.0006V81.2306H328.77V82.0006H328ZM319.456 314.544C319.155 314.244 319.155 313.756 319.456 313.456L324.356 308.555C324.656 308.255 325.144 308.255 325.445 308.555C325.745 308.856 325.745 309.344 325.445 309.644L321.089 314L325.445 318.356C325.745 318.656 325.745 319.144 325.445 319.445C325.144 319.745 324.656 319.745 324.356 319.445L319.456 314.544ZM320 313.23H322V314.77H320V313.23ZM326 313.23H328V314.77H326V313.23ZM327.23 314V306.75H328.77V314H327.23ZM327.23 292.25V277.75H328.77V292.25H327.23ZM327.23 263.25V248.75H328.77V263.25H327.23ZM327.23 234.25V219.75H328.77V234.25H327.23ZM327.23 205.25V190.75H328.77V205.25H327.23ZM327.23 176.25V161.75H328.77V176.25H327.23ZM327.23 147.25V132.75H328.77V147.25H327.23ZM327.23 118.25V103.751H328.77V118.25H327.23ZM327.23 89.2505V82.0006H328.77V89.2505H327.23ZM328 82.7706H325.75V81.2306H328V82.7706ZM321.25 82.7706H319V81.2306H321.25V82.7706ZM328 314H328.77V314.77H328V314ZM328 82.0006V81.2306H328.77V82.0006H328ZM319.456 314.544C319.155 314.244 319.155 313.756 319.456 313.456L324.356 308.555C324.656 308.255 325.144 308.255 325.445 308.555C325.745 308.856 325.745 309.344 325.445 309.644L321.089 314L325.445 318.356C325.745 318.656 325.745 319.144 325.445 319.445C325.144 319.745 324.656 319.745 324.356 319.445L319.456 314.544ZM320 313.23H322V314.77H320V313.23ZM326 313.23H328V314.77H326V313.23ZM327.23 314V306.75H328.77V314H327.23ZM327.23 292.25V277.75H328.77V292.25H327.23ZM327.23 263.25V248.75H328.77V263.25H327.23ZM327.23 234.25V219.75H328.77V234.25H327.23ZM327.23 205.25V190.75H328.77V205.25H327.23ZM327.23 176.25V161.75H328.77V176.25H327.23ZM327.23 147.25V132.75H328.77V147.25H327.23ZM327.23 118.25V103.751H328.77V118.25H327.23ZM327.23 89.2505V82.0006H328.77V89.2505H327.23ZM328 82.7706H325.75V81.2306H328V82.7706ZM321.25 82.7706H319V81.2306H321.25V82.7706Z" fill="#003366"/>
<path d="M15 397H14.23V396.23H15V397ZM15 504V504.77H14.23V504H15ZM23.5445 396.456C23.8452 396.756 23.8452 397.244 23.5445 397.544L18.6442 402.445C18.3435 402.745 17.856 402.745 17.5553 402.445C17.2546 402.144 17.2546 401.656 17.5553 401.356L21.9111 397L17.5553 392.644C17.2546 392.344 17.2546 391.856 17.5553 391.555C17.856 391.255 18.3435 391.255 18.6442 391.555L23.5445 396.456ZM15.77 397L15.77 504H14.23L14.23 397H15.77ZM15 503.23H24V504.77H15V503.23ZM15 396.23H23V397.77H15V396.23Z" fill="#003366"/>
<path d="M15 313.5H14.23V314.27H15V313.5ZM15 203V202.23H14.23V203H15ZM23.5445 314.044C23.8452 313.744 23.8452 313.256 23.5445 312.956L18.6442 308.055C18.3435 307.755 17.856 307.755 17.5553 308.055C17.2546 308.356 17.2546 308.844 17.5553 309.144L21.9111 313.5L17.5553 317.856C17.2546 318.156 17.2546 318.644 17.5553 318.945C17.856 319.245 18.3435 319.245 18.6442 318.945L23.5445 314.044ZM23 312.73H21V314.27H23V312.73ZM17 312.73H15V314.27H17V312.73ZM15.77 313.5V306.594H14.23V313.5H15.77ZM15.77 292.781V278.969H14.23V292.781H15.77ZM15.77 265.156V251.344H14.23V265.156H15.77ZM15.77 237.531V223.719H14.23V237.531H15.77ZM15.77 209.906V203H14.23V209.906H15.77ZM15 203.77H17.25V202.23H15V203.77ZM21.75 203.77H24V202.23H21.75V203.77ZM15 313.5H14.23V314.27H15V313.5ZM15 203V202.23H14.23V203H15ZM23.5445 314.044C23.8452 313.744 23.8452 313.256 23.5445 312.956L18.6442 308.055C18.3435 307.755 17.856 307.755 17.5553 308.055C17.2546 308.356 17.2546 308.844 17.5553 309.144L21.9111 313.5L17.5553 317.856C17.2546 318.156 17.2546 318.644 17.5553 318.945C17.856 319.245 18.3435 319.245 18.6442 318.945L23.5445 314.044ZM23 312.73H21V314.27H23V312.73ZM17 312.73H15V314.27H17V312.73ZM15.77 313.5V306.594H14.23V313.5H15.77ZM15.77 292.781V278.969H14.23V292.781H15.77ZM15.77 265.156V251.344H14.23V265.156H15.77ZM15.77 237.531V223.719H14.23V237.531H15.77ZM15.77 209.906V203H14.23V209.906H15.77ZM15 203.77H17.25V202.23H15V203.77ZM21.75 203.77H24V202.23H21.75V203.77Z" fill="#003366"/>
<defs>
<filter id="filter0_i_6578_12715" x="48" y="56" width="16" height="18" filterUnits="userSpaceOnUse" color-interpolation-filters="sRGB">
<feFlood flood-opacity="0" result="BackgroundImageFix"/>
<feBlend mode="normal" in="SourceGraphic" in2="BackgroundImageFix" result="shape"/>
<feColorMatrix in="SourceAlpha" type="matrix" values="0 0 0 0 0 0 0 0 0 0 0 0 0 0 0 0 0 0 127 0" result="hardAlpha"/>
<feOffset dy="4"/>
<feGaussianBlur stdDeviation="2"/>
<feComposite in2="hardAlpha" operator="arithmetic" k2="-1" k3="1"/>
<feColorMatrix type="matrix" values="0 0 0 0 0 0 0 0 0 0.2 0 0 0 0 0.4 0 0 0 0.1 0"/>
<feBlend mode="normal" in2="shape" result="effect1_innerShadow_6578_12715"/>
</filter>
<filter id="filter1_i_6578_12715" x="48" y="177.25" width="15.75" height="22" filterUnits="userSpaceOnUse" color-interpolation-filters="sRGB">
<feFlood flood-opacity="0" result="BackgroundImageFix"/>
<feBlend mode="normal" in="SourceGraphic" in2="BackgroundImageFix" result="shape"/>
<feColorMatrix in="SourceAlpha" type="matrix" values="0 0 0 0 0 0 0 0 0 0 0 0 0 0 0 0 0 0 127 0" result="hardAlpha"/>
<feOffset dy="4"/>
<feGaussianBlur stdDeviation="2"/>
<feComposite in2="hardAlpha" operator="arithmetic" k2="-1" k3="1"/>
<feColorMatrix type="matrix" values="0 0 0 0 0 0 0 0 0 0.2 0 0 0 0 0.4 0 0 0 0.1 0"/>
<feBlend mode="normal" in2="shape" result="effect1_innerShadow_6578_12715"/>
</filter>
<filter id="filter2_i_6578_12715" x="48" y="302" width="27" height="28" filterUnits="userSpaceOnUse" color-interpolation-filters="sRGB">
<feFlood flood-opacity="0" result="BackgroundImageFix"/>
<feBlend mode="normal" in="SourceGraphic" in2="BackgroundImageFix" result="shape"/>
<feColorMatrix in="SourceAlpha" type="matrix" values="0 0 0 0 0 0 0 0 0 0 0 0 0 0 0 0 0 0 127 0" result="hardAlpha"/>
<feOffset dy="4"/>
<feGaussianBlur stdDeviation="2"/>
<feComposite in2="hardAlpha" operator="arithmetic" k2="-1" k3="1"/>
<feColorMatrix type="matrix" values="0 0 0 0 0 0 0 0 0 0.2 0 0 0 0 0.4 0 0 0 0.1 0"/>
<feBlend mode="normal" in2="shape" result="effect1_innerShadow_6578_12715"/>
</filter>
<filter id="filter3_i_6578_12715" x="48" y="476.938" width="7.875" height="18.625" filterUnits="userSpaceOnUse" color-interpolation-filters="sRGB">
<feFlood flood-opacity="0" result="BackgroundImageFix"/>
<feBlend mode="normal" in="SourceGraphic" in2="BackgroundImageFix" result="shape"/>
<feColorMatrix in="SourceAlpha" type="matrix" values="0 0 0 0 0 0 0 0 0 0 0 0 0 0 0 0 0 0 127 0" result="hardAlpha"/>
<feOffset dy="4"/>
<feGaussianBlur stdDeviation="2"/>
<feComposite in2="hardAlpha" operator="arithmetic" k2="-1" k3="1"/>
<feColorMatrix type="matrix" values="0 0 0 0 0 0 0 0 0 0.2 0 0 0 0 0.4 0 0 0 0.1 0"/>
<feBlend mode="normal" in2="shape" result="effect1_innerShadow_6578_12715"/>
</filter>
<filter id="filter4_i_6578_12715" x="53.625" y="477.5" width="12.375" height="17.5" filterUnits="userSpaceOnUse" color-interpolation-filters="sRGB">
<feFlood flood-opacity="0" result="BackgroundImageFix"/>
<feBlend mode="normal" in="SourceGraphic" in2="BackgroundImageFix" result="shape"/>
<feColorMatrix in="SourceAlpha" type="matrix" values="0 0 0 0 0 0 0 0 0 0 0 0 0 0 0 0 0 0 127 0" result="hardAlpha"/>
<feOffset dy="4"/>
<feGaussianBlur stdDeviation="2"/>
<feComposite in2="hardAlpha" operator="arithmetic" k2="-1" k3="1"/>
<feColorMatrix type="matrix" values="0 0 0 0 0 0 0 0 0 0.2 0 0 0 0 0.4 0 0 0 0.1 0"/>
<feBlend mode="normal" in2="shape" result="effect1_innerShadow_6578_12715"/>
</filter>
<filter id="filter5_i_6578_12715" x="48" y="597.938" width="7.875" height="18.625" filterUnits="userSpaceOnUse" color-interpolation-filters="sRGB">
<feFlood flood-opacity="0" result="BackgroundImageFix"/>
<feBlend mode="normal" in="SourceGraphic" in2="BackgroundImageFix" result="shape"/>
<feColorMatrix in="SourceAlpha" type="matrix" values="0 0 0 0 0 0 0 0 0 0 0 0 0 0 0 0 0 0 127 0" result="hardAlpha"/>
<feOffset dy="4"/>
<feGaussianBlur stdDeviation="2"/>
<feComposite in2="hardAlpha" operator="arithmetic" k2="-1" k3="1"/>
<feColorMatrix type="matrix" values="0 0 0 0 0 0 0 0 0 0.2 0 0 0 0 0.4 0 0 0 0.1 0"/>
<feBlend mode="normal" in2="shape" result="effect1_innerShadow_6578_12715"/>
</filter>
<filter id="filter6_i_6578_12715" x="53.625" y="598.5" width="12.375" height="17.5" filterUnits="userSpaceOnUse" color-interpolation-filters="sRGB">
<feFlood flood-opacity="0" result="BackgroundImageFix"/>
<feBlend mode="normal" in="SourceGraphic" in2="BackgroundImageFix" result="shape"/>
<feColorMatrix in="SourceAlpha" type="matrix" values="0 0 0 0 0 0 0 0 0 0 0 0 0 0 0 0 0 0 127 0" result="hardAlpha"/>
<feOffset dy="4"/>
<feGaussianBlur stdDeviation="2"/>
<feComposite in2="hardAlpha" operator="arithmetic" k2="-1" k3="1"/>
<feColorMatrix type="matrix" values="0 0 0 0 0 0 0 0 0 0.2 0 0 0 0 0.4 0 0 0 0.1 0"/>
<feBlend mode="normal" in2="shape" result="effect1_innerShadow_6578_12715"/>
</filter>
</defs>
</svg>
