<?xml version="1.0" encoding="utf-8"?>
<svg width="32px" height="32px" viewBox="0 0 32 32" fill="none" xmlns="http://www.w3.org/2000/svg">
  <g filter="url(#filter0_i_767_9908)" transform="matrix(1, 0, 0, 1, 4, 4)">
    <path d="M24 12C24 18.6562 18.6094 24 12 24C5.34375 24 0 18.6562 0 12C0 5.39062 5.34375 0 12 0C18.6094 0 24 5.39062 24 12ZM2.67188 9.04688L3.14062 9.84375C3.51562 10.5 4.125 11.0156 4.92188 11.25L7.59375 12C8.4375 12.2344 9 12.9844 9 13.8281V15.7031C9 16.2188 9.28125 16.6875 9.75 16.875C10.1719 17.1094 10.5 17.5781 10.5 18.0938V19.9219C10.5 20.6719 11.1562 21.1875 11.8594 21C12.6562 20.7656 13.2188 20.1562 13.4062 19.4062L13.5469 18.8906C13.7344 18.0938 14.25 17.4375 14.9531 17.0156L15.3281 16.7812C16.0312 16.4062 16.5 15.6562 16.5 14.8594V14.4375C16.5 13.875 16.2188 13.2656 15.7969 12.8438L15.6562 12.7031C15.2344 12.2812 14.625 12 14.0625 12H12C11.4844 12 10.9688 11.9062 10.5469 11.625L8.90625 10.6875C8.71875 10.5938 8.57812 10.4062 8.48438 10.1719C8.34375 9.75 8.53125 9.23438 8.95312 9.04688L9.23438 8.90625C9.5625 8.71875 9.89062 8.71875 10.2188 8.8125L11.3438 9.1875C11.7188 9.32812 12.1406 9.14062 12.375 8.8125C12.5625 8.48438 12.5625 8.0625 12.2812 7.73438L11.6719 6.98438C11.2031 6.42188 11.2031 5.625 11.6719 5.0625L12.4219 4.21875C12.8438 3.70312 12.8906 3.04688 12.5625 2.48438L12.4688 2.29688C12.2812 2.29688 12.1406 2.25 12 2.25C7.64062 2.25 3.9375 5.10938 2.67188 9.04688ZM20.4844 7.26562L19.3125 7.73438C18.5625 8.0625 18.1875 8.85938 18.4219 9.60938L19.2188 12C19.3594 12.4688 19.7812 12.8438 20.2969 12.9844L21.6562 13.3125C21.7031 12.8906 21.75 12.4688 21.75 12C21.75 10.3125 21.2812 8.67188 20.4844 7.26562Z" fill="url(#paint0_linear_767_9908)" fill-opacity="0.4"/>
  </g>
  <defs>
    <filter id="filter0_i_767_9908" x="0" y="0" width="24" height="28" filterUnits="userSpaceOnUse" color-interpolation-filters="sRGB">
      <feFlood flood-opacity="0" result="BackgroundImageFix"/>
      <feBlend mode="normal" in="SourceGraphic" in2="BackgroundImageFix" result="shape"/>
      <feColorMatrix in="SourceAlpha" type="matrix" values="0 0 0 0 0 0 0 0 0 0 0 0 0 0 0 0 0 0 127 0" result="hardAlpha"/>
      <feOffset dy="4"/>
      <feGaussianBlur stdDeviation="2"/>
      <feComposite in2="hardAlpha" operator="arithmetic" k2="-1" k3="1"/>
      <feColorMatrix type="matrix" values="0 0 0 0 0 0 0 0 0 0.2 0 0 0 0 0.4 0 0 0 0.1 0"/>
      <feBlend mode="normal" in2="shape" result="effect1_innerShadow_767_9908"/>
    </filter>
    <linearGradient id="paint0_linear_767_9908" x1="24.06" y1="-2" x2="-3.62107" y2="21.786" gradientUnits="userSpaceOnUse">
      <stop stop-color="#96AAB7"/>
      <stop offset="1" stop-color="#728896"/>
    </linearGradient>
  </defs>
</svg>