[
    {
        "id": "general",
        "icon": "https://rabingolemio.blob.core.windows.net/rabin-lkod/sparql/data-theme/general.svg"
    },
    {
        "id": "AGRI",
        "icon": "https://rabingolemio.blob.core.windows.net/rabin-lkod/sparql/data-theme/agriculture.svg"
    },
    {
        "id": "EDUC",
        "icon": "https://rabingolemio.blob.core.windows.net/rabin-lkod/sparql/data-theme/education.svg"
    },
    {
        "id": "ENER",
        "icon": "https://rabingolemio.blob.core.windows.net/rabin-lkod/sparql/data-theme/energy.svg"
    },
    {
        "id": "ENVI",
        "icon": "https://rabingolemio.blob.core.windows.net/rabin-lkod/sparql/data-theme/enviroment.svg"
    },
    {
        "id": "ECON",
        "icon": "https://rabingolemio.blob.core.windows.net/rabin-lkod/sparql/data-theme/finance.svg"
    },
    {
        "id": "GOVE",
        "icon": "https://rabingolemio.blob.core.windows.net/rabin-lkod/sparql/data-theme/government.svg"
    },
    {
        "id": "HEAL",
        "icon": "https://rabingolemio.blob.core.windows.net/rabin-lkod/sparql/data-theme/health.svg"
    },
    {
        "id": "INTR",
        "icon": "https://rabingolemio.blob.core.windows.net/rabin-lkod/sparql/data-theme/international.svg"
    },
    {
        "id": "JUST",
        "icon": "https://rabingolemio.blob.core.windows.net/rabin-lkod/sparql/data-theme/justice.svg"
    },
    {
        "id": "OP_DATPRO",
        "icon": "https://rabingolemio.blob.core.windows.net/rabin-lkod/sparql/data-theme/predata.svg"
    },
    {
        "id": "REGI",
        "icon": "https://rabingolemio.blob.core.windows.net/rabin-lkod/sparql/data-theme/regions.svg"
    },
    {
        "id": "TECH",
        "icon": "https://rabingolemio.blob.core.windows.net/rabin-lkod/sparql/data-theme/science.svg"
    },
    {
        "id": "SOCI",
        "icon": "https://rabingolemio.blob.core.windows.net/rabin-lkod/sparql/data-theme/society.svg"
    },
    {
        "id": "TRAN",
        "icon": "https://rabingolemio.blob.core.windows.net/rabin-lkod/sparql/data-theme/transportation.svg"
    }
]
