<svg width="9" height="14" viewBox="0 0 9 14" fill="none" xmlns="http://www.w3.org/2000/svg">
<path d="M2.05078 2L7.05078 7L2.05078 12" stroke="#D61A29" stroke-width="2" stroke-linecap="square"/>
</svg>
