<?xml version="1.0" encoding="utf-8"?>
<svg width="32" height="32" viewBox="0 0 32 32" fill="none" xmlns="http://www.w3.org/2000/svg">
  <g filter="url(#filter0_i_789_8653)" transform="matrix(1, 0, 0, 1, -1, -0.023451)">
    <path d="M15.875 4.28125C16.5781 3.95312 17.375 3.95312 18.0781 4.28125L28.3438 9.01562C28.7188 9.20312 29 9.57812 29 10C29 10.4688 28.7188 10.8438 28.3438 11.0312L18.0781 15.7656C17.375 16.0938 16.5781 16.0938 15.875 15.7656L5.60938 11.0312C5.23438 10.8438 5 10.4688 5 10C5 9.57812 5.23438 9.20312 5.60938 9.01562L15.875 4.28125ZM28.3438 15.0156C28.7188 15.2031 29 15.5781 29 16C29 16.4688 28.7188 16.8438 28.3438 17.0312L18.0781 21.7656C17.375 22.0938 16.5781 22.0938 15.875 21.7656L5.60938 17.0312C5.23438 16.8438 5 16.4688 5 16C5 15.5781 5.23438 15.2031 5.60938 15.0156L8.14062 13.8438L15.2656 17.125C16.3438 17.6406 17.6094 17.6406 18.6875 17.125L25.8125 13.8438L28.3438 15.0156ZM18.6875 23.125L25.8125 19.8438L28.3438 21.0156C28.7188 21.2031 29 21.5781 29 22C29 22.4688 28.7188 22.8438 28.3438 23.0312L18.0781 27.7656C17.375 28.0938 16.5781 28.0938 15.875 27.7656L5.60938 23.0312C5.23438 22.8438 5 22.4688 5 22C5 21.5781 5.23438 21.2031 5.60938 21.0156L8.14062 19.8438L15.2656 23.125C16.3438 23.6406 17.6094 23.6406 18.6875 23.125Z" fill="url(#paint0_linear_789_8653)" fill-opacity="0.4"/>
  </g>
  <defs>
    <filter id="filter0_i_789_8653" x="5" y="3.95312" width="24" height="28.1406" filterUnits="userSpaceOnUse" color-interpolation-filters="sRGB">
      <feFlood flood-opacity="0" result="BackgroundImageFix"/>
      <feBlend mode="normal" in="SourceGraphic" in2="BackgroundImageFix" result="shape"/>
      <feColorMatrix in="SourceAlpha" type="matrix" values="0 0 0 0 0 0 0 0 0 0 0 0 0 0 0 0 0 0 127 0" result="hardAlpha"/>
      <feOffset dy="4"/>
      <feGaussianBlur stdDeviation="2"/>
      <feComposite in2="hardAlpha" operator="arithmetic" k2="-1" k3="1"/>
      <feColorMatrix type="matrix" values="0 0 0 0 0 0 0 0 0 0.2 0 0 0 0 0.4 0 0 0 0.1 0"/>
      <feBlend mode="normal" in2="shape" result="effect1_innerShadow_789_8653"/>
    </filter>
    <linearGradient id="paint0_linear_789_8653" x1="29.06" y1="4" x2="5.06008" y2="28.0599" gradientUnits="userSpaceOnUse">
      <stop stop-color="#96AAB7"/>
      <stop offset="1" stop-color="#728896"/>
    </linearGradient>
  </defs>
</svg>