<?xml version="1.0" encoding="utf-8"?>
<svg width="32px" height="32" viewBox="0 0 32 32" fill="none" xmlns="http://www.w3.org/2000/svg">
  <g filter="url(#filter0_i_767_9949)" transform="matrix(1, 0, 0, 1, 3.523447, -0.019917)">
    <path d="M20.75 16C23 19.6094 23.8906 23.3125 21.8281 25.375C19.8594 27.2969 16.3906 26.7344 12.5 24.2969C8.5625 26.7344 5.09375 27.2969 3.125 25.375C1.0625 23.3125 1.95312 19.6094 4.20312 16.0469C1.95312 12.4375 1.0625 8.73438 3.125 6.67188C5.1875 4.60938 8.89062 5.5 12.5 7.75C16.0625 5.5 19.7656 4.60938 21.8281 6.67188C23.8906 8.73438 23 12.4375 20.75 16ZM9.82812 22.375C8.60938 21.3906 7.48438 20.3125 6.125 18.6719C4.95312 20.9219 4.67188 22.6562 5.28125 23.2188C5.84375 23.8281 7.57812 23.5469 9.82812 22.375ZM6.125 13.375C7.20312 12.0156 8.46875 10.75 9.82812 9.625C7.10938 8.21875 5.70312 8.35938 5.28125 8.82812C4.67188 9.39062 4.95312 11.125 6.125 13.375ZM17.1406 16C15.7812 14.2656 14.2344 12.6719 12.5 11.3594C10.7188 12.6719 9.17188 14.2656 7.85938 16C9.03125 17.5938 10.3906 19.0469 12.5 20.6406C14.0938 19.4219 15.5 18.1094 17.1406 16ZM13.9531 16C13.9531 16.7969 13.25 17.5 12.4531 17.5C11.6094 17.5 10.9531 16.7969 10.9531 16C10.9531 15.1562 11.6094 14.5 12.4531 14.5C13.25 14.5 13.9531 15.2031 13.9531 16ZM19.6719 8.82812C19.25 8.35938 17.7969 8.21875 15.125 9.625C16.4844 10.75 17.75 12.0156 18.8281 13.375C20 11.125 20.2812 9.39062 19.6719 8.82812ZM18.8281 18.6719C17.4688 20.3125 16.3438 21.3906 15.125 22.375C17.375 23.5469 19.1094 23.8281 19.6719 23.2188C20.2812 22.6562 20 20.9219 18.8281 18.6719Z" fill="url(#paint0_linear_767_9949)" fill-opacity="0.4"/>
  </g>
  <defs>
    <filter id="filter0_i_767_9949" x="1.0625" y="4.60938" width="22.8281" height="26.6875" filterUnits="userSpaceOnUse" color-interpolation-filters="sRGB">
      <feFlood flood-opacity="0" result="BackgroundImageFix"/>
      <feBlend mode="normal" in="SourceGraphic" in2="BackgroundImageFix" result="shape"/>
      <feColorMatrix in="SourceAlpha" type="matrix" values="0 0 0 0 0 0 0 0 0 0 0 0 0 0 0 0 0 0 127 0" result="hardAlpha"/>
      <feOffset dy="4"/>
      <feGaussianBlur stdDeviation="2"/>
      <feComposite in2="hardAlpha" operator="arithmetic" k2="-1" k3="1"/>
      <feColorMatrix type="matrix" values="0 0 0 0 0 0 0 0 0 0.2 0 0 0 0 0.4 0 0 0 0.1 0"/>
      <feBlend mode="normal" in2="shape" result="effect1_innerShadow_767_9949"/>
    </filter>
    <linearGradient id="paint0_linear_767_9949" x1="23.0525" y1="2" x2="-3.84622" y2="22.2245" gradientUnits="userSpaceOnUse">
      <stop stop-color="#96AAB7"/>
      <stop offset="1" stop-color="#728896"/>
    </linearGradient>
  </defs>
</svg>