<svg width="164" height="54" viewBox="0 0 164 54" fill="none" xmlns="http://www.w3.org/2000/svg">
<path d="M50.9431 36.9181C48.4788 37.8844 46.4494 38.3676 44.6857 38.3676C40.2645 38.3676 37.317 35.5168 37.317 31.2646C37.317 27.0367 40.3128 24.2341 44.8065 24.2341C46.5219 24.2341 48.2131 24.4516 49.8559 24.8623L49.2761 27.8581C47.2708 27.5199 46.0387 27.3749 45.1206 27.3749C42.5597 27.3749 40.8685 28.9211 40.8685 31.2646C40.8685 33.6323 42.4147 35.2269 44.7341 35.2269C45.8696 35.2027 46.9809 35.0336 48.0923 34.7678V32.8109H43.7918V30.0808H50.9431V36.9181ZM72.6628 31.313C72.6628 35.5651 69.667 38.3918 65.3907 38.3918C61.1144 38.3918 58.1186 35.5651 58.1186 31.313C58.1186 27.0608 61.0903 24.2341 65.3907 24.2341C69.6912 24.2341 72.6628 27.0608 72.6628 31.313ZM69.1838 31.313C69.1838 28.9211 67.5893 27.3507 65.3666 27.3507C63.1439 27.3507 61.5493 28.9211 61.5493 31.313C61.5493 33.7048 63.1439 35.2993 65.3424 35.2993C67.541 35.2993 69.1838 33.7048 69.1838 31.313ZM79.9108 38.0777V24.524H83.2449V35.1061H89.913V38.0777H79.9108ZM106.293 29.8634V32.7384H100.302V35.1544H107.187V38.0777H96.9435V24.524H107.187V27.4474H100.302V29.8634H106.293ZM123.809 38.0777H121.345L118.108 31.5304L117.697 38.0777H114.411L115.112 24.524H118.132L122.577 33.6806L127.023 24.524H130.018L130.743 38.0777H127.482L127.047 31.5304L123.809 38.0777ZM141.712 24.524H138.353V38.0777H141.712V24.524ZM163.504 31.313C163.504 35.5651 160.508 38.3918 156.232 38.3918C151.955 38.3918 148.96 35.5651 148.96 31.313C148.96 27.0608 151.931 24.2341 156.232 24.2341C160.532 24.2341 163.504 27.0608 163.504 31.313ZM160.025 31.313C160.025 28.9211 158.43 27.3507 156.208 27.3507C153.985 27.3507 152.39 28.9211 152.39 31.313C152.39 33.7048 153.985 35.2993 156.208 35.2993C158.43 35.2993 160.025 33.7048 160.025 31.313ZM40.4819 3.45665C36.7855 -0.239808 30.818 -0.215648 27.1215 3.45665C25.9135 4.71296 25.0438 6.25919 24.6331 7.95038C17.6267 3.36001 8.22851 5.24448 3.5415 12.1784L8.34931 14.1595C8.54259 13.9179 8.76003 13.7004 8.97747 13.483C12.988 9.47246 19.487 9.47246 23.4975 13.483L29.4409 9.54493C29.7791 7.12895 32.0018 5.43776 34.3936 5.776C36.7855 6.11423 38.5008 8.33694 38.1626 10.7288C37.8243 13.1206 35.6016 14.8359 33.2098 14.4977C32.63 14.4252 32.0743 14.2319 31.5669 13.9179L26.0102 17.6143C27.7255 23.0261 24.7539 28.8003 19.342 30.5398C19.1004 30.6123 18.883 30.6848 18.6414 30.7331V37.0147C21.7822 38.3435 23.2559 41.9916 21.9271 45.1324C20.5984 48.2732 16.9502 49.7469 13.8094 48.4181C10.6687 47.0894 9.1949 43.4412 10.5237 40.3004C11.1519 38.8267 12.3357 37.6428 13.8094 37.0147V30.7331C9.1949 29.6218 5.95748 25.4904 5.95748 20.7551C5.95748 20.0062 6.02996 19.2572 6.19908 18.5324L1.48791 16.5996C-0.444879 23.4852 2.62342 30.7814 8.90499 34.2121C8.68755 34.4054 8.47011 34.5987 8.27683 34.792C3.87974 39.1649 3.87974 46.2921 8.27683 50.665C12.6739 55.0379 19.7769 55.0621 24.1499 50.665C28.5228 46.2679 28.5469 39.1649 24.1499 34.792C23.9566 34.5987 23.7391 34.3813 23.5217 34.2121C28.4503 31.5304 31.5186 26.3844 31.5186 20.7551C31.5186 20.2719 31.4945 19.7887 31.4461 19.3055C32.2192 19.4988 32.9924 19.5954 33.7896 19.5954C39.0082 19.5954 43.2361 15.3675 43.2361 10.1731C43.2603 7.63631 42.2697 5.24448 40.4819 3.45665ZM42.4872 44.5767C42.4872 45.3257 41.9315 45.8089 41.0376 45.8089H40.5786V46.7028H39.7571V43.3929C40.1437 43.3687 40.5786 43.3446 41.0376 43.3446C41.9073 43.3687 42.4872 43.8036 42.4872 44.5767ZM41.1101 45.0841C41.4 45.1324 41.6416 44.915 41.6899 44.6492C41.7382 44.3593 41.5208 44.1177 41.255 44.0694H40.6027V45.0841H41.1101ZM49.0103 45.7606H48.6721V46.7028H47.8507V43.3929C48.1889 43.3687 48.7204 43.3687 49.1795 43.3687C50.0251 43.3687 50.5807 43.7795 50.5807 44.5526C50.5807 44.9633 50.3633 45.3498 50.0009 45.5431L50.7982 46.7028H49.8318L49.2278 45.7606H49.0103ZM49.1795 45.0841C49.4694 45.1082 49.711 44.915 49.7351 44.625V44.5767C49.7351 44.2385 49.5177 44.0935 49.1553 44.0935H48.6721V45.0841H49.1795ZM56.7898 46.7028H55.8959L57.3697 43.3687H58.1428L59.6165 46.7028H58.7226L58.5052 46.1713H57.0314L56.7898 46.7028ZM57.2972 45.4706H58.2153L57.7562 44.3593L57.2972 45.4706ZM67.9517 46.437C67.4685 46.6545 66.9611 46.7753 66.4296 46.7994C65.3424 46.7994 64.6418 46.0988 64.6418 45.0599C64.6418 44.0211 65.3666 43.3446 66.4779 43.3446C66.8886 43.3446 67.2994 43.3929 67.7101 43.4895L67.5651 44.2143C67.2269 44.1418 66.8886 44.1177 66.5504 44.0935C65.9222 44.0935 65.5115 44.4801 65.5115 45.0358C65.4874 45.5431 65.8498 45.9538 66.3571 46.0022H66.4538C66.7195 46.0022 67.0094 45.9538 67.2752 45.8814V45.3982H66.2363V44.7217H67.9758L67.9517 46.437ZM76.6251 45.229C76.6251 46.2196 76.0211 46.7994 75.0788 46.7994C74.1366 46.7994 73.5326 46.2196 73.5326 45.229V43.4171H74.354V45.229C74.354 45.7364 74.6198 46.0263 75.0788 46.0263C75.5379 46.0263 75.8036 45.7364 75.8036 45.229V43.4171H76.6251V45.229ZM84.4529 44.6975V45.3982H83.0033V46.0022H84.6703V46.7028H82.1818V43.4171H84.6703V44.1177H83.0033V44.6975H84.4529ZM98.9246 44.2385C98.6105 44.166 98.2723 44.1177 97.9582 44.1177C97.2576 44.1177 96.8952 44.5042 96.8952 45.0599C96.871 45.5914 97.3059 46.0263 97.8133 46.0263H97.9099C98.2481 46.0022 98.5864 45.978 98.9246 45.9055L99.0696 46.6303C98.683 46.7511 98.2723 46.7994 97.8616 46.7994C96.7502 46.7994 96.0254 46.0988 96.0254 45.0599C96.0254 44.0211 96.7744 43.3446 97.8616 43.3446C98.2723 43.3446 98.683 43.3929 99.0696 43.5137L98.9246 44.2385ZM105.399 43.4171H104.578V46.727H105.399V43.4171ZM112.647 46.7028H111.826V44.1418H110.739V43.4171H113.759V44.1418H112.647V46.7028ZM118.929 43.4171H119.847L120.668 44.7942L121.49 43.4171H122.408L121.079 45.6639V46.7028H120.258V45.6639L118.929 43.4171ZM136.88 45.0599C136.928 45.9538 136.227 46.7028 135.334 46.7511H135.164C134.681 46.7511 134.222 46.727 133.86 46.7028V43.4171C134.222 43.3929 134.633 43.3687 135.092 43.3687C136.155 43.3687 136.88 44.0211 136.88 45.0599ZM136.034 45.0599C136.082 44.5767 135.696 44.1418 135.213 44.1177H134.681V46.0022H135.189C135.672 46.0022 136.034 45.6156 136.034 45.0599ZM142.823 46.7028H141.929L143.403 43.3687H144.176L145.65 46.7028H144.756L144.514 46.1713H143.041L142.823 46.7028ZM143.33 45.4706H144.249L143.789 44.3593L143.33 45.4706ZM152.245 46.7028H151.424V44.1418H150.313V43.4171H153.357V44.1418H152.245V46.7028ZM158.938 46.7028H158.044L159.518 43.3687H160.291L161.764 46.7028H160.87L160.629 46.1713H159.155L158.938 46.7028ZM159.445 45.4706H160.363L159.904 44.3593L159.445 45.4706Z" fill="url(#paint0_linear_2690_8051)" fill-opacity="0.4"/>
<defs>
<linearGradient id="paint0_linear_2690_8051" x1="163.91" y1="0.69336" x2="132.462" y2="96.938" gradientUnits="userSpaceOnUse">
<stop stop-color="#96AAB7"/>
<stop offset="1" stop-color="#728896"/>
</linearGradient>
</defs>
</svg>
