<?xml version="1.0" encoding="utf-8"?>
<svg width="32" height="32" viewBox="0 0 32 32" fill="none" xmlns="http://www.w3.org/2000/svg">
  <g filter="url(#filter0_i_767_10488)" transform="matrix(1, 0, 0, 1, -0.499909, 0)">
    <path d="M27.4688 11.2656C26.6719 9.625 24.2812 9.625 23.4844 11.2656C19.4062 19.4219 19.5 19.0469 19.5 19.75C19.5 21.8594 22.2188 23.5 25.5 23.5C28.8281 23.5 31.5 21.8594 31.5 19.75C31.4531 19 31.5469 19.375 27.4688 11.2656ZM22.0781 19L25.4531 12.25L28.8281 19H22.0781ZM13.5 19.75C13.5 19 13.5469 19.375 9.46875 11.2656C8.67188 9.625 6.28125 9.625 5.48438 11.2656C1.40625 19.4219 1.5 19.0469 1.5 19.75C1.5 21.8594 4.21875 23.5 7.5 23.5C10.7344 23.5 13.5 21.8594 13.5 19.75ZM7.45312 12.25L10.875 19H4.07812L7.45312 12.25ZM24.7031 25H18V11.2188C19.0781 10.7031 19.9219 9.71875 20.1562 8.5H25.5C26.2969 8.5 26.9531 7.84375 26.9531 7C26.9531 6.20312 26.25 5.5 25.5 5.5H19.4531C18.75 4.60938 17.7188 4 16.4531 4C15.2344 4 14.1562 4.60938 13.5 5.5H7.5C6.65625 5.5 6 6.20312 6 7C6 7.84375 6.65625 8.5 7.45312 8.5H12.75C12.9844 9.71875 13.8281 10.7031 14.9531 11.2188V25H8.25C6.98438 25 5.95312 26.0312 5.95312 27.25C5.95312 27.6719 6.32812 28 6.70312 28H26.2031C26.625 28 26.9531 27.6719 26.9531 27.25C27 26.0312 25.9688 25 24.7031 25Z" fill="url(#paint0_linear_767_10488)" fill-opacity="0.4"/>
  </g>
  <defs>
    <filter id="filter0_i_767_10488" x="1.40625" y="4" width="30.1406" height="28" filterUnits="userSpaceOnUse" color-interpolation-filters="sRGB">
      <feFlood flood-opacity="0" result="BackgroundImageFix"/>
      <feBlend mode="normal" in="SourceGraphic" in2="BackgroundImageFix" result="shape"/>
      <feColorMatrix in="SourceAlpha" type="matrix" values="0 0 0 0 0 0 0 0 0 0 0 0 0 0 0 0 0 0 127 0" result="hardAlpha"/>
      <feOffset dy="4"/>
      <feGaussianBlur stdDeviation="2"/>
      <feComposite in2="hardAlpha" operator="arithmetic" k2="-1" k3="1"/>
      <feColorMatrix type="matrix" values="0 0 0 0 0 0 0 0 0 0.2 0 0 0 0 0.4 0 0 0 0.1 0"/>
      <feBlend mode="normal" in2="shape" result="effect1_innerShadow_767_10488"/>
    </filter>
    <linearGradient id="paint0_linear_767_10488" x1="31.575" y1="2" x2="3.6464" y2="31.9983" gradientUnits="userSpaceOnUse">
      <stop stop-color="#96AAB7"/>
      <stop offset="1" stop-color="#728896"/>
    </linearGradient>
  </defs>
</svg>