<?xml version="1.0" encoding="utf-8"?>
<svg width="32" height="33" viewBox="0 0 25 33" fill="none" xmlns="http://www.w3.org/2000/svg">
  <rect width="24.693" height="32.989" fill="white" style="" y="-0.005"/>
  <g filter="url(#filter0_i_363_10923)" transform="matrix(1.231814, 0, 0, 1.231814, -7.34186, -3.85643)" style="">
    <path d="M17.6667 10.25V3.16663H7.25C6.55729 3.16663 6 3.72392 6 4.41663V28.5833C6 29.276 6.55729 29.8333 7.25 29.8333H24.75C25.4427 29.8333 26 29.276 26 28.5833V11.5H18.9167C18.2292 11.5 17.6667 10.9375 17.6667 10.25ZM20.6406 16.5H21.8854C22.2865 16.5 22.5833 16.8698 22.4948 17.2656L20.5156 26.0156C20.4531 26.302 20.1979 26.5 19.9062 26.5H17.9271C17.6406 26.5 17.3906 26.302 17.3229 26.026C15.9792 20.6354 16.2396 21.7968 15.9896 20.2708H15.9635C15.9062 21.0156 15.8385 21.177 14.6302 26.026C14.5625 26.302 14.3125 26.5 14.026 26.5H12.0938C11.8021 26.5 11.5469 26.2968 11.4844 26.0104L9.51562 17.2604C9.42708 16.8698 9.72396 16.5 10.125 16.5H11.401C11.6979 16.5 11.9583 16.7083 12.0156 17.0052C12.8281 21.0677 13.0625 22.7083 13.1094 23.3698C13.1927 22.8385 13.4896 21.6666 14.6406 16.9791C14.7083 16.6979 14.9583 16.5052 15.25 16.5052H16.7656C17.0573 16.5052 17.3073 16.7031 17.375 16.9843C18.625 22.2135 18.875 23.4427 18.9167 23.7239C18.9062 23.1406 18.7812 22.7968 20.0417 16.9948C20.0938 16.7031 20.349 16.5 20.6406 16.5ZM26 9.51558V9.83329H19.3333V3.16663H19.651C19.9844 3.16663 20.3021 3.29683 20.5365 3.53121L25.6354 8.63538C25.8698 8.86975 26 9.18746 26 9.51558Z" fill="url(#paint0_linear_363_10923)" fill-opacity="0.4"/>
  </g>
  <defs>
    <filter id="filter0_i_363_10923" x="6" y="3.16663" width="20" height="30.6666" filterUnits="userSpaceOnUse" color-interpolation-filters="sRGB">
      <feFlood flood-opacity="0" result="BackgroundImageFix"/>
      <feBlend mode="normal" in="SourceGraphic" in2="BackgroundImageFix" result="shape"/>
      <feColorMatrix in="SourceAlpha" type="matrix" values="0 0 0 0 0 0 0 0 0 0 0 0 0 0 0 0 0 0 127 0" result="hardAlpha"/>
      <feOffset dy="4"/>
      <feGaussianBlur stdDeviation="2"/>
      <feComposite in2="hardAlpha" operator="arithmetic" k2="-1" k3="1"/>
      <feColorMatrix type="matrix" values="0 0 0 0 0 0 0 0 0 0.2 0 0 0 0 0.4 0 0 0 0.1 0"/>
      <feBlend mode="normal" in2="shape" result="effect1_innerShadow_363_10923"/>
    </filter>
    <linearGradient id="paint0_linear_363_10923" x1="26.05" y1="3.16663" x2="0.43217" y2="22.428" gradientUnits="userSpaceOnUse">
      <stop stop-color="#96AAB7"/>
      <stop offset="1" stop-color="#728896"/>
    </linearGradient>
  </defs>
</svg>