<?xml version="1.0" encoding="utf-8"?>
<svg width="32" height="32" viewBox="0 0 32 32" fill="none" xmlns="http://www.w3.org/2000/svg">
  <g filter="url(#filter0_i_767_9918)" transform="matrix(1, 0, 0, 1, 1, 0)">
    <path d="M14.9531 19C17.6719 19 19.8281 16.8438 19.8281 14.125C19.8281 11.4531 17.625 9.25 14.9531 9.25C12.2812 9.25 10.125 11.4531 10.125 14.125C10.0781 16.8438 12.2812 19 14.9531 19ZM17.2969 20.5H12.6562C8.95312 20.5 6 23.3125 6 26.7812C6 27.4844 6.5625 28 7.3125 28H22.6406C23.3906 28 24 27.4844 24 26.7812C24 23.3125 21 20.5 17.2969 20.5ZM24 11.5C26.0625 11.5 27.75 9.85938 27.75 7.75C27.75 5.6875 26.0625 4 24 4C21.8906 4 20.25 5.6875 20.25 7.75C20.25 9.85938 21.8906 11.5 24 11.5ZM8.57812 14.125C8.57812 13.8906 8.625 13.6562 8.67188 13.4219C8.15625 13.1406 7.59375 13 6.98438 13H4.125C1.82812 13 0 14.9688 0 17.4062C0 17.875 0.328125 18.25 0.796875 18.25H10.1719C9.1875 17.1719 8.57812 15.7188 8.57812 14.125ZM6 11.5C8.0625 11.5 9.75 9.85938 9.75 7.75C9.75 5.6875 8.0625 4 6 4C3.89062 4 2.25 5.6875 2.25 7.75C2.25 9.85938 3.89062 11.5 6 11.5ZM25.8281 13H22.9688C22.3594 13 21.7969 13.1875 21.2812 13.4219C21.2812 13.6562 21.3281 13.8906 21.3281 14.125C21.3281 15.7188 20.7656 17.1719 19.7812 18.25H29.1562C29.625 18.25 30 17.875 30 17.4062C30 14.9688 28.125 13 25.8281 13Z" fill="url(#paint0_linear_767_9918)" fill-opacity="0.4"/>
  </g>
  <defs>
    <filter id="filter0_i_767_9918" x="0" y="4" width="30" height="28" filterUnits="userSpaceOnUse" color-interpolation-filters="sRGB">
      <feFlood flood-opacity="0" result="BackgroundImageFix"/>
      <feBlend mode="normal" in="SourceGraphic" in2="BackgroundImageFix" result="shape"/>
      <feColorMatrix in="SourceAlpha" type="matrix" values="0 0 0 0 0 0 0 0 0 0 0 0 0 0 0 0 0 0 127 0" result="hardAlpha"/>
      <feOffset dy="4"/>
      <feGaussianBlur stdDeviation="2"/>
      <feComposite in2="hardAlpha" operator="arithmetic" k2="-1" k3="1"/>
      <feColorMatrix type="matrix" values="0 0 0 0 0 0 0 0 0 0.2 0 0 0 0 0.4 0 0 0 0.1 0"/>
      <feBlend mode="normal" in2="shape" result="effect1_innerShadow_767_9918"/>
    </filter>
    <linearGradient id="paint0_linear_767_9918" x1="30.075" y1="2" x2="2.1464" y2="31.9983" gradientUnits="userSpaceOnUse">
      <stop stop-color="#96AAB7"/>
      <stop offset="1" stop-color="#728896"/>
    </linearGradient>
  </defs>
</svg>