<?xml version="1.0" encoding="utf-8"?>
<!-- Generator: Adobe Illustrator 15.0.0, SVG Export Plug-In . SVG Version: 6.00 Build 0)  -->
<!DOCTYPE svg PUBLIC "-//W3C//DTD SVG 1.1//EN" "http://www.w3.org/Graphics/SVG/1.1/DTD/svg11.dtd">
<svg version="1.1" id="Calque_1" xmlns="http://www.w3.org/2000/svg" xmlns:xlink="http://www.w3.org/1999/xlink" x="0px" y="0px"
	 width="40px" height="40px" viewBox="0 0 40 40" enable-background="new 0 0 40 40" xml:space="preserve">
<path fill="#22285D" d="M15.657,35.44c0,0.002,0,0.003,0,0.004l0.015,0.225l0,0c0.033,0.27,0.128,0.396,0.271,0.538l3.371,3.371
	c0.3,0.283,0.461,0.422,0.688,0.422c0.225,0,0.384-0.139,0.686-0.422l3.373-3.371c0.143-0.143,0.238-0.269,0.271-0.537l0,0
	l0.016-0.229V4.557c0-0.44-0.109-0.588-0.287-0.767l-3.373-3.369C20.385,0.138,20.227,0,20.002,0c-0.227,0-0.388,0.138-0.688,0.422
	L15.943,3.79c-0.179,0.179-0.286,0.327-0.286,0.767v21.409V35.44z"/>
<path fill="#21B3DA" d="M35.443,24.342h0.004l0.225-0.013l0,0c0.27-0.034,0.395-0.13,0.539-0.272l3.369-3.372
	c0.283-0.301,0.42-0.459,0.42-0.687c0-0.227-0.137-0.385-0.42-0.688l-3.369-3.37c-0.145-0.144-0.27-0.239-0.539-0.271l0,0
	l-0.227-0.015H24.344c-0.439,0-0.59,0.107-0.766,0.287l-3.371,3.37c-0.281,0.302-0.421,0.462-0.421,0.688
	c0,0.228,0.14,0.385,0.421,0.687l3.371,3.372c0.176,0.177,0.326,0.285,0.766,0.285h1.623H35.443z"/>
<path fill="#22285D" d="M23.578,24.057l-3.371-3.372c-0.281-0.301-0.421-0.462-0.421-0.687c0-0.227,0.14-0.385,0.421-0.688
	l3.371-3.37c0.176-0.179,0.326-0.287,0.766-0.287H4.559c-0.439,0-0.589,0.107-0.768,0.287l-3.369,3.37
	C0.141,19.613,0,19.772,0,19.999c0,0.225,0.141,0.385,0.422,0.687l3.371,3.373c0.178,0.176,0.327,0.285,0.768,0.285h19.777
	C23.904,24.342,23.754,24.232,23.578,24.057z"/>
</svg>
