60 00 11 00 00 50 4F 53 56 31 30 30 32 30 30 33 |`....POSV1002003
30 32 30 30 35 38 30 32 30 43 30 38 32 30 32 30 |020058020C082020
30 30 30 30 30 30 30 30 30 30 30 30 30 30 38 30 |0000000000000080
30 30 30 31 34 39 30 30 37 31 30 31 31 30 30 33 |0001490071011003
37 34 33 30 35 38 39 78 78 78 78 78 78 31 30 30 |7430589xxxxxx100
33 3D 32 32 31 30 78 78 78 78 78 78 78 78 78 78 |3=2210xxxxxxxxxx	
78 78 78 78 78 30 30 30 30 32 38 32 30 36 30 30 |xxxxx00002820600
30 30 30 30 30 33 37 31 31 32 31 31 30 39 37 38 |0000037112110978
31 32 30 82 02 20 00 84 07 A0 00 00 00 03 10 10 |120.. ..........
95 05 00 00 00 00 00 9A 03 21 01 19 9C 01 00 5F |.........!....._
2A 02 09 78 5F 34 01 01 9F 02 06 00 00 00 00 08 |*..x_4..........
00 9F 03 06 00 00 00 00 00 00 9F 10 07 06 00 0A |................
03 A0 00 00 9F 1A 02 03 00 9F 26 08 53 5E 02 AF |..........&.S^..
72 28 A2 AA 9F 27 01 80 9F 33 03 E0 F8 C8 9F 34 |r(...'...3.....4
03 1F 03 00 9F 35 01 22 9F 36 02 04 1D 9F 37 04 |.....5.".6....7.
F2 EA 29 35 9F 6E 04 20 70 00 00 30 33 37 30 30 |..)5.n. p..03700
30 36 31 33 32 20 30 20 30 30 30 38 33 37 30 30 |06132 0 00083700
30 33 36 39 30 30 30 34 33 38 30 33 30 30 30 33 |0369000438030003
39 36 4C 03                                     |96L.
