{
  "created_at": "2024-11-08T20:20:48.103592+00:00",
  "elapsed": 0.116515,
  "encoding": "utf-8",
  "headers": {
    "Accept-Ranges": "bytes",
    "Age": "0",
    "Allow": "OPTIONS, GET, HEAD, OPTIONS",
    "Connection": "keep-alive",
    "Content-Length": "454",
    "Content-Type": "application/json",
    "Cross-Origin-Opener-Policy": "same-origin",
    "Date": "Fri, 08 Nov 2024 20:20:48 GMT",
    "Referrer-Policy": "same-origin",
    "Strict-Transport-Security": "max-age=15768000;",
    "Vary": "Accept, origin, Cookie",
    "Via": "1.1 varnish (Varnish/6.5)",
    "X-Content-Type-Options": "nosniff",
    "X-Frame-Options": "DENY",
    "X-RateLimit-Limit": "120",
    "X-RateLimit-Remaining": "109",
    "X-RateLimit-Reset": "1731100477",
    "X-Varnish": "902267182"
  },
  "reason": "OK",
  "request": {
    "body": "",
    "headers": {
      "Accept": "*/*",
      "Accept-Encoding": "gzip, deflate",
      "Connection": "keep-alive",
      "User-Agent": "python-requests/2.25.1"
    },
    "method": "GET",
    "url": "https://archive.softwareheritage.org/api/1/snapshot/26fbb4b0961dff9e352fce3caea382282f232c2e/"
  },
  "status_code": 200,
  "url": "https://archive.softwareheritage.org/api/1/snapshot/26fbb4b0961dff9e352fce3caea382282f232c2e/",
  "_decoded_content": {
    "id": "26fbb4b0961dff9e352fce3caea382282f232c2e",
    "branches": {
      "HEAD": {
        "target": "refs/heads/main",
        "target_type": "alias",
        "target_url": "https://archive.softwareheritage.org/api/1/revision/aa99df948517724bdd0d783828505febc952b1e3/"
      },
      "refs/heads/main": {
        "target": "aa99df948517724bdd0d783828505febc952b1e3",
        "target_type": "revision",
        "target_url": "https://archive.softwareheritage.org/api/1/revision/aa99df948517724bdd0d783828505febc952b1e3/"
      }
    },
    "next_branch": null
  }
}