{
  "created_at": "2024-11-05T15:34:44.614678+00:00",
  "elapsed": 0.159711,
  "encoding": "utf-8",
  "headers": {
    "Accept-Ranges": "bytes",
    "Age": "0",
    "Allow": "OPTIONS, OPTIONS, HEAD, GET",
    "Connection": "keep-alive",
    "Content-Length": "3587",
    "Content-Type": "application/json",
    "Cross-Origin-Opener-Policy": "same-origin",
    "Date": "Tue, 05 Nov 2024 15:34:44 GMT",
    "Referrer-Policy": "same-origin",
    "Strict-Transport-Security": "max-age=15768000;",
    "Vary": "Accept, origin, Cookie",
    "Via": "1.1 varnish (Varnish/6.5)",
    "X-Content-Type-Options": "nosniff",
    "X-Frame-Options": "DENY",
    "X-RateLimit-Limit": "120",
    "X-RateLimit-Remaining": "114",
    "X-RateLimit-Reset": "1730824483",
    "X-Varnish": "114447728"
  },
  "reason": "OK",
  "request": {
    "body": "",
    "headers": {
      "Accept": "*/*",
      "Accept-Encoding": "gzip, deflate",
      "Connection": "keep-alive",
      "User-Agent": "python-requests/2.25.1"
    },
    "method": "GET",
    "url": "https://archive.softwareheritage.org/api/1/snapshot/ada6a8c8fe620dadd9a48ce530e91357740401c4/"
  },
  "status_code": 200,
  "url": "https://archive.softwareheritage.org/api/1/snapshot/ada6a8c8fe620dadd9a48ce530e91357740401c4/",
  "_decoded_content": {
    "id": "ada6a8c8fe620dadd9a48ce530e91357740401c4",
    "branches": {
      "HEAD": {
        "target": "refs/heads/main",
        "target_type": "alias",
        "target_url": "https://archive.softwareheritage.org/api/1/revision/892a1f2bf6c7f8f0ce63d26d80f0d2309dc04303/"
      },
      "refs/heads/main": {
        "target": "892a1f2bf6c7f8f0ce63d26d80f0d2309dc04303",
        "target_type": "revision",
        "target_url": "https://archive.softwareheritage.org/api/1/revision/892a1f2bf6c7f8f0ce63d26d80f0d2309dc04303/"
      },
      "refs/heads/successions/0iV47kWzQAuyONrIDG538k3x3Qc": {
        "target": "a89e79cf19c8cb6b39f29eb15c8cc9f225063123",
        "target_type": "revision",
        "target_url": "https://archive.softwareheritage.org/api/1/revision/a89e79cf19c8cb6b39f29eb15c8cc9f225063123/"
      },
      "refs/heads/successions/1wFGhvmv8XZfPx0O5Hya2e9AyXo": {
        "target": "b9a89f2396f069b79e9fe344deb3f99749e088d0",
        "target_type": "revision",
        "target_url": "https://archive.softwareheritage.org/api/1/revision/b9a89f2396f069b79e9fe344deb3f99749e088d0/"
      },
      "refs/heads/successions/D9qSdCY6GPrxthT3ZnFouEU35ow": {
        "target": "960ffbbc99a02129c841f502417a03b6176f73db",
        "target_type": "revision",
        "target_url": "https://archive.softwareheritage.org/api/1/revision/960ffbbc99a02129c841f502417a03b6176f73db/"
      },
      "refs/heads/successions/DZFCt68peNNajZ34WtZni9VYxzo": {
        "target": "87615b0b3a398df1e262843a411d7d964c15658d",
        "target_type": "revision",
        "target_url": "https://archive.softwareheritage.org/api/1/revision/87615b0b3a398df1e262843a411d7d964c15658d/"
      },
      "refs/heads/successions/Fs4CjTor07Ssbb69Qcggp5yiBA0": {
        "target": "e95b5061fd72e6c937ecbc91eac2efd1420743e1",
        "target_type": "revision",
        "target_url": "https://archive.softwareheritage.org/api/1/revision/e95b5061fd72e6c937ecbc91eac2efd1420743e1/"
      },
      "refs/heads/successions/H5NOlCVM9P5Vv4LbeuwJsaME8kM": {
        "target": "1a9e3bcc123e1b11cd895bddfc5b798dc2ccbef9",
        "target_type": "revision",
        "target_url": "https://archive.softwareheritage.org/api/1/revision/1a9e3bcc123e1b11cd895bddfc5b798dc2ccbef9/"
      },
      "refs/heads/successions/HKSI5NPzMFmgRlb4Vboi71OTKYo": {
        "target": "a9dd09d0375d0bd45f27a0bebeccd0bba318033b",
        "target_type": "revision",
        "target_url": "https://archive.softwareheritage.org/api/1/revision/a9dd09d0375d0bd45f27a0bebeccd0bba318033b/"
      },
      "refs/heads/successions/NNtKPk2ox6fksvVD3cmK1fr4ork": {
        "target": "31e5cf29168386b037ce4bb7f274fd67c2edab71",
        "target_type": "revision",
        "target_url": "https://archive.softwareheritage.org/api/1/revision/31e5cf29168386b037ce4bb7f274fd67c2edab71/"
      },
      "refs/heads/successions/aEBkfZe1f4ooWcgt2Qs9gjtmkFo": {
        "target": "37a8249cee7d833f4d733eb0dbbb421677e284fa",
        "target_type": "revision",
        "target_url": "https://archive.softwareheritage.org/api/1/revision/37a8249cee7d833f4d733eb0dbbb421677e284fa/"
      },
      "refs/heads/successions/czdv8PyJKF7LneTnaVT6pgAKyh8": {
        "target": "e7bcb30ab974aefa306194bedc2d4f5dd0a83afa",
        "target_type": "revision",
        "target_url": "https://archive.softwareheritage.org/api/1/revision/e7bcb30ab974aefa306194bedc2d4f5dd0a83afa/"
      },
      "refs/heads/successions/ji2STto1mZ3i2BmnGxbkebejKH4": {
        "target": "a1dce4f3938a5999a87227725b412c79b83bdeb0",
        "target_type": "revision",
        "target_url": "https://archive.softwareheritage.org/api/1/revision/a1dce4f3938a5999a87227725b412c79b83bdeb0/"
      },
      "refs/heads/successions/krP1W87DCQajl5bJABhHW8HLq7c": {
        "target": "f249b1f9aa23a0e9926913fd9d32a2fbd8faa99e",
        "target_type": "revision",
        "target_url": "https://archive.softwareheritage.org/api/1/revision/f249b1f9aa23a0e9926913fd9d32a2fbd8faa99e/"
      },
      "refs/heads/successions/wk1LzCaCSKkIvLAYObAvaoLNGPc": {
        "target": "eb29a9a6b0abd4976891c67653fbf0bc340cd0f3",
        "target_type": "revision",
        "target_url": "https://archive.softwareheritage.org/api/1/revision/eb29a9a6b0abd4976891c67653fbf0bc340cd0f3/"
      }
    },
    "next_branch": null
  }
}