{
    "revisions": [
        {
            "hexsha": "728f3df921e2e5b6ce011da199bb29badb70a908",
            "parents": [],
            "allowed_keys": [
                "ssh-ed25519 AAAAC3NzaC1lZDI1NTE5AAAAIGc/pGTE+yQT9LdZdR0NCvAnboWV0wT/5d7F5GTKk7QJ"
            ],
            "date": "2000-01-01",
            "state": {}
        }
    ]
}
