{
  "created_at": "2024-11-02T14:44:32.519879+00:00",
  "elapsed": 0.578934,
  "encoding": "ISO-8859-1",
  "headers": {
    "Accept-Ranges": "bytes",
    "Age": "0",
    "Allow": "OPTIONS, HEAD, GET, OPTIONS",
    "Connection": "keep-alive",
    "Content-Type": "text/plain",
    "Cross-Origin-Opener-Policy": "same-origin",
    "Date": "Sat, 02 Nov 2024 14:44:32 GMT",
    "Referrer-Policy": "same-origin",
    "Strict-Transport-Security": "max-age=15768000;",
    "Transfer-Encoding": "chunked",
    "Vary": "Accept, origin, Cookie",
    "Via": "1.1 varnish (Varnish/6.5)",
    "X-Content-Type-Options": "nosniff",
    "X-Frame-Options": "DENY",
    "X-RateLimit-Limit": "1200",
    "X-RateLimit-Remaining": "1196",
    "X-RateLimit-Reset": "1730559467",
    "X-Varnish": "1047463321"
  },
  "reason": "OK",
  "request": {
    "body": "",
    "headers": {
      "Accept": "*/*",
      "Accept-Encoding": "gzip, deflate",
      "Authorization": "REDACTED",
      "Connection": "keep-alive",
      "User-Agent": "python-requests/2.25.1"
    },
    "method": "GET",
    "url": "https://archive.softwareheritage.org/api/1/graph/visit/edges/swh:1:rev:5466a30a368d3f5520cf9f0a867d4958e11d319f/?direction=backward&edges=rev%3Arev%2Crev%3Asnp%2Csnp%3Aori&resolve_origins=true"
  },
  "status_code": 200,
  "url": "https://archive.softwareheritage.org/api/1/graph/visit/edges/swh:1:rev:5466a30a368d3f5520cf9f0a867d4958e11d319f/?direction=backward&edges=rev%3Arev%2Crev%3Asnp%2Csnp%3Aori&resolve_origins=true",
  "_decoded_content": "swh:1:rev:5466a30a368d3f5520cf9f0a867d4958e11d319f swh:1:rev:5c5ca9a3241d31a616b5bb42a2bbe7be7edf3d26\nswh:1:rev:5c5ca9a3241d31a616b5bb42a2bbe7be7edf3d26 swh:1:snp:bad2fb61b76739f8777e2bd5c3e16825a558986e\nswh:1:rev:5c5ca9a3241d31a616b5bb42a2bbe7be7edf3d26 swh:1:snp:530dabe14c4041b7e9ceb1738ca1045d0a3c4238\nswh:1:snp:bad2fb61b76739f8777e2bd5c3e16825a558986e https://gitlab.com/perm.pub/successions.git\nswh:1:snp:530dabe14c4041b7e9ceb1738ca1045d0a3c4238 https://gitlab.com/perm.pub/successions.git\n"
}