{
  "created_at": "2024-11-05T15:35:01.401411+00:00",
  "elapsed": 0.128505,
  "encoding": "utf-8",
  "headers": {
    "Accept-Ranges": "bytes",
    "Age": "0",
    "Allow": "HEAD, OPTIONS, OPTIONS, GET",
    "Connection": "keep-alive",
    "Content-Length": "3583",
    "Content-Type": "application/json",
    "Cross-Origin-Opener-Policy": "same-origin",
    "Date": "Tue, 05 Nov 2024 15:35:01 GMT",
    "Referrer-Policy": "same-origin",
    "Strict-Transport-Security": "max-age=15768000;",
    "Vary": "Accept, origin, Cookie",
    "Via": "1.1 varnish (Varnish/6.5)",
    "X-Content-Type-Options": "nosniff",
    "X-Frame-Options": "DENY",
    "X-RateLimit-Limit": "120",
    "X-RateLimit-Remaining": "110",
    "X-RateLimit-Reset": "1730824483",
    "X-Varnish": "126886411"
  },
  "reason": "OK",
  "request": {
    "body": "",
    "headers": {
      "Accept": "*/*",
      "Accept-Encoding": "gzip, deflate",
      "Connection": "keep-alive",
      "User-Agent": "python-requests/2.25.1"
    },
    "method": "GET",
    "url": "https://archive.softwareheritage.org/api/1/snapshot/130436a0fa0be0796b528906f87785a0aa158478/"
  },
  "status_code": 200,
  "url": "https://archive.softwareheritage.org/api/1/snapshot/130436a0fa0be0796b528906f87785a0aa158478/",
  "_decoded_content": {
    "id": "130436a0fa0be0796b528906f87785a0aa158478",
    "branches": {
      "HEAD": {
        "target": "refs/heads/main",
        "target_type": "alias",
        "target_url": "https://archive.softwareheritage.org/api/1/revision/f98a541887918bdbae3c62b448431a78ec6bc30d/"
      },
      "refs/heads/doc/151": {
        "target": "87615b0b3a398df1e262843a411d7d964c15658d",
        "target_type": "revision",
        "target_url": "https://archive.softwareheritage.org/api/1/revision/87615b0b3a398df1e262843a411d7d964c15658d/"
      },
      "refs/heads/doc/153": {
        "target": "a89e79cf19c8cb6b39f29eb15c8cc9f225063123",
        "target_type": "revision",
        "target_url": "https://archive.softwareheritage.org/api/1/revision/a89e79cf19c8cb6b39f29eb15c8cc9f225063123/"
      },
      "refs/heads/doc/154": {
        "target": "f249b1f9aa23a0e9926913fd9d32a2fbd8faa99e",
        "target_type": "revision",
        "target_url": "https://archive.softwareheritage.org/api/1/revision/f249b1f9aa23a0e9926913fd9d32a2fbd8faa99e/"
      },
      "refs/heads/doc/155": {
        "target": "d8f286ce2aa97ff2f84ea56645827bfed6b64dc7",
        "target_type": "revision",
        "target_url": "https://archive.softwareheritage.org/api/1/revision/d8f286ce2aa97ff2f84ea56645827bfed6b64dc7/"
      },
      "refs/heads/doc/156": {
        "target": "2629ae3918722c2c3215217905a536d5db26c666",
        "target_type": "revision",
        "target_url": "https://archive.softwareheritage.org/api/1/revision/2629ae3918722c2c3215217905a536d5db26c666/"
      },
      "refs/heads/doc/1w": {
        "target": "b9a89f2396f069b79e9fe344deb3f99749e088d0",
        "target_type": "revision",
        "target_url": "https://archive.softwareheritage.org/api/1/revision/b9a89f2396f069b79e9fe344deb3f99749e088d0/"
      },
      "refs/heads/doc/D9": {
        "target": "960ffbbc99a02129c841f502417a03b6176f73db",
        "target_type": "revision",
        "target_url": "https://archive.softwareheritage.org/api/1/revision/960ffbbc99a02129c841f502417a03b6176f73db/"
      },
      "refs/heads/doc/Fs": {
        "target": "e95b5061fd72e6c937ecbc91eac2efd1420743e1",
        "target_type": "revision",
        "target_url": "https://archive.softwareheritage.org/api/1/revision/e95b5061fd72e6c937ecbc91eac2efd1420743e1/"
      },
      "refs/heads/doc/H5": {
        "target": "ec4f0deb9309caa8729bf16153bbb570ac4cb4ac",
        "target_type": "revision",
        "target_url": "https://archive.softwareheritage.org/api/1/revision/ec4f0deb9309caa8729bf16153bbb570ac4cb4ac/"
      },
      "refs/heads/doc/HK": {
        "target": "a9dd09d0375d0bd45f27a0bebeccd0bba318033b",
        "target_type": "revision",
        "target_url": "https://archive.softwareheritage.org/api/1/revision/a9dd09d0375d0bd45f27a0bebeccd0bba318033b/"
      },
      "refs/heads/doc/NN": {
        "target": "31e5cf29168386b037ce4bb7f274fd67c2edab71",
        "target_type": "revision",
        "target_url": "https://archive.softwareheritage.org/api/1/revision/31e5cf29168386b037ce4bb7f274fd67c2edab71/"
      },
      "refs/heads/doc/aE": {
        "target": "075a50947bf75fa9f3039f06ab4deb50e9853b04",
        "target_type": "revision",
        "target_url": "https://archive.softwareheritage.org/api/1/revision/075a50947bf75fa9f3039f06ab4deb50e9853b04/"
      },
      "refs/heads/doc/cN": {
        "target": "22cd0de869b3945fc08b4af224e88473880ae08e",
        "target_type": "revision",
        "target_url": "https://archive.softwareheritage.org/api/1/revision/22cd0de869b3945fc08b4af224e88473880ae08e/"
      },
      "refs/heads/doc/wk": {
        "target": "eb29a9a6b0abd4976891c67653fbf0bc340cd0f3",
        "target_type": "revision",
        "target_url": "https://archive.softwareheritage.org/api/1/revision/eb29a9a6b0abd4976891c67653fbf0bc340cd0f3/"
      },
      "refs/heads/jats4past2": {
        "target": "37f3d19fe6cfd2ad5cd0501269914af195c9790f",
        "target_type": "revision",
        "target_url": "https://archive.softwareheritage.org/api/1/revision/37f3d19fe6cfd2ad5cd0501269914af195c9790f/"
      },
      "refs/heads/main": {
        "target": "f98a541887918bdbae3c62b448431a78ec6bc30d",
        "target_type": "revision",
        "target_url": "https://archive.softwareheritage.org/api/1/revision/f98a541887918bdbae3c62b448431a78ec6bc30d/"
      }
    },
    "next_branch": null
  }
}