%YAML 1.1
%TAG !u! tag:unity3d.com,2011:
--- !u!114 &11400000
MonoBehaviour:
  m_ObjectHideFlags: 0
  m_CorrespondingSourceObject: {fileID: 0}
  m_PrefabInstance: {fileID: 0}
  m_PrefabAsset: {fileID: 0}
  m_GameObject: {fileID: 0}
  m_Enabled: 1
  m_EditorHideFlags: 0
  m_Script: {fileID: 11500000, guid: da1cdf094cfad1e4c98b987ed99a5a83, type: 3}
  m_Name: TestAssaultRifle
  m_EditorClassIdentifier: 
  _icon: {fileID: 21300000, guid: 6b049abd5c4e9b142b7865e2c879f204, type: 3}
  _displayName: Test Assault Rifle
  _description: An Assault Rifle made for testing things.
  _stackSize: 1
  _volume: 0
  _inventorySettings:
    capacity: 0
    typeRestrictions: 119
  _weaponType: 0
  _prefab: {fileID: 5389185676458798549, guid: 3e738bb9e2b04854cad1b0feda3e80aa, type: 3}
  ammoType: 4
  usesMagazine: 1
  primaryFireFx: {fileID: 4470219718739080495, guid: 0a6e72953eacc6d48877ac00636adfd6,
    type: 3}
  sprayPattern: {fileID: 11400000, guid: a46d2b510acacb84fa59477d8688bf2a, type: 2}
  hitScanSettings:
    aimSpeed: 5
    isFullyAuto: 1
    shotsPerSecond: 10
    penetration: 0
    penetrationCost: 10
    maxDistance: 1000
    mask:
      serializedVersion: 2
      m_Bits: 1280
    baseDamage: 10
    hitfx:
      _keys: 000000000100000002000000030000000400000005000000
      _values:
      - {fileID: 4470219718739080495, guid: 3125fc7d153fbac46af16390d74e337c, type: 3}
      - {fileID: 4470219718739080495, guid: ed964acdc5e2bb64a8454be58762ced1, type: 3}
      - {fileID: 0}
      - {fileID: 0}
      - {fileID: 0}
      - {fileID: 0}
  modifiers:
    serdeMods:
    - fieldName: armSpeedMod
      type: 2
      modifier: 1.5
