%YAML 1.1
%TAG !u! tag:unity3d.com,2011:
--- !u!114 &11400000
MonoBehaviour:
  m_ObjectHideFlags: 0
  m_CorrespondingSourceObject: {fileID: 0}
  m_PrefabInstance: {fileID: 0}
  m_PrefabAsset: {fileID: 0}
  m_GameObject: {fileID: 0}
  m_Enabled: 1
  m_EditorHideFlags: 0
  m_Script: {fileID: 11500000, guid: e4d4fc3efe3a52946880b7890da09950, type: 3}
  m_Name: 9mm
  m_EditorClassIdentifier: 
  _icon: {fileID: 21300000, guid: 92fe45b3e4de9ea4ca36b75e1cb0c5c4, type: 3}
  _displayName: 9mm FMJ
  _description: Worldwide, the 9mm round is one of the most popular pistol cartridges.
    This particular cartidge has a full metal jacket which improves feeding characteristics
    in full and semi automatic weapons.
  _stackSize: 50
  _volume: 1
  _inventorySettings:
    capacity: 0
    typeRestrictions: -1
  ammoType: 2
