{
    "antifeatures": {
        "Ads": "دا کاریال انګروزي لري",
        "NoSourceSince": "سرچينې کوډ نور شتون نه لري، اوسمهالیزونې شونې نه دي"
    },
    "app_categories": {
        "Connectivity": "پیوستیا",
        "Development": "پرمختيا",
        "Games": "لوبې",
        "Graphics": "كښنيزونه",
        "Internet": "انټرنېټ",
        "Multimedia": "ګڼرسنۍ",
        "Navigation": "چلونه",
        "Phone & SMS": "ټېليفون او استوزه",
        "Reading": "لوستل",
        "Science & Education": "ساینس او زده کړه",
        "Security": "خونديتوب",
        "Sports & Health": "کړاو او روغتیا",
        "System": "غونډال",
        "Theming": "ويينه",
        "Time": "مهال",
        "Writing": "ليكل",
        "show_all_packages": "د ټولو d% بنډلونو ښودل"
    },
    "index": {
        "download_fdroid": "اېف-ډروېډ رالېښل",
        "gpg_signature": "پي.جي.پي لاسليک",
        "title": "اېف-ډروېډ څه شئ دی؟"
    },
    "navigation": {
        "about": "په اړه",
        "apps": "کاریالونه",
        "contribute": "برخه اخیستل",
        "documentation": "لاسوندونه",
        "edit_on_gitlab": "پر ګېټ لاب باندې سمون",
        "issues": "ربړې",
        "news": "خبرونه",
        "translate_on_weblate": "پر وېبلېټ ژباړل"
    },
    "package": {
        "added_on": "زیات شوی په {{ package_added_date }}",
        "anti_features_warning": "دا کاریال داسې ځانګړنې لري چې تاسې يې ښايي چې خوښې نه کړئ.",
        "author": "ليكوال",
        "build_metadata": "د جوړښت پېژن اومتوک",
        "download": "د {{ file_extension }} رالېښل",
        "flattr": "Flattr",
        "gpg_signature": "پي.جي.پي لاسليک",
        "issue_tracker": "ربړه پلنيوى",
        "liberapay": "لېبراپې",
        "license": "هوکليک",
        "minimum_android_version": "دا بڼه انډروېډ {{ android_version }} یا لا نوي ته اړتیا لري.",
        "new_in_version": "نوي په بڼه {{ latest_version }} کښې",
        "opencollective": "اوپن کولیکټيو",
        "package_icon_alt": "بنډل انځورن",
        "packages": "بنډلونه",
        "permissions": "پرېښلې",
        "signed_by_developer": "دا آر پراخندوی جوړ او لاسليک کړی دئ.",
        "source_code": "سرچينې كوډه",
        "technical_info": "تخنیکي خبرتیا",
        "translation": "ژباړه",
        "version_info": "<b>بڼه {{ package_version }}</b> ‭‭‭({{ package_version_code }})",
        "website": "ګورتځی"
    },
    "sidebars": {
        "lang": {
            "change": "بدلول"
        }
    }
}
