{
    "app_categories": {
        "Connectivity": "Connectiviteit",
        "Development": "Ontwikkeling",
        "Games": "Spellen",
        "Graphics": "Grafisch",
        "Internet": "Internet",
        "Money": "Geld",
        "Multimedia": "Multimedia",
        "Navigation": "Navigatie",
        "Phone & SMS": "Telefoon & SMS",
        "Reading": "Lezen",
        "Science & Education": "Onderwijs & wetenschap",
        "Security": "Beveiliging",
        "Sports & Health": "Sport & gezondheid",
        "System": "Systeem",
        "Theming": "Thema’s",
        "Time": "Tijd",
        "Writing": "Schrijven",
        "show_all_packages": "Alle %d weergeven"
    }
}
