name,email,email_verified_at,password,remember_token,created_at,updated_at,role,is_developer
shakeel,shakeel.techlogicians@gmail.com,,$2y$10$LSEdVfcemPIqGOE4g3NWEuDOEsAqa6n2YZ2nioe78Tr8hCtM3pF32,jb5rU7Y2qLZEDLyWho22nFNBxwvfyYTy8YWxMfw8uBAGNTlau6BwhI7j46hL,"2019-11-19 15:19:16","2019-12-28 12:24:00",admin,1
"Rezwan Faruque",rezwanfaruque9@gmail.com,,$2y$10$vJYd1mPlsOvX9H7NmqvrV.L4BxTZN3DEybuJkn6gzbQgmEDnmoDLW,,"2019-12-23 04:39:44","2019-12-28 12:24:00",admin,0
