key,value,created_at,updated_at,name,label,type
company_name,Foretravel,,"2019-12-02 20:41:10",company_name,"Company Name",text
company_logo,,"2019-12-02 20:41:10","2019-12-02 20:41:10",company_logo,"Company Logo",image
