<?xml version="1.0" encoding="iso-8859-1"?>
<!-- Generator: Adobe Illustrator 19.0.0, SVG Export Plug-In . SVG Version: 6.00 Build 0)  -->
<svg version="1.1" id="Capa_1" xmlns="http://www.w3.org/2000/svg" xmlns:xlink="http://www.w3.org/1999/xlink" x="0px" y="0px"
	 viewBox="0 0 512 512" style="enable-background:new 0 0 512 512;" xml:space="preserve"  fill="#205D85">
<g>
	<g>
		<path d="M486.372,232.124c-8.978-8.971-19.567-15.732-31.102-20.059c14.609-9.897,24.229-26.628,24.229-45.565
			c0-30.327-24.673-55-55-55c-30.327,0-55,24.673-55,55c0,18.919,9.603,35.636,24.19,45.537
			c-16.644,6.213-31.081,17.415-41.32,32.388c-14.545-19.807-35.037-34.984-58.825-42.876C320.775,187.777,339.5,159.543,339.5,127
			c0-46.042-37.458-83.5-83.5-83.5s-83.5,37.458-83.5,83.5c0,32.543,18.725,60.777,45.956,74.548
			c-23.8,7.896-44.3,23.084-58.846,42.906c-3.023-4.397-6.435-8.526-10.238-12.33c-8.977-8.971-19.566-15.732-31.101-20.059
			c14.609-9.897,24.229-26.628,24.229-45.565c0-30.327-24.673-55-55-55c-30.327,0-55,24.673-55,55
			c0,18.947,9.63,35.687,24.253,45.582C23.629,224.555,0,256.567,0,294v8.5c0,4.143,3.358,7.5,7.5,7.5s7.5-3.357,7.5-7.5V294
			c0-39.977,32.523-72.5,72.5-72.5c19.358,0,37.565,7.541,51.266,21.232c4.709,4.709,8.711,10.008,11.953,15.78
			C141.652,275.343,136.5,294.58,136.5,315v51.5H15v-31.75c0-4.143-3.358-7.5-7.5-7.5s-7.5,3.357-7.5,7.5V408
			c0,4.143,3.358,7.5,7.5,7.5h129V461c0,4.143,3.358,7.5,7.5,7.5h175.037c4.143,0,7.5-3.357,7.5-7.5s-3.357-7.5-7.5-7.5H151.5v-19
			h209v19h-7.74c-4.143,0-7.5,3.357-7.5,7.5s3.357,7.5,7.5,7.5H368c4.143,0,7.5-3.357,7.5-7.5v-45.5h129c4.143,0,7.5-3.357,7.5-7.5
			V294C512,270.638,502.899,248.665,486.372,232.124z M87.5,206.5c-22.056,0-40-17.944-40-40c0-22.056,17.944-40,40-40
			c22.056,0,40,17.944,40,40C127.5,188.556,109.556,206.5,87.5,206.5z M136.5,400.5H15v-19h121.5V400.5z M384.5,166.5
			c0-22.056,17.944-40,40-40c22.056,0,40,17.944,40,40c0,22.056-17.944,40-40,40C402.444,206.5,384.5,188.556,384.5,166.5z
			 M187.5,127c0-37.771,30.729-68.5,68.5-68.5s68.5,30.729,68.5,68.5s-30.729,68.5-68.5,68.5S187.5,164.771,187.5,127z M360.5,419.5
			h-209V315c0-57.621,46.878-104.5,104.5-104.5c57.621,0,104.5,46.879,104.5,104.5V419.5z M497,366.5h-16
			c-4.143,0-7.5,3.357-7.5,7.5s3.357,7.5,7.5,7.5h16v19H375.5v-19h72c4.143,0,7.5-3.357,7.5-7.5s-3.357-7.5-7.5-7.5h-72V315
			c0-20.421-5.153-39.66-14.221-56.491c12.843-22.921,36.722-37.009,63.221-37.009c19.357,0,37.565,7.541,51.265,21.231
			C489.459,256.435,497,274.643,497,294V366.5z"/>
	</g>
</g>
<g>
	<g>
		<path d="M123.964,269.197c-1.348-2.29-3.807-3.696-6.464-3.696h-60c-2.657,0-5.116,1.406-6.464,3.696
			c-1.348,2.291-1.383,5.123-0.092,7.446l30,54c1.323,2.38,3.832,3.857,6.556,3.857s5.233-1.477,6.556-3.857l30-54
			C125.347,274.32,125.311,271.488,123.964,269.197z M87.5,311.557L70.247,280.5h34.506L87.5,311.557z"/>
	</g>
</g>
<g>
	<g>
		<path d="M460.964,269.196c-1.348-2.29-3.807-3.696-6.464-3.696h-60c-2.657,0-5.116,1.406-6.464,3.696
			c-1.348,2.291-1.383,5.123-0.093,7.446l30,54c1.323,2.381,3.833,3.857,6.557,3.857s5.233-1.477,6.557-3.857l30-54
			C462.347,274.319,462.312,271.487,460.964,269.196z M424.5,311.557L407.246,280.5h34.508L424.5,311.557z"/>
	</g>
</g>
<g>
	<g>
		<path d="M323.988,292.777l0.353-0.353c5.571-5.571,8.639-12.98,8.639-20.86s-3.068-15.288-8.64-20.859
			c-5.571-5.572-12.979-8.641-20.859-8.641s-15.288,3.068-20.86,8.64l-0.353,0.353l-0.353-0.353c-2.93-2.927-7.678-2.929-10.607,0
			l-21.213,21.213c-1.407,1.407-2.197,3.314-2.197,5.304c0,0.355,0.034,0.706,0.083,1.053l-72.133,72.132
			c-0.073,0.072-0.136,0.152-0.205,0.227c-0.06,0.065-0.12,0.129-0.177,0.196c-0.19,0.221-0.37,0.449-0.531,0.689
			c-0.006,0.01-0.014,0.018-0.02,0.027c-0.167,0.25-0.314,0.513-0.449,0.781c-0.039,0.078-0.075,0.157-0.112,0.236
			c-0.099,0.215-0.188,0.434-0.267,0.656c-0.025,0.072-0.053,0.142-0.077,0.214c-0.092,0.289-0.168,0.583-0.224,0.883
			c-0.003,0.018-0.01,0.035-0.013,0.053l-7.452,41.018c-0.674,3.714,0.507,7.517,3.16,10.17c2.162,2.162,5.087,3.348,8.105,3.348
			c0.686,0,1.376-0.062,2.064-0.186l41.025-7.445c0.012-0.002,0.023-0.006,0.034-0.009c0.304-0.056,0.604-0.135,0.901-0.229
			c0.063-0.02,0.123-0.043,0.185-0.065c0.244-0.084,0.483-0.182,0.719-0.292c0.056-0.026,0.114-0.051,0.169-0.079
			c0.278-0.139,0.551-0.292,0.813-0.468c0.013-0.008,0.024-0.018,0.036-0.026c0.235-0.159,0.46-0.335,0.679-0.523
			c0.069-0.059,0.134-0.12,0.201-0.182c0.075-0.069,0.153-0.131,0.226-0.204l72.134-72.133c0.347,0.049,0.697,0.083,1.052,0.083
			c1.989,0,3.896-0.79,5.304-2.196l21.213-21.213c2.929-2.93,2.929-7.678,0-10.607L323.988,292.777z M181.99,393.05l3.981-21.913
			l17.935,17.935L181.99,393.05z M219.336,383.287l-27.578-27.578l65.761-65.76l27.577,27.578L219.336,383.287z M297.825,309.041
			l-31.82-31.82l10.606-10.606c0.003,0.003,0,0,0.003,0.003l31.816,31.817L297.825,309.041z M313.734,281.817l-0.352,0.354
			l-20.507-20.507l0.354-0.353c2.738-2.739,6.38-4.247,10.253-4.247s7.514,1.508,10.252,4.247c2.739,2.738,4.247,6.38,4.247,10.253
			S316.473,279.079,313.734,281.817z"/>
	</g>
</g>
</svg>
