<svg xmlns="http://www.w3.org/2000/svg" xmlns:xlink="http://www.w3.org/1999/xlink" style="margin: auto;background: #e6e6e6;display: block;shape-rendering: auto;" width="1513px" height="900px" viewBox="0 0 100 100" preserveAspectRatio="xMidYMid">
	<g style="transform: scale(.5);transform-origin: center;">
		<rect x="20" y="30" width="10" height="40" fill="#203564">
		  <animate attributeName="y" repeatCount="indefinite" dur="1s" calcMode="spline" keyTimes="0;0.5;1" values="18;30;30" keySplines="0 0.5 0.5 1;0 0.5 0.5 1" begin="-0.2s"/>
		  <animate attributeName="height" repeatCount="indefinite" dur="1s" calcMode="spline" keyTimes="0;0.5;1" values="64;40;40" keySplines="0 0.5 0.5 1;0 0.5 0.5 1" begin="-0.2s"/>
		</rect>
		<rect x="42.5" y="30" width="10" height="40" fill="#7ca7d8">
		  <animate attributeName="y" repeatCount="indefinite" dur="1s" calcMode="spline" keyTimes="0;0.5;1" values="20.999999999999996;30;30" keySplines="0 0.5 0.5 1;0 0.5 0.5 1" begin="-0.1s"/>
		  <animate attributeName="height" repeatCount="indefinite" dur="1s" calcMode="spline" keyTimes="0;0.5;1" values="58.00000000000001;40;40" keySplines="0 0.5 0.5 1;0 0.5 0.5 1" begin="-0.1s"/>
		</rect>
		<rect x="65" y="30" width="10" height="40" fill="#82bbf3">
		  <animate attributeName="y" repeatCount="indefinite" dur="1s" calcMode="spline" keyTimes="0;0.5;1" values="20.999999999999996;30;30" keySplines="0 0.5 0.5 1;0 0.5 0.5 1"/>
		  <animate attributeName="height" repeatCount="indefinite" dur="1s" calcMode="spline" keyTimes="0;0.5;1" values="58.00000000000001;40;40" keySplines="0 0.5 0.5 1;0 0.5 0.5 1"/>
		</rect>
	</g>
</svg>