<?xml version="1.0" encoding="UTF-8" standalone="no" ?>
<!-- Generator: Adobe Illustrator 13.0.0, SVG Export Plug-In . SVG Version: 6.00 Build 14948)  -->

<svg xmlns:dc="http://purl.org/dc/elements/1.1/"
     xmlns:cc="http://creativecommons.org/ns#"
     xmlns:rdf="http://www.w3.org/1999/02/22-rdf-syntax-ns#"
     xmlns:svg="http://www.w3.org/2000/svg"
     xmlns="http://www.w3.org/2000/svg"
     xmlns:sodipodi="http://sodipodi.sourceforge.net/DTD/sodipodi-0.dtd"
     xmlns:inkscape="http://www.inkscape.org/namespaces/inkscape"
     version="1.0"
     id="Ebene_1"
     x="0px"
     y="0px"
     width="396.64301"
     height="305.84"
     viewBox="0 0 396.64301 305.84"
     enable-background="new 0 0 900 600"
     xml:space="preserve"
     sodipodi:docname="Flag_of_UNESCO.svg"
     inkscape:version="0.92.1 r15371"><metadata id="metadata11"><rdf:RDF><cc:Work rdf:about=""><dc:format>image/svg+xml</dc:format><dc:type rdf:resource="http://purl.org/dc/dcmitype/StillImage" /><dc:title></dc:title></cc:Work></rdf:RDF></metadata><defs id="defs9" /><sodipodi:namedview pagecolor="#ffffff"
                                                                                                                                                                                                                                                                                               bordercolor="#666666"
                                                                                                                                                                                                                                                                                               borderopacity="1"
                                                                                                                                                                                                                                                                                               objecttolerance="10"
                                                                                                                                                                                                                                                                                               gridtolerance="10"
                                                                                                                                                                                                                                                                                               guidetolerance="10"
                                                                                                                                                                                                                                                                                               inkscape:pageopacity="0"
                                                                                                                                                                                                                                                                                               inkscape:pageshadow="2"
                                                                                                                                                                                                                                                                                               inkscape:window-width="1600"
                                                                                                                                                                                                                                                                                               inkscape:window-height="837"
                                                                                                                                                                                                                                                                                               id="namedview7"
                                                                                                                                                                                                                                                                                               showgrid="false"
                                                                                                                                                                                                                                                                                               fit-margin-top="0"
                                                                                                                                                                                                                                                                                               fit-margin-left="0"
                                                                                                                                                                                                                                                                                               fit-margin-right="0"
                                                                                                                                                                                                                                                                                               fit-margin-bottom="0"
                                                                                                                                                                                                                                                                                               inkscape:zoom="0.39333333"
                                                                                                                                                                                                                                                                                               inkscape:cx="198.822"
                                                                                                                                                                                                                                                                                               inkscape:cy="152.419"
                                                                                                                                                                                                                                                                                               inkscape:window-x="-8"
                                                                                                                                                                                                                                                                                               inkscape:window-y="-8"
                                                                                                                                                                                                                                                                                               inkscape:window-maximized="1"
                                                                                                                                                                                                                                                                                               inkscape:current-layer="Ebene_1" /><path d="m 330.155,103.586 c 2.018,0 3.123,1.111 3.123,2.037 V 227.15 c 0,1.019 -1.23,2.285 -3.123,2.335 -1.895,0.037 -3.088,-1.366 -3.088,-2.335 V 105.622 c 0,-0.795 1.069,-2.036 3.088,-2.036 m -11.359,2.036 c 0,-4.986 5.354,-10.221 11.52,-10.221 6.166,0 11.645,5.315 11.645,10.221 v 121.527 c 0,6.508 -5.727,10.619 -11.805,10.619 -6.08,0 -11.359,-3.925 -11.359,-10.619 V 105.622 Z m -53.776,0 c 0,-4.887 5.65,-10.221 11.611,-10.221 5.949,0 11.557,5.16 11.557,10.221 v 31.527 H 279.5 v -31.527 c 0,-0.913 -1.695,-2.037 -2.869,-2.037 -1.18,0 -2.918,1.124 -2.918,2.037 v 122.259 c 0,1.255 1.676,2.335 2.918,2.335 1.236,0 2.869,-0.969 2.869,-2.335 v -36.389 h 8.688 v 36.389 c 0,6.583 -5.514,10.619 -11.557,10.619 -6.047,0 -11.611,-4.123 -11.611,-10.619 z m -52.945,0 c 0,-5.26 4.795,-10.221 10.773,-10.221 5.98,0 11.434,4.726 11.434,10.221 v 31.527 h -8.801 v -31.527 c 0,-0.944 -1.061,-2.037 -2.445,-2.037 -1.248,0 -2.689,1.136 -2.689,2.037 v 23.243 c 0,8.284 4.217,21.61 7.619,33.133 3.404,11.535 6.85,26.525 6.85,34.784 v 31.099 c 0,7.129 -5.439,10.619 -11.482,10.619 -6.041,0 -11.258,-3.949 -11.258,-10.619 v -36.389 h 8.271 v 36.389 c 0,1.155 1.223,2.335 2.986,2.335 1.77,0 2.801,-1.13 2.801,-2.335 v -31.099 c 0,-8.259 -3.98,-23.82 -7.172,-34.784 -3.192,-10.964 -6.887,-24.849 -6.887,-33.133 z M 162.027,95.401 h 19.076 v 7.545 h -9.153 v 55.532 h 9.153 v 7.853 h -9.153 v 64.222 h 12.612 v 7.948 h -22.535 z m -53.778,0 h 9.812 l 5.912,66.598 V 95.401 h 7.438 v 143.1 h -7.438 l -8.694,-85.193 v 85.193 h -7.029 v -143.1 z m -53.776,0 h 8.867 l 0.1,132.48 c 0,1.305 1.124,2.335 2.664,2.335 1.359,0 2.552,-1.03 2.552,-2.335 l -0.1,-132.48 h 9.085 l 0.1,132.48 c 0,6.508 -5.347,10.619 -11.581,10.619 -6.234,0 -11.588,-3.949 -11.588,-10.619 z M 0,292.7 h 396.643 v 13.14 H 0 Z M 17.916,268.83 H 378.89 v 13.935 H 17.916 Z m 18.48,-23.064 h 324.708 v 13.935 H 36.396 Z m 0,-169.609 H 361.104 V 89.595 H 36.396 Z m 27.192,-11.199 134.715,-41.6 132.795,41.6 H 292.057 L 198.303,35.927 103.076,64.958 Z M 36.396,50.175 198.304,0 361.105,50.175 V 64.958 L 198.304,15.68 36.396,64.958 Z"
                                                                                                                                                                                                                                                                                                                                        id="path4"
                                                                                                                                                                                                                                                                                                                                        inkscape:connector-curvature="0"
                                                                                                                                                                                                                                                                                                                                        style="clip-rule:evenodd;fill:#ffffff;fill-rule:evenodd" /></svg>