{
  "$schema": "http://json.schemastore.org/launchsettings.json",
  "profiles": {
    "AspNetCore": {
      "commandName": "Project",
      "launchBrowser": true,
      "launchUrl": "",
      "environmentVariables": {
        "ASPNETCORE_ENVIRONMENT": "Development",
        "PORT": "5137"
      },
      "applicationUrl": "http://localhost:5137"
    }
  }
}