<svg width="287" height="261" viewBox="0 0 287 261" fill="none" xmlns="http://www.w3.org/2000/svg">
<mask id="mask0" mask-type="alpha" maskUnits="userSpaceOnUse" x="0" y="0" width="287" height="261">
<rect width="287" height="261" fill="#C4C4C4"/>
</mask>
<g mask="url(#mask0)">
<circle cx="297" cy="-36" r="272" stroke="#393E46" stroke-opacity="0.2" stroke-width="50"/>
<circle cx="297" cy="-36" r="155" stroke="#393E46" stroke-opacity="0.2" stroke-width="50"/>
</g>
</svg>
