<svg width="358" height="385" viewBox="0 0 358 385" fill="none" xmlns="http://www.w3.org/2000/svg">
<mask id="mask0" mask-type="alpha" maskUnits="userSpaceOnUse" x="0" y="0" width="358" height="385">
<rect width="358" height="385" fill="#C4C4C4"/>
</mask>
<g mask="url(#mask0)">
<circle cx="94" cy="264" r="239" stroke="#393E46" stroke-opacity="0.2" stroke-width="50"/>
<circle cx="94" cy="264" r="30" fill="#393E46" fill-opacity="0.2"/>
</g>
</svg>
