(kicad_pcb (version 20171130) (host pcbnew "(5.1.6)-1")

  (general
    (thickness 1.6)
    (drawings 25)
    (tracks 20)
    (zones 0)
    (modules 6)
    (nets 16)
  )

  (page A4)
  (layers
    (0 F.Cu signal)
    (31 B.Cu signal)
    (32 B.Adhes user)
    (33 F.Adhes user)
    (34 B.Paste user)
    (35 F.Paste user)
    (36 B.SilkS user)
    (37 F.SilkS user)
    (38 B.Mask user)
    (39 F.Mask user)
    (40 Dwgs.User user)
    (41 Cmts.User user)
    (42 Eco1.User user)
    (43 Eco2.User user)
    (44 Edge.Cuts user)
    (45 Margin user)
    (46 B.CrtYd user)
    (47 F.CrtYd user)
    (48 B.Fab user)
    (49 F.Fab user hide)
  )

  (setup
    (last_trace_width 0.5)
    (user_trace_width 0.5)
    (user_trace_width 1)
    (trace_clearance 0.2)
    (zone_clearance 0.508)
    (zone_45_only no)
    (trace_min 0.2)
    (via_size 0.8)
    (via_drill 0.4)
    (via_min_size 0.4)
    (via_min_drill 0.3)
    (uvia_size 0.3)
    (uvia_drill 0.1)
    (uvias_allowed no)
    (uvia_min_size 0.2)
    (uvia_min_drill 0.1)
    (edge_width 0.05)
    (segment_width 0.2)
    (pcb_text_width 0.3)
    (pcb_text_size 1.5 1.5)
    (mod_edge_width 0.12)
    (mod_text_size 1 1)
    (mod_text_width 0.15)
    (pad_size 1.524 1.524)
    (pad_drill 0.762)
    (pad_to_mask_clearance 0.05)
    (aux_axis_origin 0 0)
    (visible_elements 7FFFFFFF)
    (pcbplotparams
      (layerselection 0x010fc_ffffffff)
      (usegerberextensions false)
      (usegerberattributes true)
      (usegerberadvancedattributes true)
      (creategerberjobfile true)
      (excludeedgelayer true)
      (linewidth 0.100000)
      (plotframeref false)
      (viasonmask false)
      (mode 1)
      (useauxorigin false)
      (hpglpennumber 1)
      (hpglpenspeed 20)
      (hpglpendiameter 15.000000)
      (psnegative false)
      (psa4output false)
      (plotreference true)
      (plotvalue true)
      (plotinvisibletext false)
      (padsonsilk false)
      (subtractmaskfromsilk false)
      (outputformat 1)
      (mirror false)
      (drillshape 0)
      (scaleselection 1)
      (outputdirectory "MCP230A_Breakout_gerbers/"))
  )

  (net 0 "")
  (net 1 GND)
  (net 2 +5V)
  (net 3 ENC1B)
  (net 4 ENC1A)
  (net 5 ENC2B)
  (net 6 ENC2A)
  (net 7 "Net-(J3-Pad0)")
  (net 8 "Net-(J3-Pad13)")
  (net 9 UART_TX)
  (net 10 "Net-(J3-Pad9)")
  (net 11 "Net-(J3-Pad6)")
  (net 12 UART_RX)
  (net 13 "Net-(J3-Pad1)")
  (net 14 "Net-(J3-Pad12)")
  (net 15 "Net-(J3-Pad5)")

  (net_class Default "This is the default net class."
    (clearance 0.2)
    (trace_width 0.25)
    (via_dia 0.8)
    (via_drill 0.4)
    (uvia_dia 0.3)
    (uvia_drill 0.1)
    (add_net +5V)
    (add_net ENC1A)
    (add_net ENC1B)
    (add_net ENC2A)
    (add_net ENC2B)
    (add_net GND)
    (add_net "Net-(J3-Pad0)")
    (add_net "Net-(J3-Pad1)")
    (add_net "Net-(J3-Pad12)")
    (add_net "Net-(J3-Pad13)")
    (add_net "Net-(J3-Pad5)")
    (add_net "Net-(J3-Pad6)")
    (add_net "Net-(J3-Pad9)")
    (add_net UART_RX)
    (add_net UART_TX)
  )

  (module polybot:polybot_logo (layer F.Cu) (tedit 6015B4D7) (tstamp 601622DD)
    (at 157.5 64.5 90)
    (fp_text reference G*** (at 0 6.5 90) (layer F.Fab) hide
      (effects (font (size 1.524 1.524) (thickness 0.3)))
    )
    (fp_text value LOGO (at 0.5 8.5 90) (layer F.Fab) hide
      (effects (font (size 1.524 1.524) (thickness 0.3)))
    )
    (fp_poly (pts (xy 0.283926 -2.811593) (xy 0.621075 -2.782427) (xy 0.916226 -2.726508) (xy 0.9525 -2.716553)
      (xy 1.372435 -2.568559) (xy 1.744459 -2.375036) (xy 2.091567 -2.122295) (xy 2.351196 -1.883834)
      (xy 2.643986 -1.560137) (xy 2.873067 -1.228479) (xy 3.054277 -0.862617) (xy 3.181605 -0.508)
      (xy 3.238833 -0.253545) (xy 3.273929 0.054475) (xy 3.286478 0.38779) (xy 3.276063 0.718129)
      (xy 3.242267 1.017222) (xy 3.206533 1.185333) (xy 3.033235 1.669094) (xy 2.78843 2.114042)
      (xy 2.479005 2.513346) (xy 2.111848 2.860172) (xy 1.693846 3.147688) (xy 1.231886 3.369061)
      (xy 0.894753 3.478703) (xy 0.589236 3.536286) (xy 0.239427 3.563975) (xy -0.119789 3.561321)
      (xy -0.453527 3.527875) (xy -0.606174 3.497986) (xy -0.856217 3.42281) (xy -1.133516 3.314972)
      (xy -1.403733 3.189395) (xy -1.632527 3.061005) (xy -1.673591 3.034069) (xy -1.776492 2.973224)
      (xy -1.851761 2.945049) (xy -1.869739 2.946537) (xy -1.883719 2.995097) (xy -1.895077 3.110541)
      (xy -1.902575 3.275096) (xy -1.905 3.452665) (xy -1.905596 3.673428) (xy -1.913835 3.820125)
      (xy -1.939399 3.903331) (xy -1.99197 3.933623) (xy -2.081229 3.921576) (xy -2.216856 3.877766)
      (xy -2.275516 3.857423) (xy -2.524942 3.743483) (xy -2.712381 3.588466) (xy -2.854272 3.376274)
      (xy -2.920019 3.226328) (xy -2.947949 3.146071) (xy -2.969115 3.062019) (xy -2.984434 2.961345)
      (xy -2.994825 2.831224) (xy -3.001207 2.65883) (xy -3.004498 2.431336) (xy -3.005618 2.135916)
      (xy -3.005667 2.030411) (xy -3.005667 1.058333) (xy -2.38125 1.058489) (xy -1.756834 1.058646)
      (xy -1.619338 1.324578) (xy -1.410187 1.640137) (xy -1.140747 1.90688) (xy -0.824151 2.118151)
      (xy -0.473532 2.267293) (xy -0.102024 2.347651) (xy 0.277241 2.352569) (xy 0.383235 2.339489)
      (xy 0.766537 2.240504) (xy 1.120558 2.071581) (xy 1.434154 1.841705) (xy 1.696181 1.55986)
      (xy 1.895495 1.235033) (xy 1.967009 1.062558) (xy 2.064688 0.667482) (xy 2.083708 0.272396)
      (xy 2.027471 -0.112101) (xy 1.899378 -0.475409) (xy 1.702833 -0.806931) (xy 1.441237 -1.096067)
      (xy 1.218507 -1.269393) (xy 0.86259 -1.457999) (xy 0.480688 -1.571116) (xy 0.085865 -1.607954)
      (xy -0.308811 -1.567724) (xy -0.690277 -1.449636) (xy -0.813533 -1.392176) (xy -1.000113 -1.270893)
      (xy -1.200882 -1.097936) (xy -1.392258 -0.897407) (xy -1.550662 -0.693408) (xy -1.632328 -0.555324)
      (xy -1.756834 -0.300888) (xy -2.38125 -0.298611) (xy -2.601953 -0.300253) (xy -2.787879 -0.306324)
      (xy -2.924551 -0.315988) (xy -2.997492 -0.328412) (xy -3.005667 -0.334612) (xy -2.987915 -0.427676)
      (xy -2.940497 -0.574486) (xy -2.872174 -0.753343) (xy -2.791703 -0.942548) (xy -2.707846 -1.1204)
      (xy -2.631376 -1.261841) (xy -2.328477 -1.688118) (xy -1.966958 -2.054688) (xy -1.551621 -2.357936)
      (xy -1.087266 -2.594247) (xy -0.674885 -2.7351) (xy -0.394517 -2.788277) (xy -0.064759 -2.813659)
      (xy 0.283926 -2.811593)) (layer F.SilkS) (width 0.01))
    (fp_poly (pts (xy -2.551367 -2.331781) (xy -2.525386 -2.242313) (xy -2.522497 -2.227136) (xy -2.471847 -2.104497)
      (xy -2.387781 -2.045514) (xy -2.286862 -2.059117) (xy -2.252219 -2.08142) (xy -2.23674 -2.084383)
      (xy -2.269835 -2.034709) (xy -2.328334 -1.962379) (xy -2.420682 -1.860451) (xy -2.491704 -1.811902)
      (xy -2.570541 -1.802134) (xy -2.634586 -1.808934) (xy -2.817985 -1.793951) (xy -2.987056 -1.704697)
      (xy -3.078404 -1.611848) (xy -3.121704 -1.500598) (xy -3.129832 -1.351242) (xy -3.104622 -1.201827)
      (xy -3.053615 -1.097089) (xy -3.004739 -1.02438) (xy -2.999198 -0.956388) (xy -3.034182 -0.853493)
      (xy -3.03602 -0.848982) (xy -3.100099 -0.733849) (xy -3.185251 -0.630151) (xy -3.268565 -0.563226)
      (xy -3.305205 -0.551275) (xy -3.347904 -0.57834) (xy -3.418853 -0.645424) (xy -3.425228 -0.652152)
      (xy -3.487491 -0.726927) (xy -3.494014 -0.783495) (xy -3.449446 -0.862994) (xy -3.449107 -0.86351)
      (xy -3.39522 -0.996236) (xy -3.412367 -1.105663) (xy -3.49506 -1.176393) (xy -3.56672 -1.193245)
      (xy -3.660183 -1.211069) (xy -3.697659 -1.258611) (xy -3.704167 -1.35089) (xy -3.69362 -1.45163)
      (xy -3.645549 -1.507829) (xy -3.556 -1.54495) (xy -3.436204 -1.61572) (xy -3.390576 -1.71448)
      (xy -3.423513 -1.827205) (xy -3.45478 -1.867765) (xy -3.49985 -1.9264) (xy -3.496222 -1.974061)
      (xy -3.438068 -2.042065) (xy -3.41872 -2.061524) (xy -3.342042 -2.132091) (xy -3.287675 -2.147696)
      (xy -3.219074 -2.11424) (xy -3.1938 -2.097842) (xy -3.066274 -2.051291) (xy -2.957301 -2.077228)
      (xy -2.886111 -2.16773) (xy -2.871117 -2.230794) (xy -2.849929 -2.311869) (xy -2.793428 -2.349318)
      (xy -2.703884 -2.362333) (xy -2.600807 -2.36429) (xy -2.551367 -2.331781)) (layer F.SilkS) (width 0.01))
    (fp_poly (pts (xy -2.726795 -1.505616) (xy -2.738152 -1.440021) (xy -2.758917 -1.401123) (xy -2.817926 -1.330479)
      (xy -2.863997 -1.313591) (xy -2.878667 -1.346576) (xy -2.856046 -1.404242) (xy -2.818628 -1.462926)
      (xy -2.758575 -1.518378) (xy -2.726795 -1.505616)) (layer F.SilkS) (width 0.01))
    (fp_poly (pts (xy -0.725971 -3.802952) (xy -0.685148 -3.767002) (xy -0.677334 -3.681953) (xy -0.657464 -3.577401)
      (xy -0.584176 -3.518865) (xy -0.568745 -3.512619) (xy -0.462058 -3.478204) (xy -0.402381 -3.487425)
      (xy -0.359577 -3.549029) (xy -0.34637 -3.577167) (xy -0.298666 -3.658862) (xy -0.245078 -3.67391)
      (xy -0.161176 -3.625595) (xy -0.134732 -3.605643) (xy -0.068998 -3.542467) (xy -0.064327 -3.477778)
      (xy -0.089428 -3.41429) (xy -0.119221 -3.322448) (xy -0.094182 -3.254442) (xy -0.052689 -3.208874)
      (xy 0.01466 -3.150209) (xy 0.069523 -3.146945) (xy 0.149097 -3.192884) (xy 0.228829 -3.239623)
      (xy 0.269817 -3.253121) (xy 0.270485 -3.252466) (xy 0.296961 -3.21059) (xy 0.348728 -3.12804)
      (xy 0.352455 -3.122084) (xy 0.425285 -3.005667) (xy 0.087522 -3.005667) (xy -0.096104 -3.009686)
      (xy -0.222358 -3.025486) (xy -0.318307 -3.058679) (xy -0.398857 -3.106521) (xy -0.623326 -3.213331)
      (xy -0.853938 -3.241967) (xy -1.077865 -3.19677) (xy -1.282282 -3.082081) (xy -1.454364 -2.902241)
      (xy -1.560568 -2.713354) (xy -1.672659 -2.530264) (xy -1.821368 -2.398877) (xy -1.988974 -2.333204)
      (xy -2.047581 -2.328334) (xy -2.123239 -2.338765) (xy -2.15387 -2.38695) (xy -2.159 -2.473818)
      (xy -2.150693 -2.573365) (xy -2.109635 -2.61718) (xy -2.024208 -2.632568) (xy -1.920592 -2.659986)
      (xy -1.868212 -2.731288) (xy -1.857921 -2.764546) (xy -1.84686 -2.85654) (xy -1.889849 -2.909792)
      (xy -1.929214 -2.930092) (xy -2.008984 -2.978403) (xy -2.024915 -3.036589) (xy -1.980601 -3.128833)
      (xy -1.962862 -3.156498) (xy -1.908426 -3.227301) (xy -1.858205 -3.233433) (xy -1.789949 -3.19402)
      (xy -1.709953 -3.150577) (xy -1.653208 -3.160648) (xy -1.602482 -3.201764) (xy -1.548884 -3.268192)
      (xy -1.542186 -3.346439) (xy -1.580666 -3.465696) (xy -1.586129 -3.479056) (xy -1.583806 -3.543435)
      (xy -1.510765 -3.603926) (xy -1.488238 -3.616102) (xy -1.398491 -3.65615) (xy -1.344117 -3.646748)
      (xy -1.286762 -3.580076) (xy -1.282433 -3.574145) (xy -1.216512 -3.501703) (xy -1.149099 -3.491258)
      (xy -1.088793 -3.510134) (xy -1.002317 -3.564497) (xy -0.974284 -3.656658) (xy -0.973667 -3.681953)
      (xy -0.965511 -3.767967) (xy -0.923913 -3.803247) (xy -0.8255 -3.81) (xy -0.725971 -3.802952)) (layer F.SilkS) (width 0.01))
  )

  (module Connector_Dsub:DSUB-15_Male_Horizontal_P2.77x2.84mm_EdgePinOffset9.90mm_Housed_MountingHolesOffset11.32mm (layer F.Cu) (tedit 6015B0C8) (tstamp 5F6D946D)
    (at 123 56)
    (descr "15-pin D-Sub connector, horizontal/angled (90 deg), THT-mount, male, pitch 2.77x2.84mm, pin-PCB-offset 9.9mm, distance of mounting holes 33.3mm, distance of mounting holes to PCB edge 11.32mm, see https://disti-assets.s3.amazonaws.com/tonar/files/datasheets/16730.pdf")
    (tags "15-pin D-Sub connector horizontal angled 90deg THT male pitch 2.77x2.84mm pin-PCB-offset 9.9mm mounting-holes-distance 33.3mm mounting-hole-offset 33.3mm")
    (path /5F6A829A)
    (fp_text reference J3 (at 9.695 -2.8) (layer F.Fab)
      (effects (font (size 1 1) (thickness 0.15)))
    )
    (fp_text value DB15_Male (at 9.695 20.64) (layer F.Fab)
      (effects (font (size 1 1) (thickness 0.15)))
    )
    (fp_line (start -9.905 -1.8) (end -9.905 12.74) (layer F.Fab) (width 0.1))
    (fp_line (start -9.905 12.74) (end 29.295 12.74) (layer F.Fab) (width 0.1))
    (fp_line (start 29.295 12.74) (end 29.295 -1.8) (layer F.Fab) (width 0.1))
    (fp_line (start 29.295 -1.8) (end -9.905 -1.8) (layer F.Fab) (width 0.1))
    (fp_line (start -9.905 12.74) (end -9.905 13.14) (layer F.Fab) (width 0.1))
    (fp_line (start -9.905 13.14) (end 29.295 13.14) (layer F.Fab) (width 0.1))
    (fp_line (start 29.295 13.14) (end 29.295 12.74) (layer F.Fab) (width 0.1))
    (fp_line (start 29.295 12.74) (end -9.905 12.74) (layer F.Fab) (width 0.1))
    (fp_line (start -2.605 13.14) (end -2.605 19.14) (layer F.Fab) (width 0.1))
    (fp_line (start -2.605 19.14) (end 21.995 19.14) (layer F.Fab) (width 0.1))
    (fp_line (start 21.995 19.14) (end 21.995 13.14) (layer F.Fab) (width 0.1))
    (fp_line (start 21.995 13.14) (end -2.605 13.14) (layer F.Fab) (width 0.1))
    (fp_line (start -9.455 13.14) (end -9.455 18.14) (layer F.Fab) (width 0.1))
    (fp_line (start -9.455 18.14) (end -4.455 18.14) (layer F.Fab) (width 0.1))
    (fp_line (start -4.455 18.14) (end -4.455 13.14) (layer F.Fab) (width 0.1))
    (fp_line (start -4.455 13.14) (end -9.455 13.14) (layer F.Fab) (width 0.1))
    (fp_line (start 23.845 13.14) (end 23.845 18.14) (layer F.Fab) (width 0.1))
    (fp_line (start 23.845 18.14) (end 28.845 18.14) (layer F.Fab) (width 0.1))
    (fp_line (start 28.845 18.14) (end 28.845 13.14) (layer F.Fab) (width 0.1))
    (fp_line (start 28.845 13.14) (end 23.845 13.14) (layer F.Fab) (width 0.1))
    (fp_line (start -8.555 12.74) (end -8.555 1.42) (layer F.Fab) (width 0.1))
    (fp_line (start -5.355 12.74) (end -5.355 1.42) (layer F.Fab) (width 0.1))
    (fp_line (start 24.745 12.74) (end 24.745 1.42) (layer F.Fab) (width 0.1))
    (fp_line (start 27.945 12.74) (end 27.945 1.42) (layer F.Fab) (width 0.1))
    (fp_line (start -10.45 -2.35) (end -10.45 19.65) (layer F.CrtYd) (width 0.05))
    (fp_line (start -10.45 19.65) (end 29.8 19.65) (layer F.CrtYd) (width 0.05))
    (fp_line (start 29.8 19.65) (end 29.8 -2.35) (layer F.CrtYd) (width 0.05))
    (fp_line (start 29.8 -2.35) (end -10.45 -2.35) (layer F.CrtYd) (width 0.05))
    (fp_text user %R (at 9.695 16.14) (layer F.Fab)
      (effects (font (size 1 1) (thickness 0.15)))
    )
    (fp_arc (start 26.345 1.42) (end 24.745 1.42) (angle 180) (layer F.Fab) (width 0.1))
    (fp_arc (start -6.955 1.42) (end -8.555 1.42) (angle 180) (layer F.Fab) (width 0.1))
    (pad 0 thru_hole circle (at 26.345 1.42) (size 4 4) (drill 3.2) (layers *.Cu *.Mask)
      (net 7 "Net-(J3-Pad0)"))
    (pad 0 thru_hole circle (at -6.955 1.42) (size 4 4) (drill 3.2) (layers *.Cu *.Mask)
      (net 7 "Net-(J3-Pad0)"))
    (pad 15 thru_hole circle (at 18.005 2.84) (size 1.6 1.6) (drill 1) (layers *.Cu *.Mask)
      (net 3 ENC1B))
    (pad 14 thru_hole circle (at 15.235 2.84) (size 1.6 1.6) (drill 1) (layers *.Cu *.Mask)
      (net 4 ENC1A))
    (pad 13 thru_hole circle (at 12.465 2.84) (size 1.6 1.6) (drill 1) (layers *.Cu *.Mask)
      (net 8 "Net-(J3-Pad13)"))
    (pad 12 thru_hole circle (at 9.695 2.84) (size 1.6 1.6) (drill 1) (layers *.Cu *.Mask)
      (net 14 "Net-(J3-Pad12)"))
    (pad 11 thru_hole circle (at 6.925 2.84) (size 1.6 1.6) (drill 1) (layers *.Cu *.Mask)
      (net 9 UART_TX))
    (pad 10 thru_hole circle (at 4.155 2.84) (size 1.6 1.6) (drill 1) (layers *.Cu *.Mask)
      (net 1 GND))
    (pad 9 thru_hole circle (at 1.385 2.84) (size 1.6 1.6) (drill 1) (layers *.Cu *.Mask)
      (net 10 "Net-(J3-Pad9)"))
    (pad 8 thru_hole circle (at 19.39 0) (size 1.6 1.6) (drill 1) (layers *.Cu *.Mask)
      (net 5 ENC2B))
    (pad 7 thru_hole circle (at 16.62 0) (size 1.6 1.6) (drill 1) (layers *.Cu *.Mask)
      (net 6 ENC2A))
    (pad 6 thru_hole circle (at 13.85 0) (size 1.6 1.6) (drill 1) (layers *.Cu *.Mask)
      (net 11 "Net-(J3-Pad6)"))
    (pad 5 thru_hole circle (at 11.08 0) (size 1.6 1.6) (drill 1) (layers *.Cu *.Mask)
      (net 15 "Net-(J3-Pad5)"))
    (pad 4 thru_hole circle (at 8.31 0) (size 1.6 1.6) (drill 1) (layers *.Cu *.Mask)
      (net 12 UART_RX))
    (pad 3 thru_hole circle (at 5.54 0) (size 1.6 1.6) (drill 1) (layers *.Cu *.Mask)
      (net 2 +5V))
    (pad 2 thru_hole circle (at 2.77 0) (size 1.6 1.6) (drill 1) (layers *.Cu *.Mask)
      (net 1 GND))
    (pad 1 thru_hole rect (at 0 0) (size 1.6 1.6) (drill 1) (layers *.Cu *.Mask)
      (net 13 "Net-(J3-Pad1)"))
    (model ${KISYS3DMOD}/Connector_Dsub.3dshapes/DSUB-15_Male_Horizontal_P2.77x2.84mm_EdgePinOffset9.90mm_Housed_MountingHolesOffset11.32mm.wrl
      (at (xyz 0 0 0))
      (scale (xyz 1 1 1))
      (rotate (xyz 0 0 0))
    )
  )

  (module MCP230_DSUB_Breakout:JST_XH_S4B-XH-A-1_1x04_P2.50mm_Horizontal_no_tabs (layer F.Cu) (tedit 601580D6) (tstamp 5F6D9405)
    (at 140.5 50 180)
    (descr "JST XH series connector, S4B-XH-A-1 (http://www.jst-mfg.com/product/pdf/eng/eXH.pdf), generated with kicad-footprint-generator")
    (tags "connector JST XH horizontal")
    (path /5F6B9CD6)
    (fp_text reference J1 (at 3.75 -2.5 180) (layer F.Fab)
      (effects (font (size 1 1) (thickness 0.15)))
    )
    (fp_text value ENCA (at 3.75 8.8 180) (layer F.Fab)
      (effects (font (size 1 1) (thickness 0.15)))
    )
    (fp_line (start 0 -0.4) (end 0.625 0.6) (layer F.Fab) (width 0.1))
    (fp_line (start -0.625 0.6) (end 0 -0.4) (layer F.Fab) (width 0.1))
    (fp_line (start 7.75 1.6) (end 7.25 1.6) (layer F.SilkS) (width 0.12))
    (fp_line (start 7.75 7.1) (end 7.75 1.6) (layer F.SilkS) (width 0.12))
    (fp_line (start 7.25 7.1) (end 7.75 7.1) (layer F.SilkS) (width 0.12))
    (fp_line (start 7.25 1.6) (end 7.25 7.1) (layer F.SilkS) (width 0.12))
    (fp_line (start 5.25 1.6) (end 4.75 1.6) (layer F.SilkS) (width 0.12))
    (fp_line (start 5.25 7.1) (end 5.25 1.6) (layer F.SilkS) (width 0.12))
    (fp_line (start 4.75 7.1) (end 5.25 7.1) (layer F.SilkS) (width 0.12))
    (fp_line (start 4.75 1.6) (end 4.75 7.1) (layer F.SilkS) (width 0.12))
    (fp_line (start 2.75 1.6) (end 2.25 1.6) (layer F.SilkS) (width 0.12))
    (fp_line (start 2.75 7.1) (end 2.75 1.6) (layer F.SilkS) (width 0.12))
    (fp_line (start 2.25 7.1) (end 2.75 7.1) (layer F.SilkS) (width 0.12))
    (fp_line (start 2.25 1.6) (end 2.25 7.1) (layer F.SilkS) (width 0.12))
    (fp_line (start 0.25 1.6) (end -0.25 1.6) (layer F.SilkS) (width 0.12))
    (fp_line (start 0.25 7.1) (end 0.25 1.6) (layer F.SilkS) (width 0.12))
    (fp_line (start -0.25 7.1) (end 0.25 7.1) (layer F.SilkS) (width 0.12))
    (fp_line (start -0.25 1.6) (end -0.25 7.1) (layer F.SilkS) (width 0.12))
    (fp_line (start 10 0.6) (end 3.75 0.6) (layer F.Fab) (width 0.1))
    (fp_line (start 9.95 7.6) (end 9.95 0.5) (layer F.Fab) (width 0.1))
    (fp_line (start 3.75 7.6) (end 9.95 7.6) (layer F.Fab) (width 0.1))
    (fp_line (start -2.5 0.6) (end 3.75 0.6) (layer F.Fab) (width 0.1))
    (fp_line (start -2.45 7.6) (end -2.45 0.5) (layer F.Fab) (width 0.1))
    (fp_line (start 3.75 7.6) (end -2.45 7.6) (layer F.Fab) (width 0.1))
    (fp_line (start 10.06 0.5) (end 8.64 0.5) (layer F.SilkS) (width 0.12))
    (fp_line (start 10.06 7.71) (end 10.06 0.5) (layer F.SilkS) (width 0.12))
    (fp_line (start 3.75 7.71) (end 10.06 7.71) (layer F.SilkS) (width 0.12))
    (fp_line (start -2.56 0.5) (end -1.14 0.5) (layer F.SilkS) (width 0.12))
    (fp_line (start -2.56 7.71) (end -2.56 0.5) (layer F.SilkS) (width 0.12))
    (fp_line (start 3.75 7.71) (end -2.56 7.71) (layer F.SilkS) (width 0.12))
    (fp_line (start 10.45 -4.4) (end -2.95 -4.4) (layer F.CrtYd) (width 0.05))
    (fp_line (start 10.45 8.1) (end 10.45 -4.4) (layer F.CrtYd) (width 0.05))
    (fp_line (start -2.95 8.1) (end 10.45 8.1) (layer F.CrtYd) (width 0.05))
    (fp_line (start -2.95 -4.4) (end -2.95 8.1) (layer F.CrtYd) (width 0.05))
    (fp_text user %R (at 3.75 1.85 180) (layer F.Fab)
      (effects (font (size 1 1) (thickness 0.15)))
    )
    (pad 4 thru_hole oval (at 7.5 0 180) (size 1.7 1.95) (drill 0.95) (layers *.Cu *.Mask)
      (net 1 GND))
    (pad 3 thru_hole oval (at 5 0 180) (size 1.7 1.95) (drill 0.95) (layers *.Cu *.Mask)
      (net 2 +5V))
    (pad 2 thru_hole oval (at 2.5 0 180) (size 1.7 1.95) (drill 0.95) (layers *.Cu *.Mask)
      (net 4 ENC1A))
    (pad 1 thru_hole roundrect (at 0 0 180) (size 1.7 1.95) (drill 0.95) (layers *.Cu *.Mask) (roundrect_rratio 0.147059)
      (net 3 ENC1B))
    (model ${KISYS3DMOD}/Connector_JST.3dshapes/JST_XH_S4B-XH-A-1_1x04_P2.50mm_Horizontal.wrl
      (at (xyz 0 0 0))
      (scale (xyz 1 1 1))
      (rotate (xyz 0 0 0))
    )
  )

  (module Connector_JST:JST_XH_S3B-XH-A-1_1x03_P2.50mm_Horizontal_notabs (layer F.Cu) (tedit 6015808F) (tstamp 6015D6C9)
    (at 126.5 50 180)
    (descr "JST XH series connector, S3B-XH-A-1 (http://www.jst-mfg.com/product/pdf/eng/eXH.pdf), generated with kicad-footprint-generator")
    (tags "connector JST XH horizontal")
    (path /60158F28)
    (fp_text reference J4 (at 2.5 -5.1) (layer F.Fab)
      (effects (font (size 1 1) (thickness 0.15)))
    )
    (fp_text value Conn_01x03 (at 2.5 8.8) (layer F.Fab)
      (effects (font (size 1 1) (thickness 0.15)))
    )
    (fp_line (start 0 -0.4) (end 0.625 0.6) (layer F.Fab) (width 0.1))
    (fp_line (start -0.625 0.6) (end 0 -0.4) (layer F.Fab) (width 0.1))
    (fp_line (start 5.25 1.6) (end 4.75 1.6) (layer F.SilkS) (width 0.12))
    (fp_line (start 5.25 7.1) (end 5.25 1.6) (layer F.SilkS) (width 0.12))
    (fp_line (start 4.75 7.1) (end 5.25 7.1) (layer F.SilkS) (width 0.12))
    (fp_line (start 4.75 1.6) (end 4.75 7.1) (layer F.SilkS) (width 0.12))
    (fp_line (start 2.75 1.6) (end 2.25 1.6) (layer F.SilkS) (width 0.12))
    (fp_line (start 2.75 7.1) (end 2.75 1.6) (layer F.SilkS) (width 0.12))
    (fp_line (start 2.25 7.1) (end 2.75 7.1) (layer F.SilkS) (width 0.12))
    (fp_line (start 2.25 1.6) (end 2.25 7.1) (layer F.SilkS) (width 0.12))
    (fp_line (start 0.25 1.6) (end -0.25 1.6) (layer F.SilkS) (width 0.12))
    (fp_line (start 0.25 7.1) (end 0.25 1.6) (layer F.SilkS) (width 0.12))
    (fp_line (start -0.25 7.1) (end 0.25 7.1) (layer F.SilkS) (width 0.12))
    (fp_line (start -0.25 1.6) (end -0.25 7.1) (layer F.SilkS) (width 0.12))
    (fp_line (start 6.25 0.6) (end 2.5 0.6) (layer F.Fab) (width 0.1))
    (fp_line (start 6.25 -3.9) (end 6.25 0.6) (layer F.Fab) (width 0.1))
    (fp_line (start 7.45 -3.9) (end 6.25 -3.9) (layer F.Fab) (width 0.1))
    (fp_line (start 7.45 7.6) (end 7.45 -3.9) (layer F.Fab) (width 0.1))
    (fp_line (start 2.5 7.6) (end 7.45 7.6) (layer F.Fab) (width 0.1))
    (fp_line (start -1.25 0.6) (end 2.5 0.6) (layer F.Fab) (width 0.1))
    (fp_line (start -1.25 -3.9) (end -1.25 0.6) (layer F.Fab) (width 0.1))
    (fp_line (start -2.45 -3.9) (end -1.25 -3.9) (layer F.Fab) (width 0.1))
    (fp_line (start -2.45 7.6) (end -2.45 -3.9) (layer F.Fab) (width 0.1))
    (fp_line (start 2.5 7.6) (end -2.45 7.6) (layer F.Fab) (width 0.1))
    (fp_line (start 7.56 0.5) (end 6.14 0.5) (layer F.SilkS) (width 0.12))
    (fp_line (start 7.56 7.71) (end 7.56 0.5) (layer F.SilkS) (width 0.12))
    (fp_line (start 2.5 7.71) (end 7.56 7.71) (layer F.SilkS) (width 0.12))
    (fp_line (start -2.56 0.5) (end -1.14 0.5) (layer F.SilkS) (width 0.12))
    (fp_line (start -2.56 7.71) (end -2.56 0.5) (layer F.SilkS) (width 0.12))
    (fp_line (start 2.5 7.71) (end -2.56 7.71) (layer F.SilkS) (width 0.12))
    (fp_line (start 7.95 -4.4) (end -2.95 -4.4) (layer F.CrtYd) (width 0.05))
    (fp_line (start 7.95 8.1) (end 7.95 -4.4) (layer F.CrtYd) (width 0.05))
    (fp_line (start -2.95 8.1) (end 7.95 8.1) (layer F.CrtYd) (width 0.05))
    (fp_line (start -2.95 -4.4) (end -2.95 8.1) (layer F.CrtYd) (width 0.05))
    (fp_text user %R (at 2.5 1.85) (layer F.Fab)
      (effects (font (size 1 1) (thickness 0.15)))
    )
    (pad 3 thru_hole oval (at 5 0 180) (size 1.7 1.95) (drill 0.95) (layers *.Cu *.Mask)
      (net 1 GND))
    (pad 2 thru_hole oval (at 2.5 0 180) (size 1.7 1.95) (drill 0.95) (layers *.Cu *.Mask)
      (net 9 UART_TX))
    (pad 1 thru_hole roundrect (at 0 0 180) (size 1.7 1.95) (drill 0.95) (layers *.Cu *.Mask) (roundrect_rratio 0.147059)
      (net 12 UART_RX))
    (model ${KISYS3DMOD}/Connector_JST.3dshapes/JST_XH_S3B-XH-A-1_1x03_P2.50mm_Horizontal.wrl
      (at (xyz 0 0 0))
      (scale (xyz 1 1 1))
      (rotate (xyz 0 0 0))
    )
  )

  (module MCP230_DSUB_Breakout:JST_XH_S4B-XH-A-1_1x04_P2.50mm_Horizontal_no_tabs (layer F.Cu) (tedit 601580E4) (tstamp 5F6D9433)
    (at 154.5 50 180)
    (descr "JST XH series connector, S4B-XH-A-1 (http://www.jst-mfg.com/product/pdf/eng/eXH.pdf), generated with kicad-footprint-generator")
    (tags "connector JST XH horizontal")
    (path /5F6BFB08)
    (fp_text reference J2 (at 3.75 -2.5 180) (layer F.Fab)
      (effects (font (size 1 1) (thickness 0.15)))
    )
    (fp_text value ENCB (at 3.75 8.8 180) (layer F.Fab)
      (effects (font (size 1 1) (thickness 0.15)))
    )
    (fp_line (start 0 -0.4) (end 0.625 0.6) (layer F.Fab) (width 0.1))
    (fp_line (start -0.625 0.6) (end 0 -0.4) (layer F.Fab) (width 0.1))
    (fp_line (start 7.75 1.6) (end 7.25 1.6) (layer F.SilkS) (width 0.12))
    (fp_line (start 7.75 7.1) (end 7.75 1.6) (layer F.SilkS) (width 0.12))
    (fp_line (start 7.25 7.1) (end 7.75 7.1) (layer F.SilkS) (width 0.12))
    (fp_line (start 7.25 1.6) (end 7.25 7.1) (layer F.SilkS) (width 0.12))
    (fp_line (start 5.25 1.6) (end 4.75 1.6) (layer F.SilkS) (width 0.12))
    (fp_line (start 5.25 7.1) (end 5.25 1.6) (layer F.SilkS) (width 0.12))
    (fp_line (start 4.75 7.1) (end 5.25 7.1) (layer F.SilkS) (width 0.12))
    (fp_line (start 4.75 1.6) (end 4.75 7.1) (layer F.SilkS) (width 0.12))
    (fp_line (start 2.75 1.6) (end 2.25 1.6) (layer F.SilkS) (width 0.12))
    (fp_line (start 2.75 7.1) (end 2.75 1.6) (layer F.SilkS) (width 0.12))
    (fp_line (start 2.25 7.1) (end 2.75 7.1) (layer F.SilkS) (width 0.12))
    (fp_line (start 2.25 1.6) (end 2.25 7.1) (layer F.SilkS) (width 0.12))
    (fp_line (start 0.25 1.6) (end -0.25 1.6) (layer F.SilkS) (width 0.12))
    (fp_line (start 0.25 7.1) (end 0.25 1.6) (layer F.SilkS) (width 0.12))
    (fp_line (start -0.25 7.1) (end 0.25 7.1) (layer F.SilkS) (width 0.12))
    (fp_line (start -0.25 1.6) (end -0.25 7.1) (layer F.SilkS) (width 0.12))
    (fp_line (start 10 0.6) (end 3.75 0.6) (layer F.Fab) (width 0.1))
    (fp_line (start 9.95 7.6) (end 9.95 0.5) (layer F.Fab) (width 0.1))
    (fp_line (start 3.75 7.6) (end 9.95 7.6) (layer F.Fab) (width 0.1))
    (fp_line (start -2.5 0.6) (end 3.75 0.6) (layer F.Fab) (width 0.1))
    (fp_line (start -2.45 7.6) (end -2.45 0.5) (layer F.Fab) (width 0.1))
    (fp_line (start 3.75 7.6) (end -2.45 7.6) (layer F.Fab) (width 0.1))
    (fp_line (start 10.06 0.5) (end 8.64 0.5) (layer F.SilkS) (width 0.12))
    (fp_line (start 10.06 7.71) (end 10.06 0.5) (layer F.SilkS) (width 0.12))
    (fp_line (start 3.75 7.71) (end 10.06 7.71) (layer F.SilkS) (width 0.12))
    (fp_line (start -2.56 0.5) (end -1.14 0.5) (layer F.SilkS) (width 0.12))
    (fp_line (start -2.56 7.71) (end -2.56 0.5) (layer F.SilkS) (width 0.12))
    (fp_line (start 3.75 7.71) (end -2.56 7.71) (layer F.SilkS) (width 0.12))
    (fp_line (start 10.45 -4.4) (end -2.95 -4.4) (layer F.CrtYd) (width 0.05))
    (fp_line (start 10.45 8.1) (end 10.45 -4.4) (layer F.CrtYd) (width 0.05))
    (fp_line (start -2.95 8.1) (end 10.45 8.1) (layer F.CrtYd) (width 0.05))
    (fp_line (start -2.95 -4.4) (end -2.95 8.1) (layer F.CrtYd) (width 0.05))
    (fp_text user %R (at 3.75 1.85 180) (layer F.Fab)
      (effects (font (size 1 1) (thickness 0.15)))
    )
    (pad 4 thru_hole oval (at 7.5 0 180) (size 1.7 1.95) (drill 0.95) (layers *.Cu *.Mask)
      (net 1 GND))
    (pad 3 thru_hole oval (at 5 0 180) (size 1.7 1.95) (drill 0.95) (layers *.Cu *.Mask)
      (net 2 +5V))
    (pad 2 thru_hole oval (at 2.5 0 180) (size 1.7 1.95) (drill 0.95) (layers *.Cu *.Mask)
      (net 6 ENC2A))
    (pad 1 thru_hole roundrect (at 0 0 180) (size 1.7 1.95) (drill 0.95) (layers *.Cu *.Mask) (roundrect_rratio 0.147059)
      (net 5 ENC2B))
    (model ${KISYS3DMOD}/Connector_JST.3dshapes/JST_XH_S4B-XH-A-1_1x04_P2.50mm_Horizontal.wrl
      (at (xyz 0 0 0))
      (scale (xyz 1 1 1))
      (rotate (xyz 0 0 0))
    )
  )

  (module Connector_PinHeader_2.54mm:PinHeader_1x02_P2.54mm_Vertical (layer F.Cu) (tedit 59FED5CC) (tstamp 6015D6DF)
    (at 116 50 180)
    (descr "Through hole straight pin header, 1x02, 2.54mm pitch, single row")
    (tags "Through hole pin header THT 1x02 2.54mm single row")
    (path /6015DFFA)
    (fp_text reference J5 (at 0 -2.33) (layer F.Fab)
      (effects (font (size 1 1) (thickness 0.15)))
    )
    (fp_text value Conn_01x02 (at 0 4.87) (layer F.Fab)
      (effects (font (size 1 1) (thickness 0.15)))
    )
    (fp_line (start 1.8 -1.8) (end -1.8 -1.8) (layer F.CrtYd) (width 0.05))
    (fp_line (start 1.8 4.35) (end 1.8 -1.8) (layer F.CrtYd) (width 0.05))
    (fp_line (start -1.8 4.35) (end 1.8 4.35) (layer F.CrtYd) (width 0.05))
    (fp_line (start -1.8 -1.8) (end -1.8 4.35) (layer F.CrtYd) (width 0.05))
    (fp_line (start -1.33 -1.33) (end 0 -1.33) (layer F.SilkS) (width 0.12))
    (fp_line (start -1.33 0) (end -1.33 -1.33) (layer F.SilkS) (width 0.12))
    (fp_line (start -1.33 1.27) (end 1.33 1.27) (layer F.SilkS) (width 0.12))
    (fp_line (start 1.33 1.27) (end 1.33 3.87) (layer F.SilkS) (width 0.12))
    (fp_line (start -1.33 1.27) (end -1.33 3.87) (layer F.SilkS) (width 0.12))
    (fp_line (start -1.33 3.87) (end 1.33 3.87) (layer F.SilkS) (width 0.12))
    (fp_line (start -1.27 -0.635) (end -0.635 -1.27) (layer F.Fab) (width 0.1))
    (fp_line (start -1.27 3.81) (end -1.27 -0.635) (layer F.Fab) (width 0.1))
    (fp_line (start 1.27 3.81) (end -1.27 3.81) (layer F.Fab) (width 0.1))
    (fp_line (start 1.27 -1.27) (end 1.27 3.81) (layer F.Fab) (width 0.1))
    (fp_line (start -0.635 -1.27) (end 1.27 -1.27) (layer F.Fab) (width 0.1))
    (fp_text user %R (at 0 1.27 90) (layer F.Fab)
      (effects (font (size 1 1) (thickness 0.15)))
    )
    (pad 2 thru_hole oval (at 0 2.54 180) (size 1.7 1.7) (drill 1) (layers *.Cu *.Mask)
      (net 1 GND))
    (pad 1 thru_hole rect (at 0 0 180) (size 1.7 1.7) (drill 1) (layers *.Cu *.Mask)
      (net 2 +5V))
    (model ${KISYS3DMOD}/Connector_PinHeader_2.54mm.3dshapes/PinHeader_1x02_P2.54mm_Vertical.wrl
      (at (xyz 0 0 0))
      (scale (xyz 1 1 1))
      (rotate (xyz 0 0 0))
    )
  )

  (gr_text "E. MESSARA | FEB 2021" (at 161.5 49.5 90) (layer B.SilkS) (tstamp 601623AB)
    (effects (font (size 1 1) (thickness 0.15) italic) (justify left mirror))
  )
  (gr_text "MCP230A\nBREAKOUT V2.0" (at 160 60.5 90) (layer F.SilkS) (tstamp 60162309)
    (effects (font (size 1 1) (thickness 0.15)) (justify left))
  )
  (gr_text ENC2B (at 154.5 48.5 90) (layer B.SilkS) (tstamp 6015C06F)
    (effects (font (size 1 1) (thickness 0.15) italic) (justify right mirror))
  )
  (gr_text ENC2A (at 152 48.5 90) (layer B.SilkS) (tstamp 6015C06D)
    (effects (font (size 1 1) (thickness 0.15) italic) (justify right mirror))
  )
  (gr_text ENC1B (at 140.5 48.5 90) (layer B.SilkS) (tstamp 6015C06B)
    (effects (font (size 1 1) (thickness 0.15) italic) (justify right mirror))
  )
  (gr_text ENC1A (at 138 48.5 90) (layer B.SilkS) (tstamp 6015C069)
    (effects (font (size 1 1) (thickness 0.15) italic) (justify right mirror))
  )
  (gr_text +5V (at 149.5 48.5 90) (layer B.SilkS) (tstamp 6015C03C)
    (effects (font (size 1 1) (thickness 0.15) italic) (justify right mirror))
  )
  (gr_text GND (at 147 48.5 90) (layer B.SilkS) (tstamp 6015C00F)
    (effects (font (size 1 1) (thickness 0.15) italic) (justify right mirror))
  )
  (gr_text +5V (at 135.5 48.5 90) (layer B.SilkS) (tstamp 6015BB99)
    (effects (font (size 1 1) (thickness 0.15) italic) (justify right mirror))
  )
  (gr_text GND (at 133 48.5 90) (layer B.SilkS) (tstamp 6015BB97)
    (effects (font (size 1 1) (thickness 0.15) italic) (justify right mirror))
  )
  (gr_text UART_RX (at 126.5 48.5 90) (layer B.SilkS) (tstamp 6015BB95)
    (effects (font (size 1 1) (thickness 0.15) italic) (justify right mirror))
  )
  (gr_text UART_TX (at 124 48.5 90) (layer B.SilkS) (tstamp 6015BB93)
    (effects (font (size 1 1) (thickness 0.15) italic) (justify right mirror))
  )
  (gr_text GND (at 121.5 48.5 90) (layer B.SilkS) (tstamp 6015BB8E)
    (effects (font (size 1 1) (thickness 0.15) italic) (justify right mirror))
  )
  (gr_text ENC2 (at 150.75 52.5) (layer F.SilkS) (tstamp 6015BA40)
    (effects (font (size 1 1) (thickness 0.15)))
  )
  (gr_text ENC1 (at 136.75 52.5) (layer F.SilkS) (tstamp 6015BA3D)
    (effects (font (size 1 1) (thickness 0.15)))
  )
  (gr_text GND (at 116 45) (layer F.SilkS) (tstamp 6015B927)
    (effects (font (size 1 1) (thickness 0.15) italic))
  )
  (gr_text +5V (at 116 52.5) (layer F.SilkS) (tstamp 6015B925)
    (effects (font (size 1 1) (thickness 0.15) italic))
  )
  (gr_text UART (at 124 52.5) (layer F.SilkS)
    (effects (font (size 1 1) (thickness 0.15)))
  )
  (gr_arc (start 114 42) (end 114 41) (angle -90) (layer Edge.Cuts) (width 0.05))
  (gr_arc (start 162 42) (end 163 42) (angle -90) (layer Edge.Cuts) (width 0.05))
  (gr_arc (start 162 68) (end 162 69) (angle -90) (layer Edge.Cuts) (width 0.05))
  (gr_line (start 113 42) (end 113 69) (layer Edge.Cuts) (width 0.05) (tstamp 5F6D9D5D))
  (gr_line (start 162 41) (end 114 41) (layer Edge.Cuts) (width 0.05))
  (gr_line (start 163 68) (end 163 42) (layer Edge.Cuts) (width 0.05))
  (gr_line (start 113 69) (end 162 69) (layer Edge.Cuts) (width 0.05))

  (segment (start 138.369999 52.130001) (end 140.5 50) (width 0.5) (layer F.Cu) (net 3))
  (segment (start 138.369999 56.600001) (end 138.369999 52.130001) (width 0.5) (layer F.Cu) (net 3))
  (segment (start 140.609998 58.84) (end 138.369999 56.600001) (width 0.5) (layer F.Cu) (net 3))
  (segment (start 141.005 58.84) (end 140.609998 58.84) (width 0.5) (layer F.Cu) (net 3))
  (segment (start 135.599999 56.600001) (end 135.599999 52.400001) (width 0.5) (layer F.Cu) (net 4))
  (segment (start 137.839998 58.84) (end 135.599999 56.600001) (width 0.5) (layer F.Cu) (net 4))
  (segment (start 135.599999 52.400001) (end 138 50) (width 0.5) (layer F.Cu) (net 4))
  (segment (start 138.235 58.84) (end 137.839998 58.84) (width 0.5) (layer F.Cu) (net 4))
  (segment (start 149.530001 54.969999) (end 154.5 50) (width 0.5) (layer F.Cu) (net 5))
  (segment (start 143.420001 54.969999) (end 149.530001 54.969999) (width 0.5) (layer F.Cu) (net 5))
  (segment (start 142.39 56) (end 143.420001 54.969999) (width 0.5) (layer F.Cu) (net 5))
  (segment (start 152 50) (end 150 52) (width 0.5) (layer F.Cu) (net 6))
  (segment (start 143.62 52) (end 139.62 56) (width 0.5) (layer F.Cu) (net 6))
  (segment (start 150 52) (end 143.62 52) (width 0.5) (layer F.Cu) (net 6))
  (segment (start 127.020001 53.020001) (end 124 50) (width 0.5) (layer F.Cu) (net 9))
  (segment (start 129.529998 58.84) (end 127.020001 56.330003) (width 0.5) (layer F.Cu) (net 9))
  (segment (start 127.020001 56.330003) (end 127.020001 53.020001) (width 0.5) (layer F.Cu) (net 9))
  (segment (start 129.925 58.84) (end 129.529998 58.84) (width 0.5) (layer F.Cu) (net 9))
  (segment (start 131.31 54.81) (end 126.5 50) (width 0.5) (layer F.Cu) (net 12))
  (segment (start 131.31 56) (end 131.31 54.81) (width 0.5) (layer F.Cu) (net 12))

  (zone (net 1) (net_name GND) (layer F.Cu) (tstamp 0) (hatch edge 0.508)
    (connect_pads (clearance 0.508))
    (min_thickness 0.254)
    (fill yes (arc_segments 32) (thermal_gap 0.508) (thermal_bridge_width 0.508))
    (polygon
      (pts
        (xy 163 69) (xy 113 69) (xy 113 41) (xy 163 41)
      )
    )
    (filled_polygon
      (pts
        (xy 162.065424 41.66958) (xy 162.128356 41.68858) (xy 162.186405 41.719445) (xy 162.237343 41.760989) (xy 162.279248 41.811644)
        (xy 162.310515 41.869471) (xy 162.329956 41.932272) (xy 162.340001 42.027845) (xy 162.34 67.967721) (xy 162.33042 68.065424)
        (xy 162.31142 68.128357) (xy 162.280554 68.186406) (xy 162.239011 68.237343) (xy 162.188356 68.279248) (xy 162.130529 68.310515)
        (xy 162.067728 68.329956) (xy 161.972165 68.34) (xy 113.66 68.34) (xy 113.66 58.547689) (xy 113.709893 58.668141)
        (xy 113.998262 59.099715) (xy 114.365285 59.466738) (xy 114.796859 59.755107) (xy 115.276399 59.953739) (xy 115.785475 60.055)
        (xy 116.304525 60.055) (xy 116.813601 59.953739) (xy 117.293141 59.755107) (xy 117.724715 59.466738) (xy 118.091738 59.099715)
        (xy 118.359711 58.698665) (xy 122.95 58.698665) (xy 122.95 58.981335) (xy 123.005147 59.258574) (xy 123.11332 59.519727)
        (xy 123.270363 59.754759) (xy 123.470241 59.954637) (xy 123.705273 60.11168) (xy 123.966426 60.219853) (xy 124.243665 60.275)
        (xy 124.526335 60.275) (xy 124.803574 60.219853) (xy 125.064727 60.11168) (xy 125.299759 59.954637) (xy 125.421694 59.832702)
        (xy 126.341903 59.832702) (xy 126.413486 60.076671) (xy 126.668996 60.197571) (xy 126.943184 60.2663) (xy 127.225512 60.280217)
        (xy 127.50513 60.238787) (xy 127.771292 60.143603) (xy 127.896514 60.076671) (xy 127.968097 59.832702) (xy 127.155 59.019605)
        (xy 126.341903 59.832702) (xy 125.421694 59.832702) (xy 125.499637 59.754759) (xy 125.65668 59.519727) (xy 125.764853 59.258574)
        (xy 125.770513 59.230118) (xy 125.851397 59.456292) (xy 125.918329 59.581514) (xy 126.162298 59.653097) (xy 126.975395 58.84)
        (xy 126.162298 58.026903) (xy 125.918329 58.098486) (xy 125.797429 58.353996) (xy 125.771788 58.456289) (xy 125.764853 58.421426)
        (xy 125.65668 58.160273) (xy 125.499637 57.925241) (xy 125.299759 57.725363) (xy 125.064727 57.56832) (xy 124.803574 57.460147)
        (xy 124.526335 57.405) (xy 124.243665 57.405) (xy 123.966426 57.460147) (xy 123.705273 57.56832) (xy 123.470241 57.725363)
        (xy 123.270363 57.925241) (xy 123.11332 58.160273) (xy 123.005147 58.421426) (xy 122.95 58.698665) (xy 118.359711 58.698665)
        (xy 118.380107 58.668141) (xy 118.578739 58.188601) (xy 118.68 57.679525) (xy 118.68 57.160475) (xy 118.578739 56.651399)
        (xy 118.380107 56.171859) (xy 118.091738 55.740285) (xy 117.724715 55.373262) (xy 117.465411 55.2) (xy 121.561928 55.2)
        (xy 121.561928 56.8) (xy 121.574188 56.924482) (xy 121.610498 57.04418) (xy 121.669463 57.154494) (xy 121.748815 57.251185)
        (xy 121.845506 57.330537) (xy 121.95582 57.389502) (xy 122.075518 57.425812) (xy 122.2 57.438072) (xy 123.8 57.438072)
        (xy 123.924482 57.425812) (xy 124.04418 57.389502) (xy 124.154494 57.330537) (xy 124.251185 57.251185) (xy 124.330537 57.154494)
        (xy 124.389502 57.04418) (xy 124.425812 56.924482) (xy 124.438072 56.8) (xy 124.438072 56.537087) (xy 124.466397 56.616292)
        (xy 124.533329 56.741514) (xy 124.777298 56.813097) (xy 125.590395 56) (xy 124.777298 55.186903) (xy 124.533329 55.258486)
        (xy 124.438072 55.459802) (xy 124.438072 55.2) (xy 124.425812 55.075518) (xy 124.389502 54.95582) (xy 124.330537 54.845506)
        (xy 124.251185 54.748815) (xy 124.154494 54.669463) (xy 124.04418 54.610498) (xy 123.924482 54.574188) (xy 123.8 54.561928)
        (xy 122.2 54.561928) (xy 122.075518 54.574188) (xy 121.95582 54.610498) (xy 121.845506 54.669463) (xy 121.748815 54.748815)
        (xy 121.669463 54.845506) (xy 121.610498 54.95582) (xy 121.574188 55.075518) (xy 121.561928 55.2) (xy 117.465411 55.2)
        (xy 117.293141 55.084893) (xy 116.813601 54.886261) (xy 116.304525 54.785) (xy 115.785475 54.785) (xy 115.276399 54.886261)
        (xy 114.796859 55.084893) (xy 114.365285 55.373262) (xy 113.998262 55.740285) (xy 113.709893 56.171859) (xy 113.66 56.292311)
        (xy 113.66 49.15) (xy 114.511928 49.15) (xy 114.511928 50.85) (xy 114.524188 50.974482) (xy 114.560498 51.09418)
        (xy 114.619463 51.204494) (xy 114.698815 51.301185) (xy 114.795506 51.380537) (xy 114.90582 51.439502) (xy 115.025518 51.475812)
        (xy 115.15 51.488072) (xy 116.85 51.488072) (xy 116.974482 51.475812) (xy 117.09418 51.439502) (xy 117.204494 51.380537)
        (xy 117.301185 51.301185) (xy 117.380537 51.204494) (xy 117.439502 51.09418) (xy 117.475812 50.974482) (xy 117.488072 50.85)
        (xy 117.488072 50.359267) (xy 120.03368 50.359267) (xy 120.107558 50.64083) (xy 120.234947 50.90257) (xy 120.410951 51.134429)
        (xy 120.628807 51.327496) (xy 120.880142 51.474352) (xy 121.14311 51.566476) (xy 121.373 51.445155) (xy 121.373 50.127)
        (xy 120.173835 50.127) (xy 120.03368 50.359267) (xy 117.488072 50.359267) (xy 117.488072 49.640733) (xy 120.03368 49.640733)
        (xy 120.173835 49.873) (xy 121.373 49.873) (xy 121.373 48.554845) (xy 121.627 48.554845) (xy 121.627 49.873)
        (xy 121.647 49.873) (xy 121.647 50.127) (xy 121.627 50.127) (xy 121.627 51.445155) (xy 121.85689 51.566476)
        (xy 122.119858 51.474352) (xy 122.371193 51.327496) (xy 122.589049 51.134429) (xy 122.745538 50.928278) (xy 122.759294 50.954013)
        (xy 122.944866 51.180134) (xy 123.170986 51.365706) (xy 123.428966 51.503599) (xy 123.708889 51.588513) (xy 124 51.617185)
        (xy 124.29111 51.588513) (xy 124.326269 51.577848) (xy 126.135002 53.386581) (xy 126.135002 54.612098) (xy 125.981816 54.5737)
        (xy 125.699488 54.559783) (xy 125.41987 54.601213) (xy 125.153708 54.696397) (xy 125.028486 54.763329) (xy 124.956903 55.007298)
        (xy 125.77 55.820395) (xy 125.784143 55.806253) (xy 125.963748 55.985858) (xy 125.949605 56) (xy 125.963748 56.014143)
        (xy 125.784143 56.193748) (xy 125.77 56.179605) (xy 124.956903 56.992702) (xy 125.028486 57.236671) (xy 125.283996 57.357571)
        (xy 125.558184 57.4263) (xy 125.840512 57.440217) (xy 126.12013 57.398787) (xy 126.386292 57.303603) (xy 126.511514 57.236671)
        (xy 126.548621 57.110202) (xy 126.869985 57.431565) (xy 126.80487 57.441213) (xy 126.538708 57.536397) (xy 126.413486 57.603329)
        (xy 126.341903 57.847298) (xy 127.155 58.660395) (xy 127.169143 58.646253) (xy 127.348748 58.825858) (xy 127.334605 58.84)
        (xy 128.147702 59.653097) (xy 128.391671 59.581514) (xy 128.512571 59.326004) (xy 128.538212 59.223711) (xy 128.545147 59.258574)
        (xy 128.65332 59.519727) (xy 128.810363 59.754759) (xy 129.010241 59.954637) (xy 129.245273 60.11168) (xy 129.506426 60.219853)
        (xy 129.783665 60.275) (xy 130.066335 60.275) (xy 130.343574 60.219853) (xy 130.604727 60.11168) (xy 130.839759 59.954637)
        (xy 131.039637 59.754759) (xy 131.19668 59.519727) (xy 131.304853 59.258574) (xy 131.31 59.232699) (xy 131.315147 59.258574)
        (xy 131.42332 59.519727) (xy 131.580363 59.754759) (xy 131.780241 59.954637) (xy 132.015273 60.11168) (xy 132.276426 60.219853)
        (xy 132.553665 60.275) (xy 132.836335 60.275) (xy 133.113574 60.219853) (xy 133.374727 60.11168) (xy 133.609759 59.954637)
        (xy 133.809637 59.754759) (xy 133.96668 59.519727) (xy 134.074853 59.258574) (xy 134.08 59.232699) (xy 134.085147 59.258574)
        (xy 134.19332 59.519727) (xy 134.350363 59.754759) (xy 134.550241 59.954637) (xy 134.785273 60.11168) (xy 135.046426 60.219853)
        (xy 135.323665 60.275) (xy 135.606335 60.275) (xy 135.883574 60.219853) (xy 136.144727 60.11168) (xy 136.379759 59.954637)
        (xy 136.579637 59.754759) (xy 136.73668 59.519727) (xy 136.844853 59.258574) (xy 136.85 59.232699) (xy 136.855147 59.258574)
        (xy 136.96332 59.519727) (xy 137.120363 59.754759) (xy 137.320241 59.954637) (xy 137.555273 60.11168) (xy 137.816426 60.219853)
        (xy 138.093665 60.275) (xy 138.376335 60.275) (xy 138.653574 60.219853) (xy 138.914727 60.11168) (xy 139.149759 59.954637)
        (xy 139.349637 59.754759) (xy 139.50668 59.519727) (xy 139.614853 59.258574) (xy 139.62 59.232699) (xy 139.625147 59.258574)
        (xy 139.73332 59.519727) (xy 139.890363 59.754759) (xy 140.090241 59.954637) (xy 140.325273 60.11168) (xy 140.586426 60.219853)
        (xy 140.863665 60.275) (xy 141.146335 60.275) (xy 141.423574 60.219853) (xy 141.684727 60.11168) (xy 141.919759 59.954637)
        (xy 142.119637 59.754759) (xy 142.27668 59.519727) (xy 142.384853 59.258574) (xy 142.44 58.981335) (xy 142.44 58.698665)
        (xy 142.384853 58.421426) (xy 142.27668 58.160273) (xy 142.119637 57.925241) (xy 141.919759 57.725363) (xy 141.684727 57.56832)
        (xy 141.423574 57.460147) (xy 141.146335 57.405) (xy 140.863665 57.405) (xy 140.586426 57.460147) (xy 140.51239 57.490814)
        (xy 140.295152 57.273575) (xy 140.299727 57.27168) (xy 140.534759 57.114637) (xy 140.734637 56.914759) (xy 140.89168 56.679727)
        (xy 140.999853 56.418574) (xy 141.005 56.392699) (xy 141.010147 56.418574) (xy 141.11832 56.679727) (xy 141.275363 56.914759)
        (xy 141.475241 57.114637) (xy 141.710273 57.27168) (xy 141.971426 57.379853) (xy 142.248665 57.435) (xy 142.531335 57.435)
        (xy 142.808574 57.379853) (xy 143.069727 57.27168) (xy 143.304759 57.114637) (xy 143.504637 56.914759) (xy 143.66168 56.679727)
        (xy 143.769853 56.418574) (xy 143.825 56.141335) (xy 143.825 55.858665) (xy 143.824271 55.854999) (xy 147.221612 55.854999)
        (xy 147.009893 56.171859) (xy 146.811261 56.651399) (xy 146.71 57.160475) (xy 146.71 57.679525) (xy 146.811261 58.188601)
        (xy 147.009893 58.668141) (xy 147.298262 59.099715) (xy 147.665285 59.466738) (xy 148.096859 59.755107) (xy 148.576399 59.953739)
        (xy 149.085475 60.055) (xy 149.604525 60.055) (xy 150.113601 59.953739) (xy 150.593141 59.755107) (xy 151.024715 59.466738)
        (xy 151.391738 59.099715) (xy 151.680107 58.668141) (xy 151.878739 58.188601) (xy 151.98 57.679525) (xy 151.98 57.160475)
        (xy 151.878739 56.651399) (xy 151.680107 56.171859) (xy 151.391738 55.740285) (xy 151.024715 55.373262) (xy 150.637227 55.114351)
        (xy 154.138507 51.613072) (xy 155.1 51.613072) (xy 155.273254 51.596008) (xy 155.43985 51.545472) (xy 155.593386 51.463405)
        (xy 155.727962 51.352962) (xy 155.838405 51.218386) (xy 155.920472 51.06485) (xy 155.971008 50.898254) (xy 155.988072 50.725)
        (xy 155.988072 49.275) (xy 155.971008 49.101746) (xy 155.920472 48.93515) (xy 155.838405 48.781614) (xy 155.727962 48.647038)
        (xy 155.593386 48.536595) (xy 155.43985 48.454528) (xy 155.273254 48.403992) (xy 155.1 48.386928) (xy 153.9 48.386928)
        (xy 153.726746 48.403992) (xy 153.56015 48.454528) (xy 153.406614 48.536595) (xy 153.272038 48.647038) (xy 153.161595 48.781614)
        (xy 153.107223 48.883337) (xy 153.055134 48.819866) (xy 152.829014 48.634294) (xy 152.571034 48.496401) (xy 152.291111 48.411487)
        (xy 152 48.382815) (xy 151.70889 48.411487) (xy 151.428967 48.496401) (xy 151.170987 48.634294) (xy 150.944866 48.819866)
        (xy 150.759294 49.045986) (xy 150.75 49.063374) (xy 150.740706 49.045986) (xy 150.555134 48.819866) (xy 150.329014 48.634294)
        (xy 150.071034 48.496401) (xy 149.791111 48.411487) (xy 149.5 48.382815) (xy 149.20889 48.411487) (xy 148.928967 48.496401)
        (xy 148.670987 48.634294) (xy 148.444866 48.819866) (xy 148.259294 49.045986) (xy 148.245538 49.071722) (xy 148.089049 48.865571)
        (xy 147.871193 48.672504) (xy 147.619858 48.525648) (xy 147.35689 48.433524) (xy 147.127 48.554845) (xy 147.127 49.873)
        (xy 147.147 49.873) (xy 147.147 50.127) (xy 147.127 50.127) (xy 147.127 50.147) (xy 146.873 50.147)
        (xy 146.873 50.127) (xy 145.673835 50.127) (xy 145.53368 50.359267) (xy 145.607558 50.64083) (xy 145.734947 50.90257)
        (xy 145.896202 51.115) (xy 143.663465 51.115) (xy 143.619999 51.110719) (xy 143.576533 51.115) (xy 143.576523 51.115)
        (xy 143.44651 51.127805) (xy 143.279687 51.178411) (xy 143.125941 51.260589) (xy 143.125939 51.26059) (xy 143.12594 51.26059)
        (xy 143.024953 51.343468) (xy 143.024951 51.34347) (xy 142.991183 51.371183) (xy 142.96347 51.404951) (xy 139.796439 54.571983)
        (xy 139.761335 54.565) (xy 139.478665 54.565) (xy 139.254999 54.609491) (xy 139.254999 52.496579) (xy 140.138507 51.613072)
        (xy 141.1 51.613072) (xy 141.273254 51.596008) (xy 141.43985 51.545472) (xy 141.593386 51.463405) (xy 141.727962 51.352962)
        (xy 141.838405 51.218386) (xy 141.920472 51.06485) (xy 141.971008 50.898254) (xy 141.988072 50.725) (xy 141.988072 49.640733)
        (xy 145.53368 49.640733) (xy 145.673835 49.873) (xy 146.873 49.873) (xy 146.873 48.554845) (xy 146.64311 48.433524)
        (xy 146.380142 48.525648) (xy 146.128807 48.672504) (xy 145.910951 48.865571) (xy 145.734947 49.09743) (xy 145.607558 49.35917)
        (xy 145.53368 49.640733) (xy 141.988072 49.640733) (xy 141.988072 49.275) (xy 141.971008 49.101746) (xy 141.920472 48.93515)
        (xy 141.838405 48.781614) (xy 141.727962 48.647038) (xy 141.593386 48.536595) (xy 141.43985 48.454528) (xy 141.273254 48.403992)
        (xy 141.1 48.386928) (xy 139.9 48.386928) (xy 139.726746 48.403992) (xy 139.56015 48.454528) (xy 139.406614 48.536595)
        (xy 139.272038 48.647038) (xy 139.161595 48.781614) (xy 139.107223 48.883337) (xy 139.055134 48.819866) (xy 138.829014 48.634294)
        (xy 138.571034 48.496401) (xy 138.291111 48.411487) (xy 138 48.382815) (xy 137.70889 48.411487) (xy 137.428967 48.496401)
        (xy 137.170987 48.634294) (xy 136.944866 48.819866) (xy 136.759294 49.045986) (xy 136.75 49.063374) (xy 136.740706 49.045986)
        (xy 136.555134 48.819866) (xy 136.329014 48.634294) (xy 136.071034 48.496401) (xy 135.791111 48.411487) (xy 135.5 48.382815)
        (xy 135.20889 48.411487) (xy 134.928967 48.496401) (xy 134.670987 48.634294) (xy 134.444866 48.819866) (xy 134.259294 49.045986)
        (xy 134.245538 49.071722) (xy 134.089049 48.865571) (xy 133.871193 48.672504) (xy 133.619858 48.525648) (xy 133.35689 48.433524)
        (xy 133.127 48.554845) (xy 133.127 49.873) (xy 133.147 49.873) (xy 133.147 50.127) (xy 133.127 50.127)
        (xy 133.127 51.445155) (xy 133.35689 51.566476) (xy 133.619858 51.474352) (xy 133.871193 51.327496) (xy 134.089049 51.134429)
        (xy 134.245538 50.928278) (xy 134.259294 50.954013) (xy 134.444866 51.180134) (xy 134.670986 51.365706) (xy 134.928966 51.503599)
        (xy 135.171309 51.577113) (xy 135.00495 51.743472) (xy 134.971183 51.771184) (xy 134.94347 51.804952) (xy 134.943467 51.804955)
        (xy 134.860589 51.905942) (xy 134.778411 52.059688) (xy 134.727804 52.226511) (xy 134.710718 52.400001) (xy 134.715 52.44348)
        (xy 134.714999 54.709793) (xy 134.498574 54.620147) (xy 134.221335 54.565) (xy 133.938665 54.565) (xy 133.661426 54.620147)
        (xy 133.400273 54.72832) (xy 133.165241 54.885363) (xy 132.965363 55.085241) (xy 132.80832 55.320273) (xy 132.700147 55.581426)
        (xy 132.695 55.607301) (xy 132.689853 55.581426) (xy 132.58168 55.320273) (xy 132.424637 55.085241) (xy 132.224759 54.885363)
        (xy 132.195 54.865479) (xy 132.195 54.853465) (xy 132.199281 54.809999) (xy 132.195 54.766533) (xy 132.195 54.766523)
        (xy 132.182195 54.63651) (xy 132.131589 54.469687) (xy 132.049411 54.315941) (xy 131.938817 54.181183) (xy 131.905049 54.15347)
        (xy 128.110846 50.359267) (xy 131.53368 50.359267) (xy 131.607558 50.64083) (xy 131.734947 50.90257) (xy 131.910951 51.134429)
        (xy 132.128807 51.327496) (xy 132.380142 51.474352) (xy 132.64311 51.566476) (xy 132.873 51.445155) (xy 132.873 50.127)
        (xy 131.673835 50.127) (xy 131.53368 50.359267) (xy 128.110846 50.359267) (xy 127.988072 50.236494) (xy 127.988072 49.640733)
        (xy 131.53368 49.640733) (xy 131.673835 49.873) (xy 132.873 49.873) (xy 132.873 48.554845) (xy 132.64311 48.433524)
        (xy 132.380142 48.525648) (xy 132.128807 48.672504) (xy 131.910951 48.865571) (xy 131.734947 49.09743) (xy 131.607558 49.35917)
        (xy 131.53368 49.640733) (xy 127.988072 49.640733) (xy 127.988072 49.275) (xy 127.971008 49.101746) (xy 127.920472 48.93515)
        (xy 127.838405 48.781614) (xy 127.727962 48.647038) (xy 127.593386 48.536595) (xy 127.43985 48.454528) (xy 127.273254 48.403992)
        (xy 127.1 48.386928) (xy 125.9 48.386928) (xy 125.726746 48.403992) (xy 125.56015 48.454528) (xy 125.406614 48.536595)
        (xy 125.272038 48.647038) (xy 125.161595 48.781614) (xy 125.107223 48.883337) (xy 125.055134 48.819866) (xy 124.829014 48.634294)
        (xy 124.571034 48.496401) (xy 124.291111 48.411487) (xy 124 48.382815) (xy 123.70889 48.411487) (xy 123.428967 48.496401)
        (xy 123.170987 48.634294) (xy 122.944866 48.819866) (xy 122.759294 49.045986) (xy 122.745538 49.071722) (xy 122.589049 48.865571)
        (xy 122.371193 48.672504) (xy 122.119858 48.525648) (xy 121.85689 48.433524) (xy 121.627 48.554845) (xy 121.373 48.554845)
        (xy 121.14311 48.433524) (xy 120.880142 48.525648) (xy 120.628807 48.672504) (xy 120.410951 48.865571) (xy 120.234947 49.09743)
        (xy 120.107558 49.35917) (xy 120.03368 49.640733) (xy 117.488072 49.640733) (xy 117.488072 49.15) (xy 117.475812 49.025518)
        (xy 117.439502 48.90582) (xy 117.380537 48.795506) (xy 117.301185 48.698815) (xy 117.204494 48.619463) (xy 117.09418 48.560498)
        (xy 117.013534 48.536034) (xy 117.097588 48.460269) (xy 117.271641 48.22692) (xy 117.396825 47.964099) (xy 117.441476 47.81689)
        (xy 117.320155 47.587) (xy 116.127 47.587) (xy 116.127 47.607) (xy 115.873 47.607) (xy 115.873 47.587)
        (xy 114.679845 47.587) (xy 114.558524 47.81689) (xy 114.603175 47.964099) (xy 114.728359 48.22692) (xy 114.902412 48.460269)
        (xy 114.986466 48.536034) (xy 114.90582 48.560498) (xy 114.795506 48.619463) (xy 114.698815 48.698815) (xy 114.619463 48.795506)
        (xy 114.560498 48.90582) (xy 114.524188 49.025518) (xy 114.511928 49.15) (xy 113.66 49.15) (xy 113.66 47.10311)
        (xy 114.558524 47.10311) (xy 114.679845 47.333) (xy 115.873 47.333) (xy 115.873 46.139186) (xy 116.127 46.139186)
        (xy 116.127 47.333) (xy 117.320155 47.333) (xy 117.441476 47.10311) (xy 117.396825 46.955901) (xy 117.271641 46.69308)
        (xy 117.097588 46.459731) (xy 116.881355 46.264822) (xy 116.631252 46.115843) (xy 116.356891 46.018519) (xy 116.127 46.139186)
        (xy 115.873 46.139186) (xy 115.643109 46.018519) (xy 115.368748 46.115843) (xy 115.118645 46.264822) (xy 114.902412 46.459731)
        (xy 114.728359 46.69308) (xy 114.603175 46.955901) (xy 114.558524 47.10311) (xy 113.66 47.10311) (xy 113.66 42.032279)
        (xy 113.66958 41.934576) (xy 113.68858 41.871644) (xy 113.719445 41.813595) (xy 113.760989 41.762657) (xy 113.811644 41.720752)
        (xy 113.869471 41.689485) (xy 113.932272 41.670044) (xy 114.027835 41.66) (xy 161.967721 41.66)
      )
    )
  )
  (zone (net 2) (net_name +5V) (layer B.Cu) (tstamp 0) (hatch edge 0.508)
    (connect_pads (clearance 0.508))
    (min_thickness 0.254)
    (fill yes (arc_segments 32) (thermal_gap 0.508) (thermal_bridge_width 0.508))
    (polygon
      (pts
        (xy 163 69) (xy 113 69) (xy 113 41) (xy 163 41)
      )
    )
    (filled_polygon
      (pts
        (xy 162.065424 41.66958) (xy 162.128356 41.68858) (xy 162.186405 41.719445) (xy 162.237343 41.760989) (xy 162.279248 41.811644)
        (xy 162.310515 41.869471) (xy 162.329956 41.932272) (xy 162.340001 42.027845) (xy 162.34 67.967721) (xy 162.33042 68.065424)
        (xy 162.31142 68.128357) (xy 162.280554 68.186406) (xy 162.239011 68.237343) (xy 162.188356 68.279248) (xy 162.130529 68.310515)
        (xy 162.067728 68.329956) (xy 161.972165 68.34) (xy 113.66 68.34) (xy 113.66 58.547689) (xy 113.709893 58.668141)
        (xy 113.998262 59.099715) (xy 114.365285 59.466738) (xy 114.796859 59.755107) (xy 115.276399 59.953739) (xy 115.785475 60.055)
        (xy 116.304525 60.055) (xy 116.813601 59.953739) (xy 117.293141 59.755107) (xy 117.724715 59.466738) (xy 118.091738 59.099715)
        (xy 118.359711 58.698665) (xy 122.95 58.698665) (xy 122.95 58.981335) (xy 123.005147 59.258574) (xy 123.11332 59.519727)
        (xy 123.270363 59.754759) (xy 123.470241 59.954637) (xy 123.705273 60.11168) (xy 123.966426 60.219853) (xy 124.243665 60.275)
        (xy 124.526335 60.275) (xy 124.803574 60.219853) (xy 125.064727 60.11168) (xy 125.299759 59.954637) (xy 125.499637 59.754759)
        (xy 125.65668 59.519727) (xy 125.764853 59.258574) (xy 125.77 59.232699) (xy 125.775147 59.258574) (xy 125.88332 59.519727)
        (xy 126.040363 59.754759) (xy 126.240241 59.954637) (xy 126.475273 60.11168) (xy 126.736426 60.219853) (xy 127.013665 60.275)
        (xy 127.296335 60.275) (xy 127.573574 60.219853) (xy 127.834727 60.11168) (xy 128.069759 59.954637) (xy 128.269637 59.754759)
        (xy 128.42668 59.519727) (xy 128.534853 59.258574) (xy 128.54 59.232699) (xy 128.545147 59.258574) (xy 128.65332 59.519727)
        (xy 128.810363 59.754759) (xy 129.010241 59.954637) (xy 129.245273 60.11168) (xy 129.506426 60.219853) (xy 129.783665 60.275)
        (xy 130.066335 60.275) (xy 130.343574 60.219853) (xy 130.604727 60.11168) (xy 130.839759 59.954637) (xy 131.039637 59.754759)
        (xy 131.19668 59.519727) (xy 131.304853 59.258574) (xy 131.31 59.232699) (xy 131.315147 59.258574) (xy 131.42332 59.519727)
        (xy 131.580363 59.754759) (xy 131.780241 59.954637) (xy 132.015273 60.11168) (xy 132.276426 60.219853) (xy 132.553665 60.275)
        (xy 132.836335 60.275) (xy 133.113574 60.219853) (xy 133.374727 60.11168) (xy 133.609759 59.954637) (xy 133.809637 59.754759)
        (xy 133.96668 59.519727) (xy 134.074853 59.258574) (xy 134.08 59.232699) (xy 134.085147 59.258574) (xy 134.19332 59.519727)
        (xy 134.350363 59.754759) (xy 134.550241 59.954637) (xy 134.785273 60.11168) (xy 135.046426 60.219853) (xy 135.323665 60.275)
        (xy 135.606335 60.275) (xy 135.883574 60.219853) (xy 136.144727 60.11168) (xy 136.379759 59.954637) (xy 136.579637 59.754759)
        (xy 136.73668 59.519727) (xy 136.844853 59.258574) (xy 136.85 59.232699) (xy 136.855147 59.258574) (xy 136.96332 59.519727)
        (xy 137.120363 59.754759) (xy 137.320241 59.954637) (xy 137.555273 60.11168) (xy 137.816426 60.219853) (xy 138.093665 60.275)
        (xy 138.376335 60.275) (xy 138.653574 60.219853) (xy 138.914727 60.11168) (xy 139.149759 59.954637) (xy 139.349637 59.754759)
        (xy 139.50668 59.519727) (xy 139.614853 59.258574) (xy 139.62 59.232699) (xy 139.625147 59.258574) (xy 139.73332 59.519727)
        (xy 139.890363 59.754759) (xy 140.090241 59.954637) (xy 140.325273 60.11168) (xy 140.586426 60.219853) (xy 140.863665 60.275)
        (xy 141.146335 60.275) (xy 141.423574 60.219853) (xy 141.684727 60.11168) (xy 141.919759 59.954637) (xy 142.119637 59.754759)
        (xy 142.27668 59.519727) (xy 142.384853 59.258574) (xy 142.44 58.981335) (xy 142.44 58.698665) (xy 142.384853 58.421426)
        (xy 142.27668 58.160273) (xy 142.119637 57.925241) (xy 141.919759 57.725363) (xy 141.684727 57.56832) (xy 141.423574 57.460147)
        (xy 141.146335 57.405) (xy 140.863665 57.405) (xy 140.586426 57.460147) (xy 140.325273 57.56832) (xy 140.090241 57.725363)
        (xy 139.890363 57.925241) (xy 139.73332 58.160273) (xy 139.625147 58.421426) (xy 139.62 58.447301) (xy 139.614853 58.421426)
        (xy 139.50668 58.160273) (xy 139.349637 57.925241) (xy 139.149759 57.725363) (xy 138.914727 57.56832) (xy 138.653574 57.460147)
        (xy 138.376335 57.405) (xy 138.093665 57.405) (xy 137.816426 57.460147) (xy 137.555273 57.56832) (xy 137.320241 57.725363)
        (xy 137.120363 57.925241) (xy 136.96332 58.160273) (xy 136.855147 58.421426) (xy 136.85 58.447301) (xy 136.844853 58.421426)
        (xy 136.73668 58.160273) (xy 136.579637 57.925241) (xy 136.379759 57.725363) (xy 136.144727 57.56832) (xy 135.883574 57.460147)
        (xy 135.606335 57.405) (xy 135.323665 57.405) (xy 135.046426 57.460147) (xy 134.785273 57.56832) (xy 134.550241 57.725363)
        (xy 134.350363 57.925241) (xy 134.19332 58.160273) (xy 134.085147 58.421426) (xy 134.08 58.447301) (xy 134.074853 58.421426)
        (xy 133.96668 58.160273) (xy 133.809637 57.925241) (xy 133.609759 57.725363) (xy 133.374727 57.56832) (xy 133.113574 57.460147)
        (xy 132.836335 57.405) (xy 132.553665 57.405) (xy 132.276426 57.460147) (xy 132.015273 57.56832) (xy 131.780241 57.725363)
        (xy 131.580363 57.925241) (xy 131.42332 58.160273) (xy 131.315147 58.421426) (xy 131.31 58.447301) (xy 131.304853 58.421426)
        (xy 131.19668 58.160273) (xy 131.039637 57.925241) (xy 130.839759 57.725363) (xy 130.604727 57.56832) (xy 130.343574 57.460147)
        (xy 130.066335 57.405) (xy 129.783665 57.405) (xy 129.506426 57.460147) (xy 129.245273 57.56832) (xy 129.010241 57.725363)
        (xy 128.810363 57.925241) (xy 128.65332 58.160273) (xy 128.545147 58.421426) (xy 128.54 58.447301) (xy 128.534853 58.421426)
        (xy 128.42668 58.160273) (xy 128.269637 57.925241) (xy 128.069759 57.725363) (xy 127.834727 57.56832) (xy 127.573574 57.460147)
        (xy 127.296335 57.405) (xy 127.013665 57.405) (xy 126.736426 57.460147) (xy 126.475273 57.56832) (xy 126.240241 57.725363)
        (xy 126.040363 57.925241) (xy 125.88332 58.160273) (xy 125.775147 58.421426) (xy 125.77 58.447301) (xy 125.764853 58.421426)
        (xy 125.65668 58.160273) (xy 125.499637 57.925241) (xy 125.299759 57.725363) (xy 125.064727 57.56832) (xy 124.803574 57.460147)
        (xy 124.526335 57.405) (xy 124.243665 57.405) (xy 123.966426 57.460147) (xy 123.705273 57.56832) (xy 123.470241 57.725363)
        (xy 123.270363 57.925241) (xy 123.11332 58.160273) (xy 123.005147 58.421426) (xy 122.95 58.698665) (xy 118.359711 58.698665)
        (xy 118.380107 58.668141) (xy 118.578739 58.188601) (xy 118.68 57.679525) (xy 118.68 57.160475) (xy 118.578739 56.651399)
        (xy 118.380107 56.171859) (xy 118.091738 55.740285) (xy 117.724715 55.373262) (xy 117.465411 55.2) (xy 121.561928 55.2)
        (xy 121.561928 56.8) (xy 121.574188 56.924482) (xy 121.610498 57.04418) (xy 121.669463 57.154494) (xy 121.748815 57.251185)
        (xy 121.845506 57.330537) (xy 121.95582 57.389502) (xy 122.075518 57.425812) (xy 122.2 57.438072) (xy 123.8 57.438072)
        (xy 123.924482 57.425812) (xy 124.04418 57.389502) (xy 124.154494 57.330537) (xy 124.251185 57.251185) (xy 124.330537 57.154494)
        (xy 124.389502 57.04418) (xy 124.425812 56.924482) (xy 124.438072 56.8) (xy 124.438072 56.534275) (xy 124.49832 56.679727)
        (xy 124.655363 56.914759) (xy 124.855241 57.114637) (xy 125.090273 57.27168) (xy 125.351426 57.379853) (xy 125.628665 57.435)
        (xy 125.911335 57.435) (xy 126.188574 57.379853) (xy 126.449727 57.27168) (xy 126.684759 57.114637) (xy 126.806694 56.992702)
        (xy 127.726903 56.992702) (xy 127.798486 57.236671) (xy 128.053996 57.357571) (xy 128.328184 57.4263) (xy 128.610512 57.440217)
        (xy 128.89013 57.398787) (xy 129.156292 57.303603) (xy 129.281514 57.236671) (xy 129.353097 56.992702) (xy 128.54 56.179605)
        (xy 127.726903 56.992702) (xy 126.806694 56.992702) (xy 126.884637 56.914759) (xy 127.04168 56.679727) (xy 127.149853 56.418574)
        (xy 127.155513 56.390118) (xy 127.236397 56.616292) (xy 127.303329 56.741514) (xy 127.547298 56.813097) (xy 128.360395 56)
        (xy 128.719605 56) (xy 129.532702 56.813097) (xy 129.776671 56.741514) (xy 129.897571 56.486004) (xy 129.923212 56.383711)
        (xy 129.930147 56.418574) (xy 130.03832 56.679727) (xy 130.195363 56.914759) (xy 130.395241 57.114637) (xy 130.630273 57.27168)
        (xy 130.891426 57.379853) (xy 131.168665 57.435) (xy 131.451335 57.435) (xy 131.728574 57.379853) (xy 131.989727 57.27168)
        (xy 132.224759 57.114637) (xy 132.424637 56.914759) (xy 132.58168 56.679727) (xy 132.689853 56.418574) (xy 132.695 56.392699)
        (xy 132.700147 56.418574) (xy 132.80832 56.679727) (xy 132.965363 56.914759) (xy 133.165241 57.114637) (xy 133.400273 57.27168)
        (xy 133.661426 57.379853) (xy 133.938665 57.435) (xy 134.221335 57.435) (xy 134.498574 57.379853) (xy 134.759727 57.27168)
        (xy 134.994759 57.114637) (xy 135.194637 56.914759) (xy 135.35168 56.679727) (xy 135.459853 56.418574) (xy 135.465 56.392699)
        (xy 135.470147 56.418574) (xy 135.57832 56.679727) (xy 135.735363 56.914759) (xy 135.935241 57.114637) (xy 136.170273 57.27168)
        (xy 136.431426 57.379853) (xy 136.708665 57.435) (xy 136.991335 57.435) (xy 137.268574 57.379853) (xy 137.529727 57.27168)
        (xy 137.764759 57.114637) (xy 137.964637 56.914759) (xy 138.12168 56.679727) (xy 138.229853 56.418574) (xy 138.235 56.392699)
        (xy 138.240147 56.418574) (xy 138.34832 56.679727) (xy 138.505363 56.914759) (xy 138.705241 57.114637) (xy 138.940273 57.27168)
        (xy 139.201426 57.379853) (xy 139.478665 57.435) (xy 139.761335 57.435) (xy 140.038574 57.379853) (xy 140.299727 57.27168)
        (xy 140.534759 57.114637) (xy 140.734637 56.914759) (xy 140.89168 56.679727) (xy 140.999853 56.418574) (xy 141.005 56.392699)
        (xy 141.010147 56.418574) (xy 141.11832 56.679727) (xy 141.275363 56.914759) (xy 141.475241 57.114637) (xy 141.710273 57.27168)
        (xy 141.971426 57.379853) (xy 142.248665 57.435) (xy 142.531335 57.435) (xy 142.808574 57.379853) (xy 143.069727 57.27168)
        (xy 143.236157 57.160475) (xy 146.71 57.160475) (xy 146.71 57.679525) (xy 146.811261 58.188601) (xy 147.009893 58.668141)
        (xy 147.298262 59.099715) (xy 147.665285 59.466738) (xy 148.096859 59.755107) (xy 148.576399 59.953739) (xy 149.085475 60.055)
        (xy 149.604525 60.055) (xy 150.113601 59.953739) (xy 150.593141 59.755107) (xy 151.024715 59.466738) (xy 151.391738 59.099715)
        (xy 151.680107 58.668141) (xy 151.878739 58.188601) (xy 151.98 57.679525) (xy 151.98 57.160475) (xy 151.878739 56.651399)
        (xy 151.680107 56.171859) (xy 151.391738 55.740285) (xy 151.024715 55.373262) (xy 150.593141 55.084893) (xy 150.113601 54.886261)
        (xy 149.604525 54.785) (xy 149.085475 54.785) (xy 148.576399 54.886261) (xy 148.096859 55.084893) (xy 147.665285 55.373262)
        (xy 147.298262 55.740285) (xy 147.009893 56.171859) (xy 146.811261 56.651399) (xy 146.71 57.160475) (xy 143.236157 57.160475)
        (xy 143.304759 57.114637) (xy 143.504637 56.914759) (xy 143.66168 56.679727) (xy 143.769853 56.418574) (xy 143.825 56.141335)
        (xy 143.825 55.858665) (xy 143.769853 55.581426) (xy 143.66168 55.320273) (xy 143.504637 55.085241) (xy 143.304759 54.885363)
        (xy 143.069727 54.72832) (xy 142.808574 54.620147) (xy 142.531335 54.565) (xy 142.248665 54.565) (xy 141.971426 54.620147)
        (xy 141.710273 54.72832) (xy 141.475241 54.885363) (xy 141.275363 55.085241) (xy 141.11832 55.320273) (xy 141.010147 55.581426)
        (xy 141.005 55.607301) (xy 140.999853 55.581426) (xy 140.89168 55.320273) (xy 140.734637 55.085241) (xy 140.534759 54.885363)
        (xy 140.299727 54.72832) (xy 140.038574 54.620147) (xy 139.761335 54.565) (xy 139.478665 54.565) (xy 139.201426 54.620147)
        (xy 138.940273 54.72832) (xy 138.705241 54.885363) (xy 138.505363 55.085241) (xy 138.34832 55.320273) (xy 138.240147 55.581426)
        (xy 138.235 55.607301) (xy 138.229853 55.581426) (xy 138.12168 55.320273) (xy 137.964637 55.085241) (xy 137.764759 54.885363)
        (xy 137.529727 54.72832) (xy 137.268574 54.620147) (xy 136.991335 54.565) (xy 136.708665 54.565) (xy 136.431426 54.620147)
        (xy 136.170273 54.72832) (xy 135.935241 54.885363) (xy 135.735363 55.085241) (xy 135.57832 55.320273) (xy 135.470147 55.581426)
        (xy 135.465 55.607301) (xy 135.459853 55.581426) (xy 135.35168 55.320273) (xy 135.194637 55.085241) (xy 134.994759 54.885363)
        (xy 134.759727 54.72832) (xy 134.498574 54.620147) (xy 134.221335 54.565) (xy 133.938665 54.565) (xy 133.661426 54.620147)
        (xy 133.400273 54.72832) (xy 133.165241 54.885363) (xy 132.965363 55.085241) (xy 132.80832 55.320273) (xy 132.700147 55.581426)
        (xy 132.695 55.607301) (xy 132.689853 55.581426) (xy 132.58168 55.320273) (xy 132.424637 55.085241) (xy 132.224759 54.885363)
        (xy 131.989727 54.72832) (xy 131.728574 54.620147) (xy 131.451335 54.565) (xy 131.168665 54.565) (xy 130.891426 54.620147)
        (xy 130.630273 54.72832) (xy 130.395241 54.885363) (xy 130.195363 55.085241) (xy 130.03832 55.320273) (xy 129.930147 55.581426)
        (xy 129.924487 55.609882) (xy 129.843603 55.383708) (xy 129.776671 55.258486) (xy 129.532702 55.186903) (xy 128.719605 56)
        (xy 128.360395 56) (xy 127.547298 55.186903) (xy 127.303329 55.258486) (xy 127.182429 55.513996) (xy 127.156788 55.616289)
        (xy 127.149853 55.581426) (xy 127.04168 55.320273) (xy 126.884637 55.085241) (xy 126.806694 55.007298) (xy 127.726903 55.007298)
        (xy 128.54 55.820395) (xy 129.353097 55.007298) (xy 129.281514 54.763329) (xy 129.026004 54.642429) (xy 128.751816 54.5737)
        (xy 128.469488 54.559783) (xy 128.18987 54.601213) (xy 127.923708 54.696397) (xy 127.798486 54.763329) (xy 127.726903 55.007298)
        (xy 126.806694 55.007298) (xy 126.684759 54.885363) (xy 126.449727 54.72832) (xy 126.188574 54.620147) (xy 125.911335 54.565)
        (xy 125.628665 54.565) (xy 125.351426 54.620147) (xy 125.090273 54.72832) (xy 124.855241 54.885363) (xy 124.655363 55.085241)
        (xy 124.49832 55.320273) (xy 124.438072 55.465725) (xy 124.438072 55.2) (xy 124.425812 55.075518) (xy 124.389502 54.95582)
        (xy 124.330537 54.845506) (xy 124.251185 54.748815) (xy 124.154494 54.669463) (xy 124.04418 54.610498) (xy 123.924482 54.574188)
        (xy 123.8 54.561928) (xy 122.2 54.561928) (xy 122.075518 54.574188) (xy 121.95582 54.610498) (xy 121.845506 54.669463)
        (xy 121.748815 54.748815) (xy 121.669463 54.845506) (xy 121.610498 54.95582) (xy 121.574188 55.075518) (xy 121.561928 55.2)
        (xy 117.465411 55.2) (xy 117.293141 55.084893) (xy 116.813601 54.886261) (xy 116.304525 54.785) (xy 115.785475 54.785)
        (xy 115.276399 54.886261) (xy 114.796859 55.084893) (xy 114.365285 55.373262) (xy 113.998262 55.740285) (xy 113.709893 56.171859)
        (xy 113.66 56.292311) (xy 113.66 50.85) (xy 114.511928 50.85) (xy 114.524188 50.974482) (xy 114.560498 51.09418)
        (xy 114.619463 51.204494) (xy 114.698815 51.301185) (xy 114.795506 51.380537) (xy 114.90582 51.439502) (xy 115.025518 51.475812)
        (xy 115.15 51.488072) (xy 115.71425 51.485) (xy 115.873 51.32625) (xy 115.873 50.127) (xy 116.127 50.127)
        (xy 116.127 51.32625) (xy 116.28575 51.485) (xy 116.85 51.488072) (xy 116.974482 51.475812) (xy 117.09418 51.439502)
        (xy 117.204494 51.380537) (xy 117.301185 51.301185) (xy 117.380537 51.204494) (xy 117.439502 51.09418) (xy 117.475812 50.974482)
        (xy 117.488072 50.85) (xy 117.485 50.28575) (xy 117.32625 50.127) (xy 116.127 50.127) (xy 115.873 50.127)
        (xy 114.67375 50.127) (xy 114.515 50.28575) (xy 114.511928 50.85) (xy 113.66 50.85) (xy 113.66 49.15)
        (xy 114.511928 49.15) (xy 114.515 49.71425) (xy 114.67375 49.873) (xy 115.873 49.873) (xy 115.873 49.853)
        (xy 116.127 49.853) (xy 116.127 49.873) (xy 117.32625 49.873) (xy 117.3972 49.80205) (xy 120.015 49.80205)
        (xy 120.015 50.197949) (xy 120.036487 50.41611) (xy 120.121401 50.696033) (xy 120.259294 50.954013) (xy 120.444866 51.180134)
        (xy 120.670986 51.365706) (xy 120.928966 51.503599) (xy 121.208889 51.588513) (xy 121.5 51.617185) (xy 121.79111 51.588513)
        (xy 122.071033 51.503599) (xy 122.329013 51.365706) (xy 122.555134 51.180134) (xy 122.740706 50.954014) (xy 122.75 50.936626)
        (xy 122.759294 50.954013) (xy 122.944866 51.180134) (xy 123.170986 51.365706) (xy 123.428966 51.503599) (xy 123.708889 51.588513)
        (xy 124 51.617185) (xy 124.29111 51.588513) (xy 124.571033 51.503599) (xy 124.829013 51.365706) (xy 125.055134 51.180134)
        (xy 125.107223 51.116663) (xy 125.161595 51.218386) (xy 125.272038 51.352962) (xy 125.406614 51.463405) (xy 125.56015 51.545472)
        (xy 125.726746 51.596008) (xy 125.9 51.613072) (xy 127.1 51.613072) (xy 127.273254 51.596008) (xy 127.43985 51.545472)
        (xy 127.593386 51.463405) (xy 127.727962 51.352962) (xy 127.838405 51.218386) (xy 127.920472 51.06485) (xy 127.971008 50.898254)
        (xy 127.988072 50.725) (xy 127.988072 49.80205) (xy 131.515 49.80205) (xy 131.515 50.197949) (xy 131.536487 50.41611)
        (xy 131.621401 50.696033) (xy 131.759294 50.954013) (xy 131.944866 51.180134) (xy 132.170986 51.365706) (xy 132.428966 51.503599)
        (xy 132.708889 51.588513) (xy 133 51.617185) (xy 133.29111 51.588513) (xy 133.571033 51.503599) (xy 133.829013 51.365706)
        (xy 134.055134 51.180134) (xy 134.240706 50.954014) (xy 134.254462 50.928278) (xy 134.410951 51.134429) (xy 134.628807 51.327496)
        (xy 134.880142 51.474352) (xy 135.14311 51.566476) (xy 135.373 51.445155) (xy 135.373 50.127) (xy 135.353 50.127)
        (xy 135.353 49.873) (xy 135.373 49.873) (xy 135.373 48.554845) (xy 135.627 48.554845) (xy 135.627 49.873)
        (xy 135.647 49.873) (xy 135.647 50.127) (xy 135.627 50.127) (xy 135.627 51.445155) (xy 135.85689 51.566476)
        (xy 136.119858 51.474352) (xy 136.371193 51.327496) (xy 136.589049 51.134429) (xy 136.745538 50.928278) (xy 136.759294 50.954013)
        (xy 136.944866 51.180134) (xy 137.170986 51.365706) (xy 137.428966 51.503599) (xy 137.708889 51.588513) (xy 138 51.617185)
        (xy 138.29111 51.588513) (xy 138.571033 51.503599) (xy 138.829013 51.365706) (xy 139.055134 51.180134) (xy 139.107223 51.116663)
        (xy 139.161595 51.218386) (xy 139.272038 51.352962) (xy 139.406614 51.463405) (xy 139.56015 51.545472) (xy 139.726746 51.596008)
        (xy 139.9 51.613072) (xy 141.1 51.613072) (xy 141.273254 51.596008) (xy 141.43985 51.545472) (xy 141.593386 51.463405)
        (xy 141.727962 51.352962) (xy 141.838405 51.218386) (xy 141.920472 51.06485) (xy 141.971008 50.898254) (xy 141.988072 50.725)
        (xy 141.988072 49.80205) (xy 145.515 49.80205) (xy 145.515 50.197949) (xy 145.536487 50.41611) (xy 145.621401 50.696033)
        (xy 145.759294 50.954013) (xy 145.944866 51.180134) (xy 146.170986 51.365706) (xy 146.428966 51.503599) (xy 146.708889 51.588513)
        (xy 147 51.617185) (xy 147.29111 51.588513) (xy 147.571033 51.503599) (xy 147.829013 51.365706) (xy 148.055134 51.180134)
        (xy 148.240706 50.954014) (xy 148.254462 50.928278) (xy 148.410951 51.134429) (xy 148.628807 51.327496) (xy 148.880142 51.474352)
        (xy 149.14311 51.566476) (xy 149.373 51.445155) (xy 149.373 50.127) (xy 149.353 50.127) (xy 149.353 49.873)
        (xy 149.373 49.873) (xy 149.373 48.554845) (xy 149.627 48.554845) (xy 149.627 49.873) (xy 149.647 49.873)
        (xy 149.647 50.127) (xy 149.627 50.127) (xy 149.627 51.445155) (xy 149.85689 51.566476) (xy 150.119858 51.474352)
        (xy 150.371193 51.327496) (xy 150.589049 51.134429) (xy 150.745538 50.928278) (xy 150.759294 50.954013) (xy 150.944866 51.180134)
        (xy 151.170986 51.365706) (xy 151.428966 51.503599) (xy 151.708889 51.588513) (xy 152 51.617185) (xy 152.29111 51.588513)
        (xy 152.571033 51.503599) (xy 152.829013 51.365706) (xy 153.055134 51.180134) (xy 153.107223 51.116663) (xy 153.161595 51.218386)
        (xy 153.272038 51.352962) (xy 153.406614 51.463405) (xy 153.56015 51.545472) (xy 153.726746 51.596008) (xy 153.9 51.613072)
        (xy 155.1 51.613072) (xy 155.273254 51.596008) (xy 155.43985 51.545472) (xy 155.593386 51.463405) (xy 155.727962 51.352962)
        (xy 155.838405 51.218386) (xy 155.920472 51.06485) (xy 155.971008 50.898254) (xy 155.988072 50.725) (xy 155.988072 49.275)
        (xy 155.971008 49.101746) (xy 155.920472 48.93515) (xy 155.838405 48.781614) (xy 155.727962 48.647038) (xy 155.593386 48.536595)
        (xy 155.43985 48.454528) (xy 155.273254 48.403992) (xy 155.1 48.386928) (xy 153.9 48.386928) (xy 153.726746 48.403992)
        (xy 153.56015 48.454528) (xy 153.406614 48.536595) (xy 153.272038 48.647038) (xy 153.161595 48.781614) (xy 153.107223 48.883337)
        (xy 153.055134 48.819866) (xy 152.829014 48.634294) (xy 152.571034 48.496401) (xy 152.291111 48.411487) (xy 152 48.382815)
        (xy 151.70889 48.411487) (xy 151.428967 48.496401) (xy 151.170987 48.634294) (xy 150.944866 48.819866) (xy 150.759294 49.045986)
        (xy 150.745538 49.071722) (xy 150.589049 48.865571) (xy 150.371193 48.672504) (xy 150.119858 48.525648) (xy 149.85689 48.433524)
        (xy 149.627 48.554845) (xy 149.373 48.554845) (xy 149.14311 48.433524) (xy 148.880142 48.525648) (xy 148.628807 48.672504)
        (xy 148.410951 48.865571) (xy 148.254462 49.071722) (xy 148.240706 49.045986) (xy 148.055134 48.819866) (xy 147.829014 48.634294)
        (xy 147.571034 48.496401) (xy 147.291111 48.411487) (xy 147 48.382815) (xy 146.70889 48.411487) (xy 146.428967 48.496401)
        (xy 146.170987 48.634294) (xy 145.944866 48.819866) (xy 145.759294 49.045986) (xy 145.621401 49.303966) (xy 145.536487 49.583889)
        (xy 145.515 49.80205) (xy 141.988072 49.80205) (xy 141.988072 49.275) (xy 141.971008 49.101746) (xy 141.920472 48.93515)
        (xy 141.838405 48.781614) (xy 141.727962 48.647038) (xy 141.593386 48.536595) (xy 141.43985 48.454528) (xy 141.273254 48.403992)
        (xy 141.1 48.386928) (xy 139.9 48.386928) (xy 139.726746 48.403992) (xy 139.56015 48.454528) (xy 139.406614 48.536595)
        (xy 139.272038 48.647038) (xy 139.161595 48.781614) (xy 139.107223 48.883337) (xy 139.055134 48.819866) (xy 138.829014 48.634294)
        (xy 138.571034 48.496401) (xy 138.291111 48.411487) (xy 138 48.382815) (xy 137.70889 48.411487) (xy 137.428967 48.496401)
        (xy 137.170987 48.634294) (xy 136.944866 48.819866) (xy 136.759294 49.045986) (xy 136.745538 49.071722) (xy 136.589049 48.865571)
        (xy 136.371193 48.672504) (xy 136.119858 48.525648) (xy 135.85689 48.433524) (xy 135.627 48.554845) (xy 135.373 48.554845)
        (xy 135.14311 48.433524) (xy 134.880142 48.525648) (xy 134.628807 48.672504) (xy 134.410951 48.865571) (xy 134.254462 49.071722)
        (xy 134.240706 49.045986) (xy 134.055134 48.819866) (xy 133.829014 48.634294) (xy 133.571034 48.496401) (xy 133.291111 48.411487)
        (xy 133 48.382815) (xy 132.70889 48.411487) (xy 132.428967 48.496401) (xy 132.170987 48.634294) (xy 131.944866 48.819866)
        (xy 131.759294 49.045986) (xy 131.621401 49.303966) (xy 131.536487 49.583889) (xy 131.515 49.80205) (xy 127.988072 49.80205)
        (xy 127.988072 49.275) (xy 127.971008 49.101746) (xy 127.920472 48.93515) (xy 127.838405 48.781614) (xy 127.727962 48.647038)
        (xy 127.593386 48.536595) (xy 127.43985 48.454528) (xy 127.273254 48.403992) (xy 127.1 48.386928) (xy 125.9 48.386928)
        (xy 125.726746 48.403992) (xy 125.56015 48.454528) (xy 125.406614 48.536595) (xy 125.272038 48.647038) (xy 125.161595 48.781614)
        (xy 125.107223 48.883337) (xy 125.055134 48.819866) (xy 124.829014 48.634294) (xy 124.571034 48.496401) (xy 124.291111 48.411487)
        (xy 124 48.382815) (xy 123.70889 48.411487) (xy 123.428967 48.496401) (xy 123.170987 48.634294) (xy 122.944866 48.819866)
        (xy 122.759294 49.045986) (xy 122.75 49.063374) (xy 122.740706 49.045986) (xy 122.555134 48.819866) (xy 122.329014 48.634294)
        (xy 122.071034 48.496401) (xy 121.791111 48.411487) (xy 121.5 48.382815) (xy 121.20889 48.411487) (xy 120.928967 48.496401)
        (xy 120.670987 48.634294) (xy 120.444866 48.819866) (xy 120.259294 49.045986) (xy 120.121401 49.303966) (xy 120.036487 49.583889)
        (xy 120.015 49.80205) (xy 117.3972 49.80205) (xy 117.485 49.71425) (xy 117.488072 49.15) (xy 117.475812 49.025518)
        (xy 117.439502 48.90582) (xy 117.380537 48.795506) (xy 117.301185 48.698815) (xy 117.204494 48.619463) (xy 117.09418 48.560498)
        (xy 117.02162 48.538487) (xy 117.153475 48.406632) (xy 117.31599 48.163411) (xy 117.427932 47.893158) (xy 117.485 47.60626)
        (xy 117.485 47.31374) (xy 117.427932 47.026842) (xy 117.31599 46.756589) (xy 117.153475 46.513368) (xy 116.946632 46.306525)
        (xy 116.703411 46.14401) (xy 116.433158 46.032068) (xy 116.14626 45.975) (xy 115.85374 45.975) (xy 115.566842 46.032068)
        (xy 115.296589 46.14401) (xy 115.053368 46.306525) (xy 114.846525 46.513368) (xy 114.68401 46.756589) (xy 114.572068 47.026842)
        (xy 114.515 47.31374) (xy 114.515 47.60626) (xy 114.572068 47.893158) (xy 114.68401 48.163411) (xy 114.846525 48.406632)
        (xy 114.97838 48.538487) (xy 114.90582 48.560498) (xy 114.795506 48.619463) (xy 114.698815 48.698815) (xy 114.619463 48.795506)
        (xy 114.560498 48.90582) (xy 114.524188 49.025518) (xy 114.511928 49.15) (xy 113.66 49.15) (xy 113.66 42.032279)
        (xy 113.66958 41.934576) (xy 113.68858 41.871644) (xy 113.719445 41.813595) (xy 113.760989 41.762657) (xy 113.811644 41.720752)
        (xy 113.869471 41.689485) (xy 113.932272 41.670044) (xy 114.027835 41.66) (xy 161.967721 41.66)
      )
    )
  )
)
