EESchema Schematic File Version 4
EELAYER 30 0
EELAYER END
$Descr A4 11693 8268
encoding utf-8
Sheet 1 1
Title ""
Date "lun. 30 mars 2015"
Rev ""
Comp ""
Comment1 ""
Comment2 ""
Comment3 ""
Comment4 ""
$EndDescr
Wire Wire Line
	2350 1600 3100 1600
Wire Wire Line
	2350 1500 3100 1500
Text Label 3100 1600 2    60   ~ 0
CAN1_TX
Text Label 3100 1500 2    60   ~ 0
CAN1_RX
Text Label 3100 1600 2    60   ~ 0
CAN1_TX
Wire Wire Line
	3600 1300 3600 1400
Text Label 3600 1300 0    60   ~ 0
LED2
Wire Notes Line
	650  750  4750 750 
Wire Wire Line
	3250 1800 2350 1800
Wire Wire Line
	3250 1900 3250 1800
$Comp
L power:GND #PWR03
U 1 1 5F429B0A
P 3250 1900
F 0 "#PWR03" H 3250 1650 50  0001 C CNN
F 1 "GND" H 3250 1750 50  0000 C CNN
F 2 "" H 3250 1900 50  0000 C CNN
F 3 "" H 3250 1900 50  0000 C CNN
	1    3250 1900
	1    0    0    -1  
$EndComp
Wire Wire Line
	2700 1900 2350 1900
Text Label 2700 1900 0    60   ~ 0
LED2
Wire Wire Line
	3600 2100 3600 2200
Wire Wire Line
	3600 1700 3600 1800
$Comp
L power:GND #PWR04
U 1 1 5F42620E
P 3600 2200
F 0 "#PWR04" H 3600 1950 50  0001 C CNN
F 1 "GND" H 3450 2200 50  0000 C CNN
F 2 "" H 3600 2200 50  0000 C CNN
F 3 "" H 3600 2200 50  0000 C CNN
	1    3600 2200
	1    0    0    -1  
$EndComp
$Comp
L Device:R R1
U 1 1 5F426202
P 3600 1950
F 0 "R1" H 3670 1996 50  0000 L CNN
F 1 "510R" H 3670 1905 50  0000 L CNN
F 2 "Resistor_SMD:R_0805_2012Metric_Pad1.15x1.40mm_HandSolder" V 3530 1950 50  0001 C CNN
F 3 "~" H 3600 1950 50  0001 C CNN
	1    3600 1950
	1    0    0    -1  
$EndComp
$Comp
L Device:LED D1
U 1 1 5F4261FC
P 3600 1550
F 0 "D1" V 3639 1432 50  0000 R CNN
F 1 "LD2" V 3548 1432 50  0000 R CNN
F 2 "LED_SMD:LED_0603_1608Metric_Pad1.05x0.95mm_HandSolder" H 3600 1550 50  0001 C CNN
F 3 "~" H 3600 1550 50  0001 C CNN
	1    3600 1550
	0    -1   -1   0   
$EndComp
Wire Wire Line
	4150 2100 4150 2200
Wire Wire Line
	4150 1700 4150 1800
Wire Wire Line
	4150 1300 4150 1400
$Comp
L power:GND #PWR07
U 1 1 5F4001CA
P 4150 2200
F 0 "#PWR07" H 4150 1950 50  0001 C CNN
F 1 "GND" H 4000 2200 50  0000 C CNN
F 2 "" H 4150 2200 50  0000 C CNN
F 3 "" H 4150 2200 50  0000 C CNN
	1    4150 2200
	1    0    0    -1  
$EndComp
$Comp
L power:+3.3V #PWR06
U 1 1 5F3FFC9D
P 4150 1300
F 0 "#PWR06" H 4150 1150 50  0001 C CNN
F 1 "+3.3V" H 4350 1350 50  0000 C CNN
F 2 "" H 4150 1300 50  0000 C CNN
F 3 "" H 4150 1300 50  0000 C CNN
	1    4150 1300
	1    0    0    -1  
$EndComp
$Comp
L Device:R R2
U 1 1 5F3FFB76
P 4150 1950
F 0 "R2" H 4220 1996 50  0000 L CNN
F 1 "510R" H 4220 1905 50  0000 L CNN
F 2 "Resistor_SMD:R_0805_2012Metric_Pad1.15x1.40mm_HandSolder" V 4080 1950 50  0001 C CNN
F 3 "~" H 4150 1950 50  0001 C CNN
	1    4150 1950
	1    0    0    -1  
$EndComp
$Comp
L Device:LED D2
U 1 1 5F3FEE5D
P 4150 1550
F 0 "D2" V 4189 1432 50  0000 R CNN
F 1 "POWER_LED" V 4098 1432 50  0000 R CNN
F 2 "LED_SMD:LED_0603_1608Metric_Pad1.05x0.95mm_HandSolder" H 4150 1550 50  0001 C CNN
F 3 "~" H 4150 1550 50  0001 C CNN
	1    4150 1550
	0    -1   -1   0   
$EndComp
Wire Wire Line
	4050 3100 4050 3200
Connection ~ 4050 3100
Wire Wire Line
	4050 3100 4000 3100
Wire Wire Line
	4050 2850 4050 3100
Wire Wire Line
	3300 3200 3650 3200
Wire Wire Line
	3650 3100 3650 2850
Connection ~ 3650 3100
Wire Wire Line
	3650 3100 3700 3100
Wire Wire Line
	3650 3200 3650 3100
Text Label 3300 3200 0    60   ~ 0
RESET
$Comp
L power:GND #PWR05
U 1 1 5F3F1EA4
P 4050 3200
F 0 "#PWR05" H 4050 2950 50  0001 C CNN
F 1 "GND" H 4050 3050 50  0000 C CNN
F 2 "" H 4050 3200 50  0000 C CNN
F 3 "" H 4050 3200 50  0000 C CNN
	1    4050 3200
	1    0    0    -1  
$EndComp
$Comp
L Device:C C1
U 1 1 5F3F0BA7
P 3850 3100
F 0 "C1" V 3650 3100 50  0000 C CNN
F 1 "100n" V 3550 3100 50  0000 C CNN
F 2 "Capacitor_SMD:C_0805_2012Metric_Pad1.15x1.40mm_HandSolder" H 3888 2950 50  0001 C CNN
F 3 "~" H 3850 3100 50  0001 C CNN
	1    3850 3100
	0    -1   -1   0   
$EndComp
Wire Wire Line
	850  2300 1550 2300
Wire Wire Line
	950  2200 1550 2200
$Comp
L power:+5V #PWR01
U 1 1 56D707BB
P 850 1650
F 0 "#PWR01" H 850 1500 50  0001 C CNN
F 1 "+5V" V 850 1850 50  0000 C CNN
F 2 "" H 850 1650 50  0000 C CNN
F 3 "" H 850 1650 50  0000 C CNN
	1    850  1650
	1    0    0    -1  
$EndComp
Wire Wire Line
	850  2300 850  1650
Wire Wire Line
	950  2200 950  1750
Text Label 1050 2100 0    60   ~ 0
RESET
Wire Wire Line
	1050 2100 1550 2100
$Comp
L Switch:SW_Push SW1
U 1 1 5F3E3617
P 3850 2850
F 0 "SW1" H 3850 3135 50  0000 C CNN
F 1 "RST_SW" H 3850 3044 50  0000 C CNN
F 2 "Button_Switch_THT:SW_PUSH_6mm_H4.3mm" H 3850 3050 50  0001 C CNN
F 3 "~" H 3850 3050 50  0001 C CNN
	1    3850 2850
	1    0    0    -1  
$EndComp
Connection ~ 1450 2500
Wire Wire Line
	1450 2400 1450 2500
Wire Wire Line
	1550 2400 1450 2400
Wire Wire Line
	1450 2500 1450 2600
Wire Wire Line
	1550 2500 1450 2500
Text Label 1050 2800 0    60   ~ 0
XSHUT0
$Comp
L power:GND #PWR02
U 1 1 5F2B3316
P 1450 2600
F 0 "#PWR02" H 1450 2350 50  0001 C CNN
F 1 "GND" H 1300 2600 50  0000 C CNN
F 2 "" H 1450 2600 50  0000 C CNN
F 3 "" H 1450 2600 50  0000 C CNN
	1    1450 2600
	1    0    0    -1  
$EndComp
NoConn ~ 2350 1700
NoConn ~ 2350 2200
NoConn ~ 2350 2900
NoConn ~ 2350 3000
NoConn ~ 2350 3200
NoConn ~ 2350 3300
NoConn ~ 1550 2600
NoConn ~ 1550 2000
Wire Wire Line
	2350 3100 2700 3100
Text Label 2700 2300 0    60   ~ 0
XSHUT6
Text Label 2700 2700 0    60   ~ 0
XSHUT5
Text Label 2700 2600 0    60   ~ 0
I2C3_SCL
Wire Wire Line
	1550 3200 1050 3200
Wire Wire Line
	1550 3100 1050 3100
Wire Wire Line
	1550 3000 1050 3000
Wire Wire Line
	1550 2900 1050 2900
Wire Wire Line
	1550 2800 1050 2800
Text Label 1050 3200 0    60   ~ 0
XSHUT4
Text Label 1050 3100 0    60   ~ 0
XSHUT3
Text Label 1050 3000 0    60   ~ 0
XSHUT2
Text Label 1050 2900 0    60   ~ 0
XSHUT1
Text Notes 1850 1900 0    60   ~ 0
1
Wire Wire Line
	2350 2600 2700 2600
Wire Wire Line
	2350 2700 2700 2700
Wire Wire Line
	2350 2800 2700 2800
Wire Wire Line
	2350 2000 2700 2000
Wire Wire Line
	2350 2100 2700 2100
Wire Wire Line
	2350 2300 2700 2300
Wire Wire Line
	2350 2400 2700 2400
$Comp
L Connector_Generic:Conn_01x10 P3
U 1 1 56D721E0
P 2150 1900
F 0 "P3" H 2150 2450 50  0000 C CNN
F 1 "Digital" V 2250 1900 50  0000 C CNN
F 2 "Connector_PinHeader_2.54mm:PinHeader_1x10_P2.54mm_Vertical" V 2300 1900 20  0000 C CNN
F 3 "" H 2150 1900 50  0000 C CNN
	1    2150 1900
	-1   0    0    -1  
$EndComp
Wire Wire Line
	1550 3300 1050 3300
Wire Notes Line
	2075 1125 2075 775 
Wire Notes Line
	675  1125 2075 1125
$Comp
L Connector_Generic:Conn_01x08 P4
U 1 1 56D7164F
P 2150 2900
F 0 "P4" H 2150 2400 50  0000 C CNN
F 1 "Digital" V 2250 2900 50  0000 C CNN
F 2 "Connector_PinHeader_2.54mm:PinHeader_1x08_P2.54mm_Vertical" V 2300 2850 20  0000 C CNN
F 3 "" H 2150 2900 50  0000 C CNN
	1    2150 2900
	-1   0    0    -1  
$EndComp
$Comp
L Connector_Generic:Conn_01x06 P2
U 1 1 56D70DD8
P 1750 3000
F 0 "P2" H 1750 2600 50  0000 C CNN
F 1 "Analog" V 1850 3000 50  0000 C CNN
F 2 "Connector_PinHeader_2.54mm:PinHeader_1x06_P2.54mm_Vertical" V 1900 3050 20  0000 C CNN
F 3 "" H 1750 3000 50  0000 C CNN
	1    1750 3000
	1    0    0    -1  
$EndComp
$Comp
L Connector_Generic:Conn_01x08 P1
U 1 1 56D70129
P 1750 2200
F 0 "P1" H 1750 2650 50  0000 C CNN
F 1 "Power" V 1850 2200 50  0000 C CNN
F 2 "Connector_PinHeader_2.54mm:PinHeader_1x08_P2.54mm_Vertical" V 1900 2200 20  0000 C CNN
F 3 "" H 1750 2200 50  0000 C CNN
	1    1750 2200
	1    0    0    -1  
$EndComp
Text Notes 700  1050 0    60   ~ 0
Shield for Arduino that uses\nthe same pin disposition\nlike "Uno" board Rev 3.
NoConn ~ 1550 1900
Text Label 2700 2000 0    60   ~ 0
XSHUT8
Text Label 2700 2100 0    60   ~ 0
XSHUT7
Text Label 2700 2400 0    60   ~ 0
USART1_TX
Text Label 2700 2800 0    60   ~ 0
I2C3_SDA
Text Label 2700 3100 0    60   ~ 0
USART1_RX
Text Label 1050 3300 0    60   ~ 0
XSHUT9
$Comp
L Connector_Generic:Conn_01x04 J4
U 1 1 5F224D83
P 7600 3550
F 0 "J4" H 7680 3542 50  0000 L CNN
F 1 "I2C3" H 7680 3451 50  0000 L CNN
F 2 "Connector_JST:JST_XH_B4B-XH-A_1x04_P2.50mm_Vertical" H 7600 3550 50  0001 C CNN
F 3 "~" H 7600 3550 50  0001 C CNN
	1    7600 3550
	1    0    0    -1  
$EndComp
$Comp
L Connector_Generic:Conn_01x05 J2
U 1 1 5F2266A9
P 5850 3600
F 0 "J2" H 6000 3550 50  0000 C CNN
F 1 "XSHUT 5-9" H 6200 3650 50  0000 C CNN
F 2 "Connector_JST:JST_XH_B5B-XH-A_1x05_P2.50mm_Vertical" H 5850 3600 50  0001 C CNN
F 3 "~" H 5850 3600 50  0001 C CNN
	1    5850 3600
	1    0    0    -1  
$EndComp
$Comp
L Connector_Generic:Conn_01x02 J5
U 1 1 5F227225
P 8550 2850
F 0 "J5" H 8630 2842 50  0000 L CNN
F 1 "+5V" H 8630 2751 50  0000 L CNN
F 2 "Connector_JST:JST_XH_B2B-XH-A_1x02_P2.50mm_Vertical" H 8550 2850 50  0001 C CNN
F 3 "~" H 8550 2850 50  0001 C CNN
	1    8550 2850
	1    0    0    -1  
$EndComp
Text Label 5150 2800 0    60   ~ 0
XSHUT0
Text Label 5150 2900 0    60   ~ 0
XSHUT1
Text Label 5150 3000 0    60   ~ 0
XSHUT2
Text Label 5150 3100 0    60   ~ 0
XSHUT3
Text Label 5150 3200 0    60   ~ 0
XSHUT4
Wire Wire Line
	5650 2800 5150 2800
Wire Wire Line
	5650 2900 5150 2900
Wire Wire Line
	5650 3000 5150 3000
Wire Wire Line
	5650 3100 5150 3100
Wire Wire Line
	5650 3200 5150 3200
Text Label 6800 3650 0    60   ~ 0
I2C3_SCL
Text Label 6800 3750 0    60   ~ 0
I2C3_SDA
Text Label 5150 3400 0    60   ~ 0
XSHUT5
Text Label 5150 3500 0    60   ~ 0
XSHUT6
Text Label 5150 3600 0    60   ~ 0
XSHUT7
Text Label 5150 3700 0    60   ~ 0
XSHUT8
Text Label 5150 3800 0    60   ~ 0
XSHUT9
Wire Wire Line
	5650 3400 5150 3400
Wire Wire Line
	5650 3500 5150 3500
Wire Wire Line
	5650 3600 5150 3600
Wire Wire Line
	5650 3700 5150 3700
Wire Wire Line
	5650 3800 5150 3800
Wire Wire Line
	6800 3650 7400 3650
Wire Wire Line
	7400 3750 6800 3750
$Comp
L power:GND #PWR012
U 1 1 5F2541C0
P 6600 3650
F 0 "#PWR012" H 6600 3400 50  0001 C CNN
F 1 "GND" H 6600 3500 50  0000 C CNN
F 2 "" H 6600 3650 50  0000 C CNN
F 3 "" H 6600 3650 50  0000 C CNN
	1    6600 3650
	1    0    0    -1  
$EndComp
$Comp
L power:+3.3V #PWR011
U 1 1 5F2555C9
P 6600 3350
F 0 "#PWR011" H 6600 3200 50  0001 C CNN
F 1 "+3.3V" H 6600 3550 50  0000 C CNN
F 2 "" H 6600 3350 50  0000 C CNN
F 3 "" H 6600 3350 50  0000 C CNN
	1    6600 3350
	1    0    0    -1  
$EndComp
Wire Wire Line
	6600 3350 6600 3450
Wire Wire Line
	6600 3450 7400 3450
Wire Wire Line
	7400 3550 6600 3550
Wire Wire Line
	6600 3550 6600 3650
$Comp
L power:+5V #PWR015
U 1 1 5F267ABE
P 8250 2750
F 0 "#PWR015" H 8250 2600 50  0001 C CNN
F 1 "+5V" H 8250 2950 50  0000 C CNN
F 2 "" H 8250 2750 50  0000 C CNN
F 3 "" H 8250 2750 50  0000 C CNN
	1    8250 2750
	1    0    0    -1  
$EndComp
$Comp
L power:GND #PWR016
U 1 1 5F2684A4
P 8250 3050
F 0 "#PWR016" H 8250 2800 50  0001 C CNN
F 1 "GND" H 8250 2900 50  0000 C CNN
F 2 "" H 8250 3050 50  0000 C CNN
F 3 "" H 8250 3050 50  0000 C CNN
	1    8250 3050
	1    0    0    -1  
$EndComp
Wire Wire Line
	8350 2950 8250 2950
Wire Wire Line
	8250 2950 8250 3050
Wire Wire Line
	8250 2750 8250 2850
Wire Wire Line
	8250 2850 8350 2850
$Comp
L Connector_Generic:Conn_01x02 J6
U 1 1 5F270EC7
P 8550 3650
F 0 "J6" H 8630 3642 50  0000 L CNN
F 1 "+3.3V" H 8630 3551 50  0000 L CNN
F 2 "Connector_JST:JST_XH_B2B-XH-A_1x02_P2.50mm_Vertical" H 8550 3650 50  0001 C CNN
F 3 "~" H 8550 3650 50  0001 C CNN
	1    8550 3650
	1    0    0    -1  
$EndComp
$Comp
L power:GND #PWR018
U 1 1 5F270ED3
P 8250 3850
F 0 "#PWR018" H 8250 3600 50  0001 C CNN
F 1 "GND" H 8250 3700 50  0000 C CNN
F 2 "" H 8250 3850 50  0000 C CNN
F 3 "" H 8250 3850 50  0000 C CNN
	1    8250 3850
	1    0    0    -1  
$EndComp
Wire Wire Line
	8350 3750 8250 3750
Wire Wire Line
	8250 3750 8250 3850
Wire Wire Line
	8250 3550 8250 3650
Wire Wire Line
	8250 3650 8350 3650
$Comp
L power:+3.3V #PWR017
U 1 1 5F2722EF
P 8250 3550
F 0 "#PWR017" H 8250 3400 50  0001 C CNN
F 1 "+3.3V" H 8250 3750 50  0000 C CNN
F 2 "" H 8250 3550 50  0000 C CNN
F 3 "" H 8250 3550 50  0000 C CNN
	1    8250 3550
	1    0    0    -1  
$EndComp
Wire Notes Line
	8900 4100 8900 2450
Wire Notes Line
	8900 2400 4900 2400
Wire Notes Line
	4900 4050 8900 4050
Text Notes 4900 2400 0    50   ~ 0
Connectors
Wire Notes Line
	650  750  650  3750
$Comp
L Connector_Generic:Conn_01x05 J1
U 1 1 5F225A81
P 5850 3000
F 0 "J1" H 5950 2950 50  0000 L CNN
F 1 "XSHUT 0-4" H 5950 3050 50  0000 L CNN
F 2 "Connector_JST:JST_XH_B5B-XH-A_1x05_P2.50mm_Vertical" H 5850 3000 50  0001 C CNN
F 3 "~" H 5850 3000 50  0001 C CNN
	1    5850 3000
	1    0    0    -1  
$EndComp
Wire Notes Line
	4750 3750 4750 750 
Wire Notes Line
	650  3750 4750 3750
Wire Notes Line
	4900 2400 4900 4050
$Comp
L Connector_Generic:Conn_01x02 J3
U 1 1 5F2278FE
P 7600 2850
F 0 "J3" H 7680 2842 50  0000 L CNN
F 1 "CAN1" H 7680 2751 50  0000 L CNN
F 2 "Connector_JST:JST_XH_B2B-XH-A_1x02_P2.50mm_Vertical" H 7600 2850 50  0001 C CNN
F 3 "~" H 7600 2850 50  0001 C CNN
	1    7600 2850
	1    0    0    -1  
$EndComp
$Comp
L power:+3.3V #PWR09
U 1 1 56D70538
P 5950 1000
F 0 "#PWR09" H 5950 850 50  0001 C CNN
F 1 "+3.3V" H 5950 1200 50  0000 C CNN
F 2 "" H 5950 1000 50  0000 C CNN
F 3 "" H 5950 1000 50  0000 C CNN
	1    5950 1000
	1    0    0    -1  
$EndComp
$Comp
L power:GND #PWR010
U 1 1 5F67F816
P 5950 1900
F 0 "#PWR010" H 5950 1650 50  0001 C CNN
F 1 "GND" H 5800 1900 50  0000 C CNN
F 2 "" H 5950 1900 50  0000 C CNN
F 3 "" H 5950 1900 50  0000 C CNN
	1    5950 1900
	1    0    0    -1  
$EndComp
Text Label 4950 1300 0    60   ~ 0
CAN1_TX
Text Label 4950 1400 0    60   ~ 0
CAN1_RX
Text Label 6600 1500 0    60   ~ 0
CAN1_L
Text Label 6600 1400 0    60   ~ 0
CAN1_H
NoConn ~ 5550 1500
$Comp
L Device:C C2
U 1 1 5F684115
P 7250 1450
F 0 "C2" H 7365 1496 50  0000 L CNN
F 1 "100n" H 7365 1405 50  0000 L CNN
F 2 "Capacitor_SMD:C_0805_2012Metric_Pad1.15x1.40mm_HandSolder" H 7288 1300 50  0001 C CNN
F 3 "~" H 7250 1450 50  0001 C CNN
	1    7250 1450
	1    0    0    -1  
$EndComp
$Comp
L power:+3.3V #PWR013
U 1 1 5F684EEE
P 7250 1200
F 0 "#PWR013" H 7250 1050 50  0001 C CNN
F 1 "+3.3V" H 7250 1400 50  0000 C CNN
F 2 "" H 7250 1200 50  0000 C CNN
F 3 "" H 7250 1200 50  0000 C CNN
	1    7250 1200
	1    0    0    -1  
$EndComp
$Comp
L power:GND #PWR014
U 1 1 5F6856A9
P 7250 1700
F 0 "#PWR014" H 7250 1450 50  0001 C CNN
F 1 "GND" H 7100 1700 50  0000 C CNN
F 2 "" H 7250 1700 50  0000 C CNN
F 3 "" H 7250 1700 50  0000 C CNN
	1    7250 1700
	1    0    0    -1  
$EndComp
$Comp
L Device:R R3
U 1 1 5F689B94
P 5450 1850
F 0 "R3" H 5100 1900 50  0000 L CNN
F 1 "1k to 10k" H 4950 1800 50  0000 L CNN
F 2 "Resistor_SMD:R_0805_2012Metric_Pad1.15x1.40mm_HandSolder" V 5380 1850 50  0001 C CNN
F 3 "~" H 5450 1850 50  0001 C CNN
	1    5450 1850
	1    0    0    -1  
$EndComp
$Comp
L Interface_CAN_LIN:SN65HVD230 U1
U 1 1 5F67D125
P 5950 1400
F 0 "U1" H 6400 850 50  0000 C CNN
F 1 "SN65HVD230" H 6400 950 50  0000 C CNN
F 2 "Package_SO:SOIC-8_3.9x4.9mm_P1.27mm" H 5950 900 50  0001 C CNN
F 3 "http://www.ti.com/lit/ds/symlink/sn65hvd230.pdf" H 5850 1800 50  0001 C CNN
	1    5950 1400
	1    0    0    -1  
$EndComp
$Comp
L power:GND #PWR08
U 1 1 5F68CEC0
P 5450 2100
F 0 "#PWR08" H 5450 1850 50  0001 C CNN
F 1 "GND" H 5300 2100 50  0000 C CNN
F 2 "" H 5450 2100 50  0000 C CNN
F 3 "" H 5450 2100 50  0000 C CNN
	1    5450 2100
	1    0    0    -1  
$EndComp
Wire Wire Line
	5950 1000 5950 1100
Wire Wire Line
	4950 1300 5550 1300
Wire Wire Line
	5550 1400 4950 1400
Wire Wire Line
	5550 1600 5450 1600
Wire Wire Line
	5450 1600 5450 1700
Wire Wire Line
	5450 2000 5450 2100
Wire Wire Line
	5950 1800 5950 1900
Wire Wire Line
	6600 1400 6350 1400
Wire Wire Line
	6600 1500 6350 1500
Wire Wire Line
	7250 1200 7250 1300
Wire Wire Line
	7250 1600 7250 1700
Wire Notes Line
	4900 2250 4900 750 
Text Notes 4900 750  0    50   ~ 0
CAN Tranceiver
Text Label 7150 2950 2    60   ~ 0
CAN1_L
Text Label 7150 2850 2    60   ~ 0
CAN1_H
Wire Wire Line
	7150 2950 7400 2950
Wire Wire Line
	7150 2850 7400 2850
$Comp
L Device:R R4
U 1 1 5F6947E8
P 7800 1450
F 0 "R4" H 7550 1400 50  0000 L CNN
F 1 "120R" H 7450 1500 50  0000 L CNN
F 2 "Resistor_SMD:R_0805_2012Metric_Pad1.15x1.40mm_HandSolder" V 7730 1450 50  0001 C CNN
F 3 "~" H 7800 1450 50  0001 C CNN
	1    7800 1450
	-1   0    0    1   
$EndComp
Text Label 7800 1200 0    60   ~ 0
CAN1_H
Text Label 7800 1750 0    60   ~ 0
CAN1_L
Wire Wire Line
	7800 1200 7800 1300
Wire Wire Line
	7800 1600 7800 1750
Wire Notes Line
	8200 2250 8200 750 
Wire Notes Line
	4900 750  8200 750 
Wire Notes Line
	4900 2250 8200 2250
$EndSCHEMATC
