EESchema Schematic File Version 4
EELAYER 30 0
EELAYER END
$Descr A4 11693 8268
encoding utf-8
Sheet 1 1
Title ""
Date ""
Rev ""
Comp ""
Comment1 ""
Comment2 ""
Comment3 ""
Comment4 ""
$EndDescr
$Comp
L Regulator_Linear:AMS1117-3.3 U2
U 1 1 5F6DFB25
P 2700 1100
F 0 "U2" H 2700 1342 50  0000 C CNN
F 1 "AMS1117-3.3" H 2700 1251 50  0000 C CNN
F 2 "Package_TO_SOT_SMD:SOT-223-3_TabPin2" H 2700 1300 50  0001 C CNN
F 3 "http://www.advanced-monolithic.com/pdf/ds1117.pdf" H 2800 850 50  0001 C CNN
F 4 "C6186" H 2700 1100 50  0001 C CNN "LCSC Part #"
	1    2700 1100
	1    0    0    -1  
$EndComp
$Comp
L Device:Ferrite_Bead_Small FB1
U 1 1 5F6E377D
P 2000 1100
F 0 "FB1" V 1750 1100 50  0000 C CNN
F 1 "100 @ 100 MHz" V 1850 1150 50  0000 C CNN
F 2 "Inductor_SMD:L_0805_2012Metric" V 1930 1100 50  0001 C CNN
F 3 "~" H 2000 1100 50  0001 C CNN
F 4 "C1015" H 2000 1100 50  0001 C CNN "LCSC Part #"
	1    2000 1100
	0    1    1    0   
$EndComp
$Comp
L Device:Fuse_Small F1
U 1 1 5F6E5F01
P 1000 1100
F 0 "F1" H 1000 1285 50  0000 C CNN
F 1 "250mA" H 1000 1194 50  0000 C CNN
F 2 "Fuse:Fuse_1206_3216Metric_Pad1.42x1.75mm_HandSolder" H 1000 1100 50  0001 C CNN
F 3 "~" H 1000 1100 50  0001 C CNN
	1    1000 1100
	1    0    0    -1  
$EndComp
$Comp
L MCU_ST_STM32F4:STM32F405RGTx U1
U 1 1 5F6E9151
P 2100 4350
F 0 "U1" H 2350 2550 50  0000 C CNN
F 1 "STM32F405RGT6" H 2600 2450 50  0000 C CNN
F 2 "Package_QFP:LQFP-64_10x10mm_P0.5mm" H 1500 2650 50  0001 R CNN
F 3 "http://www.st.com/st-web-ui/static/active/en/resource/technical/document/datasheet/DM00037051.pdf" H 2100 4350 50  0001 C CNN
F 4 "C15742" H 2100 4350 50  0001 C CNN "LCSC Part #"
	1    2100 4350
	1    0    0    -1  
$EndComp
$Comp
L Device:C_Small C3
U 1 1 5F6EEECD
P 2250 1300
F 0 "C3" H 2000 1350 50  0000 L CNN
F 1 "10u" H 2000 1250 50  0000 L CNN
F 2 "Capacitor_SMD:C_0805_2012Metric" H 2250 1300 50  0001 C CNN
F 3 "~" H 2250 1300 50  0001 C CNN
F 4 "C15850" H 2250 1300 50  0001 C CNN "LCSC Part #"
	1    2250 1300
	1    0    0    -1  
$EndComp
$Comp
L Device:C_Small C4
U 1 1 5F6F0295
P 3150 1300
F 0 "C4" H 3250 1350 50  0000 L CNN
F 1 "10u" H 3250 1250 50  0000 L CNN
F 2 "Capacitor_SMD:C_0805_2012Metric" H 3150 1300 50  0001 C CNN
F 3 "~" H 3150 1300 50  0001 C CNN
F 4 "C15850" H 3150 1300 50  0001 C CNN "LCSC Part #"
	1    3150 1300
	1    0    0    -1  
$EndComp
$Comp
L power:GND #PWR08
U 1 1 5F6F27E9
P 2700 1600
F 0 "#PWR08" H 2700 1350 50  0001 C CNN
F 1 "GND" H 2705 1427 50  0000 C CNN
F 2 "" H 2700 1600 50  0001 C CNN
F 3 "" H 2700 1600 50  0001 C CNN
	1    2700 1600
	1    0    0    -1  
$EndComp
$Comp
L power:+3.3V #PWR09
U 1 1 5F6F2F9C
P 3150 1000
F 0 "#PWR09" H 3150 850 50  0001 C CNN
F 1 "+3.3V" H 3165 1173 50  0000 C CNN
F 2 "" H 3150 1000 50  0001 C CNN
F 3 "" H 3150 1000 50  0001 C CNN
	1    3150 1000
	1    0    0    -1  
$EndComp
$Comp
L power:VCC #PWR01
U 1 1 5F6F3B2B
P 750 1000
F 0 "#PWR01" H 750 850 50  0001 C CNN
F 1 "VCC" H 765 1173 50  0000 C CNN
F 2 "" H 750 1000 50  0001 C CNN
F 3 "" H 750 1000 50  0001 C CNN
	1    750  1000
	1    0    0    -1  
$EndComp
Wire Wire Line
	750  1000 750  1100
Wire Wire Line
	750  1100 900  1100
Wire Wire Line
	2100 1100 2250 1100
Wire Wire Line
	1100 1100 1300 1100
Wire Wire Line
	2250 1200 2250 1100
Connection ~ 2250 1100
Wire Wire Line
	2250 1100 2400 1100
Wire Wire Line
	3000 1100 3150 1100
Wire Wire Line
	3150 1000 3150 1100
Connection ~ 3150 1100
Wire Wire Line
	3150 1100 3150 1200
Wire Wire Line
	2250 1400 2250 1500
Wire Wire Line
	2250 1500 2700 1500
Wire Wire Line
	3150 1500 3150 1400
Wire Wire Line
	2700 1400 2700 1500
Connection ~ 2700 1500
Wire Wire Line
	2700 1500 3150 1500
Wire Wire Line
	2700 1500 2700 1600
Wire Notes Line
	650  750  650  1850
Text Notes 650  700  0    50   ~ 0
Input voltage regulator
$Comp
L power:+3.3V #PWR05
U 1 1 5F6F6D66
P 1900 2350
F 0 "#PWR05" H 1900 2200 50  0001 C CNN
F 1 "+3.3V" H 1915 2523 50  0000 C CNN
F 2 "" H 1900 2350 50  0001 C CNN
F 3 "" H 1900 2350 50  0001 C CNN
	1    1900 2350
	1    0    0    -1  
$EndComp
Wire Wire Line
	1900 2450 1900 2350
Wire Wire Line
	1900 2450 2000 2450
Wire Wire Line
	1900 2450 1900 2550
Connection ~ 1900 2450
Wire Wire Line
	2000 2550 2000 2450
Connection ~ 2000 2450
Wire Wire Line
	2000 2450 2100 2450
Wire Wire Line
	2100 2550 2100 2450
Connection ~ 2100 2450
Wire Wire Line
	2100 2450 2200 2450
Wire Wire Line
	2200 2550 2200 2450
Connection ~ 2200 2450
Wire Wire Line
	2200 2450 2300 2450
Wire Wire Line
	2300 2550 2300 2450
$Comp
L power:+3.3V #PWR012
U 1 1 5F6F94E0
P 4050 4500
F 0 "#PWR012" H 4050 4350 50  0001 C CNN
F 1 "+3.3V" H 4065 4673 50  0000 C CNN
F 2 "" H 4050 4500 50  0001 C CNN
F 3 "" H 4050 4500 50  0001 C CNN
	1    4050 4500
	1    0    0    -1  
$EndComp
$Comp
L Device:Ferrite_Bead_Small FB2
U 1 1 5F6F97F5
P 4500 4600
F 0 "FB2" V 4263 4600 50  0000 C CNN
F 1 "100 @ 100 MHz" V 4354 4600 50  0000 C CNN
F 2 "Inductor_SMD:L_0805_2012Metric" V 4430 4600 50  0001 C CNN
F 3 "~" H 4500 4600 50  0001 C CNN
F 4 "C1015" H 4500 4600 50  0001 C CNN "LCSC Part #"
	1    4500 4600
	0    1    1    0   
$EndComp
$Comp
L Device:C_Small C13
U 1 1 5F6FAE71
P 5200 4800
F 0 "C13" H 5300 4850 50  0000 L CNN
F 1 "100n" H 5300 4750 50  0000 L CNN
F 2 "Capacitor_SMD:C_0603_1608Metric" H 5200 4800 50  0001 C CNN
F 3 "~" H 5200 4800 50  0001 C CNN
F 4 "C14663" H 5200 4800 50  0001 C CNN "LCSC Part #"
	1    5200 4800
	1    0    0    -1  
$EndComp
$Comp
L Device:C_Small C10
U 1 1 5F6FCCCF
P 4800 4800
F 0 "C10" H 4900 4850 50  0000 L CNN
F 1 "10n" H 4900 4750 50  0000 L CNN
F 2 "Capacitor_SMD:C_0603_1608Metric" H 4800 4800 50  0001 C CNN
F 3 "~" H 4800 4800 50  0001 C CNN
F 4 "C57112" H 4800 4800 50  0001 C CNN "LCSC Part #"
	1    4800 4800
	1    0    0    -1  
$EndComp
$Comp
L power:+3.3VA #PWR017
U 1 1 5F6FD4FD
P 5200 4500
F 0 "#PWR017" H 5200 4350 50  0001 C CNN
F 1 "+3.3VA" H 5215 4673 50  0000 C CNN
F 2 "" H 5200 4500 50  0001 C CNN
F 3 "" H 5200 4500 50  0001 C CNN
	1    5200 4500
	1    0    0    -1  
$EndComp
$Comp
L power:GND #PWR018
U 1 1 5F6FDDAE
P 5200 5000
F 0 "#PWR018" H 5200 4750 50  0001 C CNN
F 1 "GND" H 5205 4827 50  0000 C CNN
F 2 "" H 5200 5000 50  0001 C CNN
F 3 "" H 5200 5000 50  0001 C CNN
	1    5200 5000
	1    0    0    -1  
$EndComp
Wire Wire Line
	4050 4500 4050 4600
Wire Wire Line
	4050 4600 4400 4600
Wire Wire Line
	5200 4600 5200 4700
Wire Wire Line
	4600 4600 4800 4600
Wire Wire Line
	5200 4500 5200 4600
Connection ~ 5200 4600
Wire Wire Line
	4800 4700 4800 4600
Connection ~ 4800 4600
Wire Wire Line
	4800 4600 5200 4600
Wire Wire Line
	5200 5000 5200 4900
$Comp
L power:GND #PWR016
U 1 1 5F70098B
P 4800 5000
F 0 "#PWR016" H 4800 4750 50  0001 C CNN
F 1 "GND" H 4805 4827 50  0000 C CNN
F 2 "" H 4800 5000 50  0001 C CNN
F 3 "" H 4800 5000 50  0001 C CNN
	1    4800 5000
	1    0    0    -1  
$EndComp
Wire Wire Line
	4800 5000 4800 4900
$Comp
L power:+3.3VA #PWR07
U 1 1 5F704BE3
P 2400 2350
F 0 "#PWR07" H 2400 2200 50  0001 C CNN
F 1 "+3.3VA" H 2415 2523 50  0000 C CNN
F 2 "" H 2400 2350 50  0001 C CNN
F 3 "" H 2400 2350 50  0001 C CNN
	1    2400 2350
	1    0    0    -1  
$EndComp
Wire Wire Line
	2400 2350 2400 2550
$Comp
L Device:C_Small C2
U 1 1 5F721641
P 1200 3400
F 0 "C2" H 1300 3450 50  0000 L CNN
F 1 "2.2u" H 1300 3350 50  0000 L CNN
F 2 "Capacitor_SMD:C_0603_1608Metric" H 1200 3400 50  0001 C CNN
F 3 "~" H 1200 3400 50  0001 C CNN
F 4 "C23630" H 1200 3400 50  0001 C CNN "LCSC Part #"
	1    1200 3400
	1    0    0    -1  
$EndComp
$Comp
L Device:C_Small C1
U 1 1 5F722308
P 950 3400
F 0 "C1" H 700 3450 50  0000 L CNN
F 1 "2.2u" H 700 3350 50  0000 L CNN
F 2 "Capacitor_SMD:C_0603_1608Metric" H 950 3400 50  0001 C CNN
F 3 "~" H 950 3400 50  0001 C CNN
F 4 "C23630" H 950 3400 50  0001 C CNN "LCSC Part #"
	1    950  3400
	1    0    0    -1  
$EndComp
$Comp
L power:GND #PWR02
U 1 1 5F7234DF
P 950 3600
F 0 "#PWR02" H 950 3350 50  0001 C CNN
F 1 "GND" H 955 3427 50  0000 C CNN
F 2 "" H 950 3600 50  0001 C CNN
F 3 "" H 950 3600 50  0001 C CNN
	1    950  3600
	1    0    0    -1  
$EndComp
$Comp
L power:GND #PWR03
U 1 1 5F72390B
P 1200 3600
F 0 "#PWR03" H 1200 3350 50  0001 C CNN
F 1 "GND" H 1205 3427 50  0000 C CNN
F 2 "" H 1200 3600 50  0001 C CNN
F 3 "" H 1200 3600 50  0001 C CNN
	1    1200 3600
	1    0    0    -1  
$EndComp
Wire Wire Line
	1200 3600 1200 3500
Wire Wire Line
	1200 3250 1400 3250
Wire Wire Line
	1400 3150 950  3150
Wire Wire Line
	950  3500 950  3600
Text GLabel 1300 2950 0    50   Input ~ 0
BOOT0
Text GLabel 1300 3950 0    50   Input ~ 0
HSE_IN
Text GLabel 1300 4050 0    50   Output ~ 0
HSE_OUT
Wire Wire Line
	950  3300 950  3150
Wire Wire Line
	1200 3250 1200 3300
$Comp
L Device:LED_Small D1
U 1 1 5F73DB52
P 3400 1100
F 0 "D1" H 3400 893 50  0000 C CNN
F 1 "Pink" H 3400 984 50  0000 C CNN
F 2 "LED_SMD:LED_0603_1608Metric_Pad1.05x0.95mm_HandSolder" V 3400 1100 50  0001 C CNN
F 3 "~" V 3400 1100 50  0001 C CNN
	1    3400 1100
	-1   0    0    1   
$EndComp
$Comp
L Device:R_Small R1
U 1 1 5F73E9CB
P 3600 1300
F 0 "R1" H 3659 1346 50  0000 L CNN
F 1 "4.7k" H 3659 1255 50  0000 L CNN
F 2 "Resistor_SMD:R_0603_1608Metric" H 3600 1300 50  0001 C CNN
F 3 "~" H 3600 1300 50  0001 C CNN
F 4 "C23162" H 3600 1300 50  0001 C CNN "LCSC Part #"
	1    3600 1300
	1    0    0    -1  
$EndComp
$Comp
L Device:Crystal_GND24_Small HSE1
U 1 1 5F74DDE2
P 4400 2600
F 0 "HSE1" H 4100 2850 50  0000 L CNN
F 1 "16MHz" H 4100 2750 50  0000 L CNN
F 2 "Crystal:Crystal_SMD_3225-4Pin_3.2x2.5mm" H 4400 2600 50  0001 C CNN
F 3 "~" H 4400 2600 50  0001 C CNN
F 4 "C13738" H 4400 2600 50  0001 C CNN "LCSC Part #"
	1    4400 2600
	1    0    0    -1  
$EndComp
$Comp
L Device:C_Small C9
U 1 1 5F74E8A3
P 4700 2700
F 0 "C9" H 4800 2700 50  0000 L CNN
F 1 "12p" H 4800 2600 50  0000 L CNN
F 2 "Capacitor_SMD:C_0603_1608Metric" H 4700 2700 50  0001 C CNN
F 3 "~" H 4700 2700 50  0001 C CNN
F 4 "C38523" H 4700 2700 50  0001 C CNN "LCSC Part #"
	1    4700 2700
	1    0    0    -1  
$EndComp
$Comp
L Device:R_Small R3
U 1 1 5F74F3CE
P 5000 2600
F 0 "R3" V 4804 2600 50  0000 C CNN
F 1 "47R" V 4895 2600 50  0000 C CNN
F 2 "Resistor_SMD:R_0603_1608Metric" H 5000 2600 50  0001 C CNN
F 3 "~" H 5000 2600 50  0001 C CNN
F 4 "C23182" H 5000 2600 50  0001 C CNN "LCSC Part #"
	1    5000 2600
	0    1    1    0   
$EndComp
$Comp
L Device:C_Small C7
U 1 1 5F74FEDA
P 4200 2700
F 0 "C7" H 3950 2700 50  0000 L CNN
F 1 "12p" H 3950 2600 50  0000 L CNN
F 2 "Capacitor_SMD:C_0603_1608Metric" H 4200 2700 50  0001 C CNN
F 3 "~" H 4200 2700 50  0001 C CNN
F 4 "C38523" H 4200 2700 50  0001 C CNN "LCSC Part #"
	1    4200 2700
	1    0    0    -1  
$EndComp
Text GLabel 4100 2600 0    50   Input ~ 0
HSE_IN
Text GLabel 5150 2600 2    50   Output ~ 0
HSE_OUT
$Comp
L power:GND #PWR015
U 1 1 5F753760
P 4400 2900
F 0 "#PWR015" H 4400 2650 50  0001 C CNN
F 1 "GND" H 4405 2727 50  0000 C CNN
F 2 "" H 4400 2900 50  0001 C CNN
F 3 "" H 4400 2900 50  0001 C CNN
	1    4400 2900
	1    0    0    -1  
$EndComp
Wire Wire Line
	4200 2800 4200 2850
Wire Wire Line
	4200 2850 4400 2850
Wire Wire Line
	4700 2850 4700 2800
Wire Wire Line
	4400 2900 4400 2850
Connection ~ 4400 2850
Wire Wire Line
	4400 2850 4550 2850
Wire Wire Line
	4400 2700 4400 2850
Wire Wire Line
	4400 2500 4400 2450
Wire Wire Line
	4400 2450 4550 2450
Wire Wire Line
	4550 2450 4550 2850
Connection ~ 4550 2850
Wire Wire Line
	4550 2850 4700 2850
Wire Wire Line
	4100 2600 4200 2600
Wire Wire Line
	4300 2600 4200 2600
Connection ~ 4200 2600
Wire Wire Line
	4500 2600 4700 2600
Wire Wire Line
	4700 2600 4900 2600
Connection ~ 4700 2600
Wire Wire Line
	5100 2600 5150 2600
$Comp
L power:GND #PWR06
U 1 1 5F7744C7
P 2000 6250
F 0 "#PWR06" H 2000 6000 50  0001 C CNN
F 1 "GND" H 2005 6077 50  0000 C CNN
F 2 "" H 2000 6250 50  0001 C CNN
F 3 "" H 2000 6250 50  0001 C CNN
	1    2000 6250
	1    0    0    -1  
$EndComp
Wire Wire Line
	2000 6150 2000 6200
Wire Wire Line
	2000 6200 2100 6200
Wire Wire Line
	2200 6200 2200 6150
Wire Wire Line
	2100 6150 2100 6200
Connection ~ 2100 6200
Wire Wire Line
	2100 6200 2200 6200
Wire Wire Line
	2000 6250 2000 6200
Connection ~ 2000 6200
Wire Wire Line
	1400 2950 1300 2950
Wire Wire Line
	1400 3950 1300 3950
Wire Wire Line
	1400 4050 1300 4050
Wire Wire Line
	3150 1500 3600 1500
Wire Wire Line
	3600 1500 3600 1400
Wire Wire Line
	3600 1100 3500 1100
Wire Wire Line
	3300 1100 3150 1100
Wire Wire Line
	3600 1200 3600 1100
Connection ~ 3150 1500
Wire Notes Line
	3900 750  3900 1850
Wire Notes Line
	650  750  3900 750 
Wire Notes Line
	650  1850 3900 1850
Text GLabel 1300 2750 0    50   Input ~ 0
NRST
Wire Wire Line
	1300 2750 1400 2750
Text GLabel 2900 5650 2    50   Output ~ 0
XSHUT0
Text GLabel 2900 5750 2    50   Output ~ 0
XSHUT1
Text GLabel 2900 5850 2    50   Output ~ 0
XSHUT2
Text GLabel 2900 5950 2    50   Output ~ 0
XSHUT3
Text GLabel 1300 5050 0    50   Output ~ 0
XSHUT4
Text GLabel 1300 5150 0    50   Output ~ 0
XSHUT5
Text GLabel 2900 3650 2    50   Output ~ 0
XSHUT6
Text GLabel 2900 3550 2    50   Output ~ 0
XSHUT7
Text GLabel 1300 5350 0    50   Output ~ 0
XSHUT8
Text GLabel 1300 5250 0    50   Output ~ 0
XSHUT9
Wire Wire Line
	1300 5050 1400 5050
Wire Wire Line
	1400 5150 1300 5150
Wire Wire Line
	1300 5250 1400 5250
Wire Wire Line
	1400 5350 1300 5350
Wire Wire Line
	2800 5650 2900 5650
Wire Wire Line
	2900 5750 2800 5750
Wire Wire Line
	2800 5850 2900 5850
Wire Wire Line
	2900 5950 2800 5950
Wire Wire Line
	2900 3650 2800 3650
Wire Wire Line
	2800 3550 2900 3550
Text GLabel 2900 5050 2    50   Output ~ 0
I2C1_SCL
Text GLabel 2900 5150 2    50   BiDi ~ 0
I2C1_SDA
Text GLabel 2900 4750 2    50   Output ~ 0
SWO
Text GLabel 2900 4150 2    50   Input ~ 0
SWCLK
Text GLabel 2900 4050 2    50   BiDi ~ 0
SWDIO
Wire Wire Line
	2900 4050 2800 4050
Wire Wire Line
	2800 4150 2900 4150
Wire Wire Line
	2900 4750 2800 4750
Wire Wire Line
	2900 5050 2800 5050
Wire Wire Line
	2900 5150 2800 5150
Text GLabel 2900 2750 2    50   BiDi ~ 0
UART4_TX
Text GLabel 2900 2850 2    50   BiDi ~ 0
UART4_RX
Wire Wire Line
	2900 2750 2800 2750
Wire Wire Line
	2800 2850 2900 2850
Text GLabel 2900 3350 2    50   Output ~ 0
LD0
$Comp
L Transistor_FET:AO3401A Q1
U 1 1 5F7F7155
P 1500 1200
F 0 "Q1" V 1842 1200 50  0000 C CNN
F 1 "AO3401A" V 1751 1200 50  0000 C CNN
F 2 "Package_TO_SOT_SMD:SOT-23" H 1700 1125 50  0001 L CIN
F 3 "http://www.aosmd.com/pdfs/datasheet/AO3401A.pdf" H 1500 1200 50  0001 L CNN
F 4 "C15127" H 1500 1200 50  0001 C CNN "LCSC Part #"
	1    1500 1200
	0    -1   -1   0   
$EndComp
Wire Wire Line
	1700 1100 1900 1100
$Comp
L power:GND #PWR04
U 1 1 5F7F8B66
P 1500 1500
F 0 "#PWR04" H 1500 1250 50  0001 C CNN
F 1 "GND" H 1505 1327 50  0000 C CNN
F 2 "" H 1500 1500 50  0001 C CNN
F 3 "" H 1500 1500 50  0001 C CNN
	1    1500 1500
	1    0    0    -1  
$EndComp
Wire Wire Line
	1500 1400 1500 1500
Wire Wire Line
	4100 6050 4100 5950
Wire Wire Line
	4100 5750 4100 5650
$Comp
L power:GND #PWR014
U 1 1 5F730C7F
P 4100 6050
F 0 "#PWR014" H 4100 5800 50  0001 C CNN
F 1 "GND" H 4105 5877 50  0000 C CNN
F 2 "" H 4100 6050 50  0001 C CNN
F 3 "" H 4100 6050 50  0001 C CNN
	1    4100 6050
	1    0    0    -1  
$EndComp
$Comp
L Device:R_Small R2
U 1 1 5F73050E
P 4100 5850
F 0 "R2" H 4159 5896 50  0000 L CNN
F 1 "10k" H 4159 5805 50  0000 L CNN
F 2 "Resistor_SMD:R_0603_1608Metric" H 4100 5850 50  0001 C CNN
F 3 "~" H 4100 5850 50  0001 C CNN
F 4 "C25804" H 4100 5850 50  0001 C CNN "LCSC Part #"
	1    4100 5850
	1    0    0    -1  
$EndComp
Text GLabel 4100 5650 1    50   Output ~ 0
BOOT0
Wire Wire Line
	2900 3350 2800 3350
Text GLabel 6850 4950 0    50   Input ~ 0
XSHUT4
Text GLabel 8150 4950 0    50   Input ~ 0
XSHUT5
Text GLabel 9500 5650 0    50   Input ~ 0
XSHUT6
Text GLabel 8150 5650 0    50   Input ~ 0
XSHUT7
Text GLabel 6850 5650 0    50   Input ~ 0
XSHUT8
Text GLabel 9500 4950 0    50   Input ~ 0
XSHUT9
Text GLabel 2900 3950 2    50   Output ~ 0
CAN_TX
Text GLabel 2900 3850 2    50   Input ~ 0
CAN_RX
Wire Wire Line
	2900 3850 2800 3850
Wire Wire Line
	2800 3950 2900 3950
Text GLabel 8700 1700 0    50   BiDi ~ 0
CAN_L
$Comp
L Connector_Generic:Conn_01x02 J10
U 1 1 5FA830B9
P 9750 2750
F 0 "J10" H 9830 2742 50  0000 L CNN
F 1 "CAN" H 9830 2651 50  0000 L CNN
F 2 "Connector_JST:JST_XH_B2B-XH-A_1x02_P2.50mm_Vertical" H 9750 2750 50  0001 C CNN
F 3 "~" H 9750 2750 50  0001 C CNN
	1    9750 2750
	1    0    0    -1  
$EndComp
Wire Wire Line
	9550 2750 9450 2750
Wire Wire Line
	9450 2850 9550 2850
Wire Wire Line
	8700 1200 8800 1200
Text GLabel 8700 1200 0    50   BiDi ~ 0
CAN_H
Text Notes 8100 2200 0    50   ~ 0
R7:\n- 0R for high speed mode\n- 10k for slope control mode
Wire Wire Line
	9550 1400 9450 1400
Wire Wire Line
	9550 1300 9450 1300
Wire Wire Line
	9950 1100 9950 1000
Wire Wire Line
	10450 1400 10350 1400
Wire Wire Line
	10450 1500 10350 1500
Wire Wire Line
	9950 1800 9950 1900
Wire Wire Line
	9450 1900 9450 2000
Wire Wire Line
	9450 1600 9450 1700
Wire Wire Line
	9550 1600 9450 1600
$Comp
L power:GND #PWR046
U 1 1 5F96A637
P 9450 2000
F 0 "#PWR046" H 9450 1750 50  0001 C CNN
F 1 "GND" H 9455 1827 50  0000 C CNN
F 2 "" H 9450 2000 50  0001 C CNN
F 3 "" H 9450 2000 50  0001 C CNN
	1    9450 2000
	1    0    0    -1  
$EndComp
$Comp
L Device:R_Small R7
U 1 1 5F961C9A
P 9450 1800
F 0 "R7" H 9509 1846 50  0000 L CNN
F 1 "10k" H 9509 1755 50  0000 L CNN
F 2 "Resistor_SMD:R_0805_2012Metric_Pad1.15x1.40mm_HandSolder" H 9450 1800 50  0001 C CNN
F 3 "~" H 9450 1800 50  0001 C CNN
F 4 "C17414" H 9450 1800 50  0001 C CNN "LCSC Part #"
	1    9450 1800
	-1   0    0    1   
$EndComp
Text GLabel 10450 1400 2    50   BiDi ~ 0
CAN_H
Text GLabel 10450 1500 2    50   BiDi ~ 0
CAN_L
NoConn ~ 9550 1500
Text GLabel 9450 1300 0    50   Output ~ 0
CAN_TX
Text GLabel 9450 1400 0    50   Input ~ 0
CAN_RX
$Comp
L power:+3.3V #PWR051
U 1 1 5F95992D
P 9950 1000
F 0 "#PWR051" H 9950 850 50  0001 C CNN
F 1 "+3.3V" H 9965 1173 50  0000 C CNN
F 2 "" H 9950 1000 50  0001 C CNN
F 3 "" H 9950 1000 50  0001 C CNN
	1    9950 1000
	1    0    0    -1  
$EndComp
$Comp
L power:GND #PWR052
U 1 1 5F9594A8
P 9950 1900
F 0 "#PWR052" H 9950 1650 50  0001 C CNN
F 1 "GND" H 9955 1727 50  0000 C CNN
F 2 "" H 9950 1900 50  0001 C CNN
F 3 "" H 9950 1900 50  0001 C CNN
	1    9950 1900
	1    0    0    -1  
$EndComp
$Comp
L Interface_CAN_LIN:SN65HVD230 U3
U 1 1 5F9585A3
P 9950 1400
F 0 "U3" H 10350 1750 50  0000 C CNN
F 1 "SN65HVD230" H 10550 1650 50  0000 C CNN
F 2 "Package_SO:SOIC-8_3.9x4.9mm_P1.27mm" H 9950 900 50  0001 C CNN
F 3 "http://www.ti.com/lit/ds/symlink/sn65hvd230.pdf" H 9850 1800 50  0001 C CNN
F 4 "C12084" H 9950 1400 50  0001 C CNN "LCSC Part #"
	1    9950 1400
	1    0    0    -1  
$EndComp
Wire Notes Line
	650  2100 6000 2100
Wire Notes Line
	6000 2100 6000 6500
Wire Notes Line
	6000 6500 650  6500
Wire Notes Line
	650  6500 650  2100
Text Notes 650  2050 0    50   ~ 0
Microcontoller
Wire Notes Line
	11100 750  11100 2250
Wire Notes Line
	11100 750  8050 750 
Text Notes 8050 700  0    50   ~ 0
CAN Transceiver
NoConn ~ 1400 4250
NoConn ~ 1400 4450
NoConn ~ 1400 4550
NoConn ~ 1400 4650
NoConn ~ 1400 4750
NoConn ~ 1400 4950
NoConn ~ 1400 5650
NoConn ~ 1400 5750
NoConn ~ 1400 5850
NoConn ~ 1400 5950
NoConn ~ 2800 5350
NoConn ~ 2800 5250
NoConn ~ 2800 4950
NoConn ~ 2800 4850
NoConn ~ 2800 4650
NoConn ~ 2800 4550
NoConn ~ 2800 4450
NoConn ~ 2800 4250
NoConn ~ 2800 3750
NoConn ~ 2800 3250
NoConn ~ 2800 3150
NoConn ~ 2800 3050
NoConn ~ 2800 2950
$Comp
L Device:C_Small C17
U 1 1 5F7A8038
P 10650 1950
F 0 "C17" V 10850 1800 50  0000 L CNN
F 1 "100n" V 10750 1750 50  0000 L CNN
F 2 "Capacitor_SMD:C_0603_1608Metric" H 10650 1950 50  0001 C CNN
F 3 "~" H 10650 1950 50  0001 C CNN
F 4 "C14663" H 10650 1950 50  0001 C CNN "LCSC Part #"
	1    10650 1950
	0    -1   -1   0   
$EndComp
$Comp
L power:+3.3V #PWR040
U 1 1 5F7A8871
P 10400 1950
F 0 "#PWR040" H 10400 1800 50  0001 C CNN
F 1 "+3.3V" H 10415 2123 50  0000 C CNN
F 2 "" H 10400 1950 50  0001 C CNN
F 3 "" H 10400 1950 50  0001 C CNN
	1    10400 1950
	1    0    0    -1  
$EndComp
$Comp
L power:GND #PWR041
U 1 1 5F7A8D21
P 10900 1950
F 0 "#PWR041" H 10900 1700 50  0001 C CNN
F 1 "GND" H 10905 1777 50  0000 C CNN
F 2 "" H 10900 1950 50  0001 C CNN
F 3 "" H 10900 1950 50  0001 C CNN
	1    10900 1950
	1    0    0    -1  
$EndComp
$Comp
L Mechanical:MountingHole_Pad H1
U 1 1 5F7B29EA
P 4300 900
F 0 "H1" V 4254 1050 50  0000 L CNN
F 1 "MountingHole_Pad" V 4345 1050 50  0000 L CNN
F 2 "MountingHole:MountingHole_3.2mm_M3_Pad_Via" H 4300 900 50  0001 C CNN
F 3 "~" H 4300 900 50  0001 C CNN
	1    4300 900 
	0    1    1    0   
$EndComp
$Comp
L Mechanical:MountingHole_Pad H2
U 1 1 5F7B3799
P 4300 1100
F 0 "H2" V 4254 1250 50  0000 L CNN
F 1 "MountingHole_Pad" V 4345 1250 50  0000 L CNN
F 2 "MountingHole:MountingHole_3.2mm_M3_Pad_Via" H 4300 1100 50  0001 C CNN
F 3 "~" H 4300 1100 50  0001 C CNN
	1    4300 1100
	0    1    1    0   
$EndComp
$Comp
L Mechanical:MountingHole_Pad H3
U 1 1 5F7B3AAE
P 4300 1300
F 0 "H3" V 4254 1450 50  0000 L CNN
F 1 "MountingHole_Pad" V 4345 1450 50  0000 L CNN
F 2 "MountingHole:MountingHole_3.2mm_M3_Pad_Via" H 4300 1300 50  0001 C CNN
F 3 "~" H 4300 1300 50  0001 C CNN
	1    4300 1300
	0    1    1    0   
$EndComp
$Comp
L Mechanical:MountingHole_Pad H4
U 1 1 5F7B3CF7
P 4300 1500
F 0 "H4" V 4254 1650 50  0000 L CNN
F 1 "MountingHole_Pad" V 4345 1650 50  0000 L CNN
F 2 "MountingHole:MountingHole_3.2mm_M3_Pad_Via" H 4300 1500 50  0001 C CNN
F 3 "~" H 4300 1500 50  0001 C CNN
	1    4300 1500
	0    1    1    0   
$EndComp
$Comp
L power:GND #PWR013
U 1 1 5F7B3F34
P 4100 1600
F 0 "#PWR013" H 4100 1350 50  0001 C CNN
F 1 "GND" H 4105 1427 50  0000 C CNN
F 2 "" H 4100 1600 50  0001 C CNN
F 3 "" H 4100 1600 50  0001 C CNN
	1    4100 1600
	1    0    0    -1  
$EndComp
Wire Wire Line
	4100 1600 4100 1500
Wire Wire Line
	4100 900  4200 900 
Wire Wire Line
	4200 1100 4100 1100
Connection ~ 4100 1100
Wire Wire Line
	4100 1100 4100 900 
Wire Wire Line
	4200 1300 4100 1300
Connection ~ 4100 1300
Wire Wire Line
	4100 1300 4100 1100
Wire Wire Line
	4100 1500 4200 1500
Connection ~ 4100 1500
Wire Wire Line
	4100 1500 4100 1300
Wire Notes Line
	4000 1850 5200 1850
Wire Notes Line
	5200 1850 5200 750 
Wire Notes Line
	5200 750  4000 750 
Wire Notes Line
	4000 750  4000 1850
Text Notes 4000 700  0    50   ~ 0
Mounting holes
$Comp
L Switch:SW_Push SW1
U 1 1 5F82FF4D
P 5000 5750
F 0 "SW1" H 5000 6035 50  0000 C CNN
F 1 "SW_Push" H 5000 5944 50  0000 C CNN
F 2 "Button_Switch_THT:SW_PUSH_6mm_H4.3mm" H 5000 5950 50  0001 C CNN
F 3 "~" H 5000 5950 50  0001 C CNN
	1    5000 5750
	1    0    0    -1  
$EndComp
Text GLabel 4700 5750 0    50   Output ~ 0
NRST
$Comp
L Device:C_Small C12
U 1 1 5F83B01A
P 5000 5900
F 0 "C12" V 5250 5800 50  0000 L CNN
F 1 "100n" V 5150 5800 50  0000 L CNN
F 2 "Capacitor_SMD:C_0603_1608Metric" H 5000 5900 50  0001 C CNN
F 3 "~" H 5000 5900 50  0001 C CNN
F 4 "C14663" H 5000 5900 50  0001 C CNN "LCSC Part #"
	1    5000 5900
	0    1    1    0   
$EndComp
$Comp
L power:GND #PWR019
U 1 1 5F83B65D
P 5200 6000
F 0 "#PWR019" H 5200 5750 50  0001 C CNN
F 1 "GND" H 5205 5827 50  0000 C CNN
F 2 "" H 5200 6000 50  0001 C CNN
F 3 "" H 5200 6000 50  0001 C CNN
	1    5200 6000
	1    0    0    -1  
$EndComp
Wire Wire Line
	4700 5750 4800 5750
Wire Wire Line
	4800 5750 4800 5900
Wire Wire Line
	4800 5900 4900 5900
Wire Wire Line
	5200 5900 5200 5750
Wire Wire Line
	5100 5900 5200 5900
Connection ~ 4800 5750
Wire Wire Line
	5200 5900 5200 6000
Connection ~ 5200 5900
Text GLabel 1300 5550 0    50   Output ~ 0
LD_CAN_RX
Text GLabel 1300 5450 0    50   Output ~ 0
LD_CAN_TX
$Comp
L Device:R_Small R4
U 1 1 5F8C148D
P 5650 1400
F 0 "R4" H 5709 1446 50  0000 L CNN
F 1 "4.7k" H 5709 1355 50  0000 L CNN
F 2 "Resistor_SMD:R_0603_1608Metric" H 5650 1400 50  0001 C CNN
F 3 "~" H 5650 1400 50  0001 C CNN
F 4 "C23162" H 5650 1400 50  0001 C CNN "LCSC Part #"
	1    5650 1400
	1    0    0    -1  
$EndComp
$Comp
L power:GND #PWR020
U 1 1 5F8C1493
P 5650 1600
F 0 "#PWR020" H 5650 1350 50  0001 C CNN
F 1 "GND" H 5655 1427 50  0000 C CNN
F 2 "" H 5650 1600 50  0001 C CNN
F 3 "" H 5650 1600 50  0001 C CNN
	1    5650 1600
	1    0    0    -1  
$EndComp
Text GLabel 5550 900  0    50   Input ~ 0
LD0
Wire Wire Line
	5550 900  5650 900 
Wire Wire Line
	5650 900  5650 1000
Wire Wire Line
	5650 1200 5650 1300
Wire Wire Line
	5650 1500 5650 1600
$Comp
L Device:LED_Small D4
U 1 1 5F8CBCB1
P 7600 1100
F 0 "D4" V 7550 950 50  0000 C CNN
F 1 "Yellow" V 7650 900 50  0000 C CNN
F 2 "LED_SMD:LED_0603_1608Metric" V 7600 1100 50  0001 C CNN
F 3 "~" V 7600 1100 50  0001 C CNN
F 4 "C72038" H 7600 1100 50  0001 C CNN "LCSC Part #"
	1    7600 1100
	0    -1   -1   0   
$EndComp
$Comp
L Device:R_Small R6
U 1 1 5F8CBCB7
P 7600 1400
F 0 "R6" H 7659 1446 50  0000 L CNN
F 1 "4.7k" H 7659 1355 50  0000 L CNN
F 2 "Resistor_SMD:R_0603_1608Metric" H 7600 1400 50  0001 C CNN
F 3 "~" H 7600 1400 50  0001 C CNN
F 4 "C23162" H 7600 1400 50  0001 C CNN "LCSC Part #"
	1    7600 1400
	1    0    0    -1  
$EndComp
$Comp
L power:GND #PWR031
U 1 1 5F8CBCBD
P 7600 1600
F 0 "#PWR031" H 7600 1350 50  0001 C CNN
F 1 "GND" H 7605 1427 50  0000 C CNN
F 2 "" H 7600 1600 50  0001 C CNN
F 3 "" H 7600 1600 50  0001 C CNN
	1    7600 1600
	1    0    0    -1  
$EndComp
Text GLabel 7500 900  0    50   Input ~ 0
LD_CAN_RX
Wire Wire Line
	7500 900  7600 900 
Wire Wire Line
	7600 900  7600 1000
Wire Wire Line
	7600 1200 7600 1300
Wire Wire Line
	7600 1500 7600 1600
$Comp
L Device:LED_Small D3
U 1 1 5F8D687D
P 6600 1100
F 0 "D3" V 6550 950 50  0000 C CNN
F 1 "Green" V 6650 900 50  0000 C CNN
F 2 "LED_SMD:LED_0603_1608Metric" V 6600 1100 50  0001 C CNN
F 3 "~" V 6600 1100 50  0001 C CNN
F 4 "C72043" H 6600 1100 50  0001 C CNN "LCSC Part #"
	1    6600 1100
	0    -1   -1   0   
$EndComp
$Comp
L Device:R_Small R5
U 1 1 5F8D6883
P 6600 1400
F 0 "R5" H 6659 1446 50  0000 L CNN
F 1 "4.7k" H 6659 1355 50  0000 L CNN
F 2 "Resistor_SMD:R_0603_1608Metric" H 6600 1400 50  0001 C CNN
F 3 "~" H 6600 1400 50  0001 C CNN
F 4 "C23162" H 6600 1400 50  0001 C CNN "LCSC Part #"
	1    6600 1400
	1    0    0    -1  
$EndComp
$Comp
L power:GND #PWR026
U 1 1 5F8D6889
P 6600 1600
F 0 "#PWR026" H 6600 1350 50  0001 C CNN
F 1 "GND" H 6605 1427 50  0000 C CNN
F 2 "" H 6600 1600 50  0001 C CNN
F 3 "" H 6600 1600 50  0001 C CNN
	1    6600 1600
	1    0    0    -1  
$EndComp
Text GLabel 6500 900  0    50   Input ~ 0
LD_CAN_TX
Wire Wire Line
	6500 900  6600 900 
Wire Wire Line
	6600 900  6600 1000
Wire Wire Line
	6600 1200 6600 1300
Wire Wire Line
	6600 1500 6600 1600
Wire Notes Line
	5300 750  5300 1850
Wire Notes Line
	5300 1850 7950 1850
Wire Notes Line
	7950 1850 7950 750 
Wire Notes Line
	5300 750  7950 750 
Text Notes 5300 700  0    50   ~ 0
Debug LEDs
NoConn ~ 2800 3450
NoConn ~ 1400 4850
Wire Wire Line
	1300 5450 1400 5450
Wire Wire Line
	1400 5550 1300 5550
$Comp
L Connector_Generic:Conn_01x05 J12
U 1 1 5FC7804F
P 9750 4200
F 0 "J12" H 9900 4150 50  0000 C CNN
F 1 "TOF_3" H 9950 4250 50  0000 C CNN
F 2 "Connector_JST:JST_XH_B5B-XH-A_1x05_P2.50mm_Vertical" H 9750 4200 50  0001 C CNN
F 3 "~" H 9750 4200 50  0001 C CNN
	1    9750 4200
	1    0    0    1   
$EndComp
Wire Wire Line
	9450 4000 9550 4000
Wire Wire Line
	9550 4100 9450 4100
Wire Wire Line
	9450 4200 9550 4200
Wire Wire Line
	9550 4400 9450 4400
$Comp
L Connector_Generic:Conn_01x05 J3
U 1 1 5FC8345B
P 7150 4950
F 0 "J3" H 7300 4900 50  0000 C CNN
F 1 "TOF_4" H 7350 5000 50  0000 C CNN
F 2 "Connector_JST:JST_XH_B5B-XH-A_1x05_P2.50mm_Vertical" H 7150 4950 50  0001 C CNN
F 3 "~" H 7150 4950 50  0001 C CNN
	1    7150 4950
	1    0    0    1   
$EndComp
Text GLabel 6850 4750 0    50   Input ~ 0
I2C1_SCL
Text GLabel 6850 4850 0    50   BiDi ~ 0
I2C1_SDA
Wire Wire Line
	6850 4750 6950 4750
Wire Wire Line
	6950 4850 6850 4850
Wire Wire Line
	6850 4950 6950 4950
$Comp
L power:GND #PWR029
U 1 1 5FC83466
P 6850 5150
F 0 "#PWR029" H 6850 4900 50  0001 C CNN
F 1 "GND" H 6855 4977 50  0000 C CNN
F 2 "" H 6850 5150 50  0001 C CNN
F 3 "" H 6850 5150 50  0001 C CNN
	1    6850 5150
	1    0    0    -1  
$EndComp
Wire Wire Line
	6950 5150 6850 5150
$Comp
L Connector_Generic:Conn_01x05 J8
U 1 1 5FC90083
P 8450 4950
F 0 "J8" H 8600 4900 50  0000 C CNN
F 1 "TOF_5" H 8650 5000 50  0000 C CNN
F 2 "Connector_JST:JST_XH_B5B-XH-A_1x05_P2.50mm_Vertical" H 8450 4950 50  0001 C CNN
F 3 "~" H 8450 4950 50  0001 C CNN
	1    8450 4950
	1    0    0    1   
$EndComp
Text GLabel 8150 4750 0    50   Input ~ 0
I2C1_SCL
Text GLabel 8150 4850 0    50   BiDi ~ 0
I2C1_SDA
Wire Wire Line
	8150 4750 8250 4750
Wire Wire Line
	8250 4850 8150 4850
Wire Wire Line
	8150 4950 8250 4950
$Comp
L power:GND #PWR038
U 1 1 5FC9008E
P 8150 5150
F 0 "#PWR038" H 8150 4900 50  0001 C CNN
F 1 "GND" H 8155 4977 50  0000 C CNN
F 2 "" H 8150 5150 50  0001 C CNN
F 3 "" H 8150 5150 50  0001 C CNN
	1    8150 5150
	1    0    0    -1  
$EndComp
Wire Wire Line
	8250 5150 8150 5150
$Comp
L Connector_Generic:Conn_01x05 J13
U 1 1 5FC9D0F5
P 9800 4950
F 0 "J13" H 9950 4900 50  0000 C CNN
F 1 "TOF_6" H 10000 5000 50  0000 C CNN
F 2 "Connector_JST:JST_XH_B5B-XH-A_1x05_P2.50mm_Vertical" H 9800 4950 50  0001 C CNN
F 3 "~" H 9800 4950 50  0001 C CNN
	1    9800 4950
	1    0    0    1   
$EndComp
Text GLabel 9500 4750 0    50   Input ~ 0
I2C1_SCL
Text GLabel 9500 4850 0    50   BiDi ~ 0
I2C1_SDA
Wire Wire Line
	9500 4750 9600 4750
Wire Wire Line
	9600 4850 9500 4850
Wire Wire Line
	9500 4950 9600 4950
$Comp
L power:GND #PWR049
U 1 1 5FC9D100
P 9500 5150
F 0 "#PWR049" H 9500 4900 50  0001 C CNN
F 1 "GND" H 9505 4977 50  0000 C CNN
F 2 "" H 9500 5150 50  0001 C CNN
F 3 "" H 9500 5150 50  0001 C CNN
	1    9500 5150
	1    0    0    -1  
$EndComp
Wire Wire Line
	9600 5150 9500 5150
$Comp
L Connector_Generic:Conn_01x05 J4
U 1 1 5FCD3DE2
P 7150 5650
F 0 "J4" H 7300 5600 50  0000 C CNN
F 1 "TOF_7" H 7350 5700 50  0000 C CNN
F 2 "Connector_JST:JST_XH_B5B-XH-A_1x05_P2.50mm_Vertical" H 7150 5650 50  0001 C CNN
F 3 "~" H 7150 5650 50  0001 C CNN
	1    7150 5650
	1    0    0    1   
$EndComp
Text GLabel 6850 5450 0    50   Input ~ 0
I2C1_SCL
Text GLabel 6850 5550 0    50   BiDi ~ 0
I2C1_SDA
Wire Wire Line
	6850 5450 6950 5450
Wire Wire Line
	6950 5550 6850 5550
Wire Wire Line
	6850 5650 6950 5650
$Comp
L power:GND #PWR030
U 1 1 5FCD3DED
P 6850 5850
F 0 "#PWR030" H 6850 5600 50  0001 C CNN
F 1 "GND" H 6855 5677 50  0000 C CNN
F 2 "" H 6850 5850 50  0001 C CNN
F 3 "" H 6850 5850 50  0001 C CNN
	1    6850 5850
	1    0    0    -1  
$EndComp
Wire Wire Line
	6950 5850 6850 5850
$Comp
L Connector_Generic:Conn_01x05 J9
U 1 1 5FCE15CD
P 8450 5650
F 0 "J9" H 8600 5600 50  0000 C CNN
F 1 "TOF_8" H 8650 5700 50  0000 C CNN
F 2 "Connector_JST:JST_XH_B5B-XH-A_1x05_P2.50mm_Vertical" H 8450 5650 50  0001 C CNN
F 3 "~" H 8450 5650 50  0001 C CNN
	1    8450 5650
	1    0    0    1   
$EndComp
Text GLabel 8150 5450 0    50   Input ~ 0
I2C1_SCL
Text GLabel 8150 5550 0    50   BiDi ~ 0
I2C1_SDA
Wire Wire Line
	8150 5450 8250 5450
Wire Wire Line
	8250 5550 8150 5550
Wire Wire Line
	8150 5650 8250 5650
$Comp
L power:GND #PWR039
U 1 1 5FCE15D8
P 8150 5850
F 0 "#PWR039" H 8150 5600 50  0001 C CNN
F 1 "GND" H 8155 5677 50  0000 C CNN
F 2 "" H 8150 5850 50  0001 C CNN
F 3 "" H 8150 5850 50  0001 C CNN
	1    8150 5850
	1    0    0    -1  
$EndComp
Wire Wire Line
	8250 5850 8150 5850
$Comp
L Connector_Generic:Conn_01x05 J14
U 1 1 5FCF02A4
P 9800 5650
F 0 "J14" H 9950 5600 50  0000 C CNN
F 1 "TOF_9" H 10000 5700 50  0000 C CNN
F 2 "Connector_JST:JST_XH_B5B-XH-A_1x05_P2.50mm_Vertical" H 9800 5650 50  0001 C CNN
F 3 "~" H 9800 5650 50  0001 C CNN
	1    9800 5650
	1    0    0    1   
$EndComp
Text GLabel 9500 5450 0    50   Input ~ 0
I2C1_SCL
Text GLabel 9500 5550 0    50   BiDi ~ 0
I2C1_SDA
Wire Wire Line
	9500 5450 9600 5450
Wire Wire Line
	9600 5550 9500 5550
Wire Wire Line
	9500 5650 9600 5650
$Comp
L power:GND #PWR050
U 1 1 5FCF02AF
P 9500 5850
F 0 "#PWR050" H 9500 5600 50  0001 C CNN
F 1 "GND" H 9505 5677 50  0000 C CNN
F 2 "" H 9500 5850 50  0001 C CNN
F 3 "" H 9500 5850 50  0001 C CNN
	1    9500 5850
	1    0    0    -1  
$EndComp
Wire Wire Line
	9600 5850 9500 5850
$Comp
L Connector_Generic:Conn_01x05 J11
U 1 1 5FD00F0D
P 9750 3400
F 0 "J11" H 9900 3350 50  0000 C CNN
F 1 "TOF_0" H 9950 3450 50  0000 C CNN
F 2 "Connector_JST:JST_XH_B5B-XH-A_1x05_P2.50mm_Vertical" H 9750 3400 50  0001 C CNN
F 3 "~" H 9750 3400 50  0001 C CNN
	1    9750 3400
	1    0    0    1   
$EndComp
Wire Wire Line
	9450 3200 9550 3200
Wire Wire Line
	9550 3300 9450 3300
Wire Wire Line
	9450 3400 9550 3400
Wire Wire Line
	9550 3600 9450 3600
$Comp
L power:+3.3V #PWR0102
U 1 1 5FD9D8CD
P 6250 5050
F 0 "#PWR0102" H 6250 4900 50  0001 C CNN
F 1 "+3.3V" H 6265 5223 50  0000 C CNN
F 2 "" H 6250 5050 50  0001 C CNN
F 3 "" H 6250 5050 50  0001 C CNN
	1    6250 5050
	1    0    0    -1  
$EndComp
$Comp
L power:+3.3V #PWR0104
U 1 1 5FD9E578
P 7550 5050
F 0 "#PWR0104" H 7550 4900 50  0001 C CNN
F 1 "+3.3V" H 7565 5223 50  0000 C CNN
F 2 "" H 7550 5050 50  0001 C CNN
F 3 "" H 7550 5050 50  0001 C CNN
	1    7550 5050
	1    0    0    -1  
$EndComp
$Comp
L power:+3.3V #PWR0105
U 1 1 5FD9E9A2
P 7550 5750
F 0 "#PWR0105" H 7550 5600 50  0001 C CNN
F 1 "+3.3V" H 7565 5923 50  0000 C CNN
F 2 "" H 7550 5750 50  0001 C CNN
F 3 "" H 7550 5750 50  0001 C CNN
	1    7550 5750
	1    0    0    -1  
$EndComp
$Comp
L power:+3.3V #PWR0106
U 1 1 5FD9EDF4
P 6250 5750
F 0 "#PWR0106" H 6250 5600 50  0001 C CNN
F 1 "+3.3V" H 6265 5923 50  0000 C CNN
F 2 "" H 6250 5750 50  0001 C CNN
F 3 "" H 6250 5750 50  0001 C CNN
	1    6250 5750
	1    0    0    -1  
$EndComp
$Comp
L power:+3.3V #PWR0107
U 1 1 5FD9F34D
P 8900 5750
F 0 "#PWR0107" H 8900 5600 50  0001 C CNN
F 1 "+3.3V" H 8915 5923 50  0000 C CNN
F 2 "" H 8900 5750 50  0001 C CNN
F 3 "" H 8900 5750 50  0001 C CNN
	1    8900 5750
	1    0    0    -1  
$EndComp
$Comp
L power:+3.3V #PWR0108
U 1 1 5FD9FBB0
P 8900 5050
F 0 "#PWR0108" H 8900 4900 50  0001 C CNN
F 1 "+3.3V" H 8915 5223 50  0000 C CNN
F 2 "" H 8900 5050 50  0001 C CNN
F 3 "" H 8900 5050 50  0001 C CNN
	1    8900 5050
	1    0    0    -1  
$EndComp
Wire Notes Line
	6100 6100 10150 6100
Wire Wire Line
	6250 5050 6950 5050
Wire Wire Line
	6250 5750 6950 5750
Wire Wire Line
	7550 5750 8250 5750
Wire Wire Line
	7550 5050 8250 5050
Wire Wire Line
	8900 5050 9600 5050
Wire Wire Line
	8900 5750 9600 5750
NoConn ~ 2800 5450
NoConn ~ 2800 5550
Wire Notes Line
	10150 6100 10150 2450
Wire Notes Line
	6100 2450 6100 6100
Wire Wire Line
	8850 3500 9550 3500
Wire Wire Line
	8850 4300 9550 4300
Wire Wire Line
	7550 4300 8250 4300
Wire Wire Line
	6250 4300 6950 4300
Wire Notes Line
	6100 2450 10150 2450
$Comp
L power:+3.3V #PWR0110
U 1 1 5FDA0684
P 8850 3500
F 0 "#PWR0110" H 8850 3350 50  0001 C CNN
F 1 "+3.3V" H 8865 3673 50  0000 C CNN
F 2 "" H 8850 3500 50  0001 C CNN
F 3 "" H 8850 3500 50  0001 C CNN
	1    8850 3500
	1    0    0    -1  
$EndComp
$Comp
L power:+3.3V #PWR0109
U 1 1 5FDA003E
P 8850 4300
F 0 "#PWR0109" H 8850 4150 50  0001 C CNN
F 1 "+3.3V" H 8865 4473 50  0000 C CNN
F 2 "" H 8850 4300 50  0001 C CNN
F 3 "" H 8850 4300 50  0001 C CNN
	1    8850 4300
	1    0    0    -1  
$EndComp
$Comp
L power:+3.3V #PWR0103
U 1 1 5FD9E075
P 7550 4300
F 0 "#PWR0103" H 7550 4150 50  0001 C CNN
F 1 "+3.3V" H 7565 4473 50  0000 C CNN
F 2 "" H 7550 4300 50  0001 C CNN
F 3 "" H 7550 4300 50  0001 C CNN
	1    7550 4300
	1    0    0    -1  
$EndComp
$Comp
L power:+3.3V #PWR0101
U 1 1 5FD9C581
P 6250 4300
F 0 "#PWR0101" H 6250 4150 50  0001 C CNN
F 1 "+3.3V" H 6265 4473 50  0000 C CNN
F 2 "" H 6250 4300 50  0001 C CNN
F 3 "" H 6250 4300 50  0001 C CNN
	1    6250 4300
	1    0    0    -1  
$EndComp
Text GLabel 6850 4200 0    50   Input ~ 0
XSHUT1
$Comp
L power:GND #PWR047
U 1 1 5FD00F18
P 9450 3600
F 0 "#PWR047" H 9450 3350 50  0001 C CNN
F 1 "GND" H 9455 3427 50  0000 C CNN
F 2 "" H 9450 3600 50  0001 C CNN
F 3 "" H 9450 3600 50  0001 C CNN
	1    9450 3600
	1    0    0    -1  
$EndComp
Text GLabel 9450 3300 0    50   BiDi ~ 0
I2C1_SDA
Text GLabel 9450 3200 0    50   Input ~ 0
I2C1_SCL
Text GLabel 9450 3400 0    50   Input ~ 0
XSHUT0
$Comp
L power:GND #PWR048
U 1 1 5FC7805A
P 9450 4400
F 0 "#PWR048" H 9450 4150 50  0001 C CNN
F 1 "GND" H 9455 4227 50  0000 C CNN
F 2 "" H 9450 4400 50  0001 C CNN
F 3 "" H 9450 4400 50  0001 C CNN
	1    9450 4400
	1    0    0    -1  
$EndComp
Text GLabel 9450 4100 0    50   BiDi ~ 0
I2C1_SDA
Text GLabel 9450 4000 0    50   Input ~ 0
I2C1_SCL
Wire Wire Line
	8250 4400 8150 4400
$Comp
L power:GND #PWR037
U 1 1 5FC6CBE9
P 8150 4400
F 0 "#PWR037" H 8150 4150 50  0001 C CNN
F 1 "GND" H 8155 4227 50  0000 C CNN
F 2 "" H 8150 4400 50  0001 C CNN
F 3 "" H 8150 4400 50  0001 C CNN
	1    8150 4400
	1    0    0    -1  
$EndComp
Wire Wire Line
	8150 4200 8250 4200
Wire Wire Line
	8250 4100 8150 4100
Wire Wire Line
	8150 4000 8250 4000
Text GLabel 8150 4100 0    50   BiDi ~ 0
I2C1_SDA
Text GLabel 8150 4000 0    50   Input ~ 0
I2C1_SCL
$Comp
L Connector_Generic:Conn_01x05 J7
U 1 1 5FC6CBDE
P 8450 4200
F 0 "J7" H 8600 4150 50  0000 C CNN
F 1 "TOF_2" H 8650 4250 50  0000 C CNN
F 2 "Connector_JST:JST_XH_B5B-XH-A_1x05_P2.50mm_Vertical" H 8450 4200 50  0001 C CNN
F 3 "~" H 8450 4200 50  0001 C CNN
	1    8450 4200
	1    0    0    1   
$EndComp
Wire Wire Line
	6950 4400 6850 4400
$Comp
L power:GND #PWR028
U 1 1 5FC0202C
P 6850 4400
F 0 "#PWR028" H 6850 4150 50  0001 C CNN
F 1 "GND" H 6855 4227 50  0000 C CNN
F 2 "" H 6850 4400 50  0001 C CNN
F 3 "" H 6850 4400 50  0001 C CNN
	1    6850 4400
	1    0    0    -1  
$EndComp
Wire Wire Line
	6850 4200 6950 4200
Wire Wire Line
	6950 4100 6850 4100
Wire Wire Line
	6850 4000 6950 4000
Text GLabel 6850 4100 0    50   BiDi ~ 0
I2C1_SDA
Text GLabel 6850 4000 0    50   Input ~ 0
I2C1_SCL
$Comp
L Connector_Generic:Conn_01x05 J2
U 1 1 5FB23BE0
P 7150 4200
F 0 "J2" H 7300 4150 50  0000 C CNN
F 1 "TOF_1" H 7350 4250 50  0000 C CNN
F 2 "Connector_JST:JST_XH_B5B-XH-A_1x05_P2.50mm_Vertical" H 7150 4200 50  0001 C CNN
F 3 "~" H 7150 4200 50  0001 C CNN
	1    7150 4200
	1    0    0    1   
$EndComp
$Comp
L power:+3.3V #PWR021
U 1 1 5F86C2D2
P 6250 2700
F 0 "#PWR021" H 6250 2550 50  0001 C CNN
F 1 "+3.3V" H 6265 2873 50  0000 C CNN
F 2 "" H 6250 2700 50  0001 C CNN
F 3 "" H 6250 2700 50  0001 C CNN
	1    6250 2700
	1    0    0    -1  
$EndComp
Connection ~ 6850 3200
Wire Wire Line
	6850 3500 6850 3600
Wire Wire Line
	6850 3200 6850 3300
$Comp
L power:GND #PWR027
U 1 1 5F896BF5
P 6850 3600
F 0 "#PWR027" H 6850 3350 50  0001 C CNN
F 1 "GND" H 6855 3427 50  0000 C CNN
F 2 "" H 6850 3600 50  0001 C CNN
F 3 "" H 6850 3600 50  0001 C CNN
	1    6850 3600
	1    0    0    -1  
$EndComp
$Comp
L Device:C_Small C16
U 1 1 5F8966A5
P 6850 3400
F 0 "C16" H 6950 3450 50  0000 L CNN
F 1 "100n" H 6950 3350 50  0000 L CNN
F 2 "Capacitor_SMD:C_0603_1608Metric" H 6850 3400 50  0001 C CNN
F 3 "~" H 6850 3400 50  0001 C CNN
F 4 "C14663" H 6850 3400 50  0001 C CNN "LCSC Part #"
	1    6850 3400
	1    0    0    -1  
$EndComp
Text Notes 6100 2400 0    50   ~ 0
Connectors
Wire Notes Line
	8050 2250 11100 2250
Wire Notes Line
	8050 2250 8050 750 
Text GLabel 9450 2850 0    50   BiDi ~ 0
CAN_L
Text GLabel 9450 2750 0    50   BiDi ~ 0
CAN_H
Wire Wire Line
	8100 2850 8200 2850
Wire Wire Line
	8200 2750 8100 2750
Text GLabel 8100 2750 0    50   BiDi ~ 0
UART4_RX
Text GLabel 8100 2850 0    50   BiDi ~ 0
UART4_TX
Text GLabel 9450 4200 0    50   Input ~ 0
XSHUT3
Text GLabel 8150 4200 0    50   Input ~ 0
XSHUT2
Wire Wire Line
	6250 3200 6250 3300
Connection ~ 6250 3200
Wire Wire Line
	6350 3200 6250 3200
Wire Wire Line
	6250 3000 6250 3200
NoConn ~ 6350 3100
NoConn ~ 6850 3100
Wire Wire Line
	6950 3200 6850 3200
Wire Wire Line
	6950 3000 6850 3000
Wire Wire Line
	6950 2900 6850 2900
Wire Wire Line
	6950 2800 6850 2800
Connection ~ 6250 3000
Wire Wire Line
	6350 3000 6250 3000
Wire Wire Line
	6250 2900 6250 3000
Wire Wire Line
	6350 2900 6250 2900
Wire Wire Line
	6250 2800 6350 2800
Wire Wire Line
	6250 2700 6250 2800
Text GLabel 6950 3200 2    50   Output ~ 0
NRST
Text GLabel 6950 3000 2    50   Input ~ 0
SWO
Text GLabel 6950 2900 2    50   Output ~ 0
SWCLK
Text GLabel 6950 2800 2    50   BiDi ~ 0
SWDIO
$Comp
L power:GND #PWR022
U 1 1 5F809A0E
P 6250 3300
F 0 "#PWR022" H 6250 3050 50  0001 C CNN
F 1 "GND" H 6255 3127 50  0000 C CNN
F 2 "" H 6250 3300 50  0001 C CNN
F 3 "" H 6250 3300 50  0001 C CNN
	1    6250 3300
	1    0    0    -1  
$EndComp
$Comp
L Connector_Generic:Conn_02x05_Odd_Even J1
U 1 1 5F807D67
P 6550 3000
F 0 "J1" H 6600 2550 50  0000 C CNN
F 1 "SWD" H 6600 2650 50  0000 C CNN
F 2 "Connector_PinHeader_1.27mm:PinHeader_2x05_P1.27mm_Vertical_SMD" H 6550 3000 50  0001 C CNN
F 3 "~" H 6550 3000 50  0001 C CNN
	1    6550 3000
	1    0    0    -1  
$EndComp
Wire Wire Line
	7850 3450 7850 3350
Wire Wire Line
	7950 3450 7850 3450
Wire Wire Line
	7850 3550 7950 3550
Wire Wire Line
	7850 3650 7850 3550
$Comp
L power:GND #PWR036
U 1 1 5F7FEA4E
P 7850 3650
F 0 "#PWR036" H 7850 3400 50  0001 C CNN
F 1 "GND" H 7855 3477 50  0000 C CNN
F 2 "" H 7850 3650 50  0001 C CNN
F 3 "" H 7850 3650 50  0001 C CNN
	1    7850 3650
	1    0    0    -1  
$EndComp
$Comp
L power:VCC #PWR035
U 1 1 5F7FDE5B
P 7850 3350
F 0 "#PWR035" H 7850 3200 50  0001 C CNN
F 1 "VCC" H 7865 3523 50  0000 C CNN
F 2 "" H 7850 3350 50  0001 C CNN
F 3 "" H 7850 3350 50  0001 C CNN
	1    7850 3350
	1    0    0    -1  
$EndComp
$Comp
L Connector:Screw_Terminal_01x02 J5
U 1 1 5F7FD5A2
P 8150 3450
F 0 "J5" H 8230 3442 50  0000 L CNN
F 1 "VIN" H 8230 3351 50  0000 L CNN
F 2 "TerminalBlock_Phoenix:TerminalBlock_Phoenix_MKDS-1,5-2-5.08_1x02_P5.08mm_Horizontal" H 8150 3450 50  0001 C CNN
F 3 "~" H 8150 3450 50  0001 C CNN
	1    8150 3450
	1    0    0    -1  
$EndComp
$Comp
L Device:Jumper_NC_Small JP1
U 1 1 6013B71D
P 8800 1300
F 0 "JP1" V 8800 1100 50  0000 L CNN
F 1 "Jumper_NC_Small" V 8900 600 50  0000 L CNN
F 2 "Connector_PinHeader_2.54mm:PinHeader_1x02_P2.54mm_Vertical" H 8800 1300 50  0001 C CNN
F 3 "~" H 8800 1300 50  0001 C CNN
	1    8800 1300
	0    1    1    0   
$EndComp
$Comp
L Device:R_Small R8
U 1 1 5F9A29FA
P 8800 1550
F 0 "R8" H 8859 1596 50  0000 L CNN
F 1 "120R" H 8859 1505 50  0000 L CNN
F 2 "Resistor_SMD:R_0805_2012Metric_Pad1.15x1.40mm_HandSolder" H 8800 1550 50  0001 C CNN
F 3 "~" H 8800 1550 50  0001 C CNN
F 4 "C17437" H 8800 1550 50  0001 C CNN "LCSC Part #"
	1    8800 1550
	1    0    0    -1  
$EndComp
Wire Wire Line
	8700 1700 8800 1700
Wire Wire Line
	8800 1700 8800 1650
Wire Wire Line
	8800 1450 8800 1400
$Comp
L Connector_Generic:Conn_01x03 J6
U 1 1 601BFA2F
P 8400 2850
F 0 "J6" H 8550 2750 50  0000 C CNN
F 1 "UART4" H 8600 2850 50  0000 C CNN
F 2 "Connector_JST:JST_XH_B3B-XH-A_1x03_P2.50mm_Vertical" H 8400 2850 50  0001 C CNN
F 3 "~" H 8400 2850 50  0001 C CNN
	1    8400 2850
	1    0    0    1   
$EndComp
$Comp
L power:GND #PWR023
U 1 1 601C14F7
P 8150 3000
F 0 "#PWR023" H 8150 2750 50  0001 C CNN
F 1 "GND" H 8155 2827 50  0000 C CNN
F 2 "" H 8150 3000 50  0001 C CNN
F 3 "" H 8150 3000 50  0001 C CNN
	1    8150 3000
	1    0    0    -1  
$EndComp
Wire Wire Line
	8150 3000 8150 2950
Wire Wire Line
	8150 2950 8200 2950
$Comp
L Device:LED_Small D2
U 1 1 5F8C1487
P 5650 1100
F 0 "D2" V 5600 950 50  0000 C CNN
F 1 "Red" V 5700 950 50  0000 C CNN
F 2 "LED_SMD:LED_0603_1608Metric" V 5650 1100 50  0001 C CNN
F 3 "~" V 5650 1100 50  0001 C CNN
F 4 "C2286" H 5650 1100 50  0001 C CNN "LCSC Part #"
	1    5650 1100
	0    -1   -1   0   
$EndComp
Wire Wire Line
	10400 1950 10550 1950
Wire Wire Line
	10750 1950 10900 1950
Connection ~ 3650 3400
Wire Wire Line
	3650 3300 3650 3400
Wire Wire Line
	5650 3800 5250 3800
Wire Wire Line
	5650 3700 5650 3800
Wire Wire Line
	5650 3400 5650 3500
Wire Wire Line
	5250 3400 5650 3400
Connection ~ 5250 3400
Wire Wire Line
	5250 3800 4850 3800
Connection ~ 5250 3800
Wire Wire Line
	5250 3500 5250 3400
Wire Wire Line
	5250 3800 5250 3700
Wire Wire Line
	4850 3800 4450 3800
Connection ~ 4850 3800
Wire Wire Line
	4850 3400 5250 3400
Connection ~ 4850 3400
Wire Wire Line
	4850 3700 4850 3800
Wire Wire Line
	4850 3400 4850 3500
Wire Wire Line
	4450 3800 4050 3800
Connection ~ 4450 3800
Wire Wire Line
	4450 3400 4850 3400
Connection ~ 4450 3400
Wire Wire Line
	4450 3700 4450 3800
Wire Wire Line
	4450 3400 4450 3500
Wire Wire Line
	4050 3800 3650 3800
Connection ~ 4050 3800
Wire Wire Line
	4050 3400 4450 3400
Connection ~ 4050 3400
Wire Wire Line
	4050 3700 4050 3800
Wire Wire Line
	4050 3400 4050 3500
Connection ~ 3650 3800
Wire Wire Line
	3650 3800 3650 3900
Wire Wire Line
	3650 3800 3650 3700
Wire Wire Line
	3650 3400 4050 3400
Wire Wire Line
	3650 3500 3650 3400
$Comp
L power:+3.3V #PWR010
U 1 1 5F70C445
P 3650 3300
F 0 "#PWR010" H 3650 3150 50  0001 C CNN
F 1 "+3.3V" H 3665 3473 50  0000 C CNN
F 2 "" H 3650 3300 50  0001 C CNN
F 3 "" H 3650 3300 50  0001 C CNN
	1    3650 3300
	1    0    0    -1  
$EndComp
$Comp
L power:GND #PWR011
U 1 1 5F70BDD2
P 3650 3900
F 0 "#PWR011" H 3650 3650 50  0001 C CNN
F 1 "GND" H 3655 3727 50  0000 C CNN
F 2 "" H 3650 3900 50  0001 C CNN
F 3 "" H 3650 3900 50  0001 C CNN
	1    3650 3900
	1    0    0    -1  
$EndComp
$Comp
L Device:C_Small C6
U 1 1 5F709E98
P 4050 3600
F 0 "C6" H 4150 3650 50  0000 L CNN
F 1 "100n" H 4150 3550 50  0000 L CNN
F 2 "Capacitor_SMD:C_0603_1608Metric" H 4050 3600 50  0001 C CNN
F 3 "~" H 4050 3600 50  0001 C CNN
F 4 "C14663" H 4050 3600 50  0001 C CNN "LCSC Part #"
	1    4050 3600
	1    0    0    -1  
$EndComp
$Comp
L Device:C_Small C5
U 1 1 5F709E92
P 3650 3600
F 0 "C5" H 3750 3650 50  0000 L CNN
F 1 "100n" H 3750 3550 50  0000 L CNN
F 2 "Capacitor_SMD:C_0603_1608Metric" H 3650 3600 50  0001 C CNN
F 3 "~" H 3650 3600 50  0001 C CNN
F 4 "C14663" H 3650 3600 50  0001 C CNN "LCSC Part #"
	1    3650 3600
	1    0    0    -1  
$EndComp
$Comp
L Device:C_Small C15
U 1 1 5F70824E
P 5650 3600
F 0 "C15" H 5750 3650 50  0000 L CNN
F 1 "4.7u" H 5750 3550 50  0000 L CNN
F 2 "Capacitor_SMD:C_0603_1608Metric" H 5650 3600 50  0001 C CNN
F 3 "~" H 5650 3600 50  0001 C CNN
F 4 "C19666" H 5650 3600 50  0001 C CNN "LCSC Part #"
	1    5650 3600
	1    0    0    -1  
$EndComp
$Comp
L Device:C_Small C14
U 1 1 5F708248
P 5250 3600
F 0 "C14" H 5350 3650 50  0000 L CNN
F 1 "100n" H 5350 3550 50  0000 L CNN
F 2 "Capacitor_SMD:C_0603_1608Metric" H 5250 3600 50  0001 C CNN
F 3 "~" H 5250 3600 50  0001 C CNN
F 4 "C14663" H 5250 3600 50  0001 C CNN "LCSC Part #"
	1    5250 3600
	1    0    0    -1  
$EndComp
$Comp
L Device:C_Small C11
U 1 1 5F705ED1
P 4850 3600
F 0 "C11" H 4950 3650 50  0000 L CNN
F 1 "100n" H 4950 3550 50  0000 L CNN
F 2 "Capacitor_SMD:C_0603_1608Metric" H 4850 3600 50  0001 C CNN
F 3 "~" H 4850 3600 50  0001 C CNN
F 4 "C14663" H 4850 3600 50  0001 C CNN "LCSC Part #"
	1    4850 3600
	1    0    0    -1  
$EndComp
$Comp
L Device:C_Small C8
U 1 1 5F705A50
P 4450 3600
F 0 "C8" H 4550 3650 50  0000 L CNN
F 1 "100n" H 4550 3550 50  0000 L CNN
F 2 "Capacitor_SMD:C_0603_1608Metric" H 4450 3600 50  0001 C CNN
F 3 "~" H 4450 3600 50  0001 C CNN
F 4 "C14663" H 4450 3600 50  0001 C CNN "LCSC Part #"
	1    4450 3600
	1    0    0    -1  
$EndComp
$EndSCHEMATC
