%TF.GenerationSoftware,KiCad,Pcbnew,(5.1.6)-1*%
%TF.CreationDate,2021-01-30T20:05:58+01:00*%
%TF.ProjectId,f405RG_tof_can_custom_pcb,66343035-5247-45f7-946f-665f63616e5f,rev?*%
%TF.SameCoordinates,Original*%
%TF.FileFunction,Paste,Top*%
%TF.FilePolarity,Positive*%
%FSLAX46Y46*%
G04 Gerber Fmt 4.6, Leading zero omitted, Abs format (unit mm)*
G04 Created by KiCad (PCBNEW (5.1.6)-1) date 2021-01-30 20:05:58*
%MOMM*%
%LPD*%
G01*
G04 APERTURE LIST*
%ADD10R,1.500000X2.000000*%
%ADD11R,3.800000X2.000000*%
%ADD12R,0.900000X0.800000*%
%ADD13R,0.740000X2.400000*%
%ADD14R,1.400000X1.200000*%
G04 APERTURE END LIST*
%TO.C,C4*%
G36*
G01*
X110956250Y-88612500D02*
X110043750Y-88612500D01*
G75*
G02*
X109800000Y-88368750I0J243750D01*
G01*
X109800000Y-87881250D01*
G75*
G02*
X110043750Y-87637500I243750J0D01*
G01*
X110956250Y-87637500D01*
G75*
G02*
X111200000Y-87881250I0J-243750D01*
G01*
X111200000Y-88368750D01*
G75*
G02*
X110956250Y-88612500I-243750J0D01*
G01*
G37*
G36*
G01*
X110956250Y-90487500D02*
X110043750Y-90487500D01*
G75*
G02*
X109800000Y-90243750I0J243750D01*
G01*
X109800000Y-89756250D01*
G75*
G02*
X110043750Y-89512500I243750J0D01*
G01*
X110956250Y-89512500D01*
G75*
G02*
X111200000Y-89756250I0J-243750D01*
G01*
X111200000Y-90243750D01*
G75*
G02*
X110956250Y-90487500I-243750J0D01*
G01*
G37*
%TD*%
%TO.C,R1*%
G36*
G01*
X108243750Y-94850000D02*
X108756250Y-94850000D01*
G75*
G02*
X108975000Y-95068750I0J-218750D01*
G01*
X108975000Y-95506250D01*
G75*
G02*
X108756250Y-95725000I-218750J0D01*
G01*
X108243750Y-95725000D01*
G75*
G02*
X108025000Y-95506250I0J218750D01*
G01*
X108025000Y-95068750D01*
G75*
G02*
X108243750Y-94850000I218750J0D01*
G01*
G37*
G36*
G01*
X108243750Y-93275000D02*
X108756250Y-93275000D01*
G75*
G02*
X108975000Y-93493750I0J-218750D01*
G01*
X108975000Y-93931250D01*
G75*
G02*
X108756250Y-94150000I-218750J0D01*
G01*
X108243750Y-94150000D01*
G75*
G02*
X108025000Y-93931250I0J218750D01*
G01*
X108025000Y-93493750D01*
G75*
G02*
X108243750Y-93275000I218750J0D01*
G01*
G37*
%TD*%
%TO.C,U3*%
G36*
G01*
X106975000Y-119850000D02*
X106975000Y-120150000D01*
G75*
G02*
X106825000Y-120300000I-150000J0D01*
G01*
X105175000Y-120300000D01*
G75*
G02*
X105025000Y-120150000I0J150000D01*
G01*
X105025000Y-119850000D01*
G75*
G02*
X105175000Y-119700000I150000J0D01*
G01*
X106825000Y-119700000D01*
G75*
G02*
X106975000Y-119850000I0J-150000D01*
G01*
G37*
G36*
G01*
X106975000Y-118580000D02*
X106975000Y-118880000D01*
G75*
G02*
X106825000Y-119030000I-150000J0D01*
G01*
X105175000Y-119030000D01*
G75*
G02*
X105025000Y-118880000I0J150000D01*
G01*
X105025000Y-118580000D01*
G75*
G02*
X105175000Y-118430000I150000J0D01*
G01*
X106825000Y-118430000D01*
G75*
G02*
X106975000Y-118580000I0J-150000D01*
G01*
G37*
G36*
G01*
X106975000Y-117310000D02*
X106975000Y-117610000D01*
G75*
G02*
X106825000Y-117760000I-150000J0D01*
G01*
X105175000Y-117760000D01*
G75*
G02*
X105025000Y-117610000I0J150000D01*
G01*
X105025000Y-117310000D01*
G75*
G02*
X105175000Y-117160000I150000J0D01*
G01*
X106825000Y-117160000D01*
G75*
G02*
X106975000Y-117310000I0J-150000D01*
G01*
G37*
G36*
G01*
X106975000Y-116040000D02*
X106975000Y-116340000D01*
G75*
G02*
X106825000Y-116490000I-150000J0D01*
G01*
X105175000Y-116490000D01*
G75*
G02*
X105025000Y-116340000I0J150000D01*
G01*
X105025000Y-116040000D01*
G75*
G02*
X105175000Y-115890000I150000J0D01*
G01*
X106825000Y-115890000D01*
G75*
G02*
X106975000Y-116040000I0J-150000D01*
G01*
G37*
G36*
G01*
X111925000Y-116040000D02*
X111925000Y-116340000D01*
G75*
G02*
X111775000Y-116490000I-150000J0D01*
G01*
X110125000Y-116490000D01*
G75*
G02*
X109975000Y-116340000I0J150000D01*
G01*
X109975000Y-116040000D01*
G75*
G02*
X110125000Y-115890000I150000J0D01*
G01*
X111775000Y-115890000D01*
G75*
G02*
X111925000Y-116040000I0J-150000D01*
G01*
G37*
G36*
G01*
X111925000Y-117310000D02*
X111925000Y-117610000D01*
G75*
G02*
X111775000Y-117760000I-150000J0D01*
G01*
X110125000Y-117760000D01*
G75*
G02*
X109975000Y-117610000I0J150000D01*
G01*
X109975000Y-117310000D01*
G75*
G02*
X110125000Y-117160000I150000J0D01*
G01*
X111775000Y-117160000D01*
G75*
G02*
X111925000Y-117310000I0J-150000D01*
G01*
G37*
G36*
G01*
X111925000Y-118580000D02*
X111925000Y-118880000D01*
G75*
G02*
X111775000Y-119030000I-150000J0D01*
G01*
X110125000Y-119030000D01*
G75*
G02*
X109975000Y-118880000I0J150000D01*
G01*
X109975000Y-118580000D01*
G75*
G02*
X110125000Y-118430000I150000J0D01*
G01*
X111775000Y-118430000D01*
G75*
G02*
X111925000Y-118580000I0J-150000D01*
G01*
G37*
G36*
G01*
X111925000Y-119850000D02*
X111925000Y-120150000D01*
G75*
G02*
X111775000Y-120300000I-150000J0D01*
G01*
X110125000Y-120300000D01*
G75*
G02*
X109975000Y-120150000I0J150000D01*
G01*
X109975000Y-119850000D01*
G75*
G02*
X110125000Y-119700000I150000J0D01*
G01*
X111775000Y-119700000D01*
G75*
G02*
X111925000Y-119850000I0J-150000D01*
G01*
G37*
%TD*%
D10*
%TO.C,U2*%
X109300000Y-81850000D03*
X104700000Y-81850000D03*
X107000000Y-81850000D03*
D11*
X107000000Y-88150000D03*
%TD*%
%TO.C,U1*%
G36*
G01*
X129025000Y-128150000D02*
X127625000Y-128150000D01*
G75*
G02*
X127550000Y-128075000I0J75000D01*
G01*
X127550000Y-127925000D01*
G75*
G02*
X127625000Y-127850000I75000J0D01*
G01*
X129025000Y-127850000D01*
G75*
G02*
X129100000Y-127925000I0J-75000D01*
G01*
X129100000Y-128075000D01*
G75*
G02*
X129025000Y-128150000I-75000J0D01*
G01*
G37*
G36*
G01*
X129025000Y-127650000D02*
X127625000Y-127650000D01*
G75*
G02*
X127550000Y-127575000I0J75000D01*
G01*
X127550000Y-127425000D01*
G75*
G02*
X127625000Y-127350000I75000J0D01*
G01*
X129025000Y-127350000D01*
G75*
G02*
X129100000Y-127425000I0J-75000D01*
G01*
X129100000Y-127575000D01*
G75*
G02*
X129025000Y-127650000I-75000J0D01*
G01*
G37*
G36*
G01*
X129025000Y-127150000D02*
X127625000Y-127150000D01*
G75*
G02*
X127550000Y-127075000I0J75000D01*
G01*
X127550000Y-126925000D01*
G75*
G02*
X127625000Y-126850000I75000J0D01*
G01*
X129025000Y-126850000D01*
G75*
G02*
X129100000Y-126925000I0J-75000D01*
G01*
X129100000Y-127075000D01*
G75*
G02*
X129025000Y-127150000I-75000J0D01*
G01*
G37*
G36*
G01*
X129025000Y-126650000D02*
X127625000Y-126650000D01*
G75*
G02*
X127550000Y-126575000I0J75000D01*
G01*
X127550000Y-126425000D01*
G75*
G02*
X127625000Y-126350000I75000J0D01*
G01*
X129025000Y-126350000D01*
G75*
G02*
X129100000Y-126425000I0J-75000D01*
G01*
X129100000Y-126575000D01*
G75*
G02*
X129025000Y-126650000I-75000J0D01*
G01*
G37*
G36*
G01*
X129025000Y-126150000D02*
X127625000Y-126150000D01*
G75*
G02*
X127550000Y-126075000I0J75000D01*
G01*
X127550000Y-125925000D01*
G75*
G02*
X127625000Y-125850000I75000J0D01*
G01*
X129025000Y-125850000D01*
G75*
G02*
X129100000Y-125925000I0J-75000D01*
G01*
X129100000Y-126075000D01*
G75*
G02*
X129025000Y-126150000I-75000J0D01*
G01*
G37*
G36*
G01*
X129025000Y-125650000D02*
X127625000Y-125650000D01*
G75*
G02*
X127550000Y-125575000I0J75000D01*
G01*
X127550000Y-125425000D01*
G75*
G02*
X127625000Y-125350000I75000J0D01*
G01*
X129025000Y-125350000D01*
G75*
G02*
X129100000Y-125425000I0J-75000D01*
G01*
X129100000Y-125575000D01*
G75*
G02*
X129025000Y-125650000I-75000J0D01*
G01*
G37*
G36*
G01*
X129025000Y-125150000D02*
X127625000Y-125150000D01*
G75*
G02*
X127550000Y-125075000I0J75000D01*
G01*
X127550000Y-124925000D01*
G75*
G02*
X127625000Y-124850000I75000J0D01*
G01*
X129025000Y-124850000D01*
G75*
G02*
X129100000Y-124925000I0J-75000D01*
G01*
X129100000Y-125075000D01*
G75*
G02*
X129025000Y-125150000I-75000J0D01*
G01*
G37*
G36*
G01*
X129025000Y-124650000D02*
X127625000Y-124650000D01*
G75*
G02*
X127550000Y-124575000I0J75000D01*
G01*
X127550000Y-124425000D01*
G75*
G02*
X127625000Y-124350000I75000J0D01*
G01*
X129025000Y-124350000D01*
G75*
G02*
X129100000Y-124425000I0J-75000D01*
G01*
X129100000Y-124575000D01*
G75*
G02*
X129025000Y-124650000I-75000J0D01*
G01*
G37*
G36*
G01*
X129025000Y-124150000D02*
X127625000Y-124150000D01*
G75*
G02*
X127550000Y-124075000I0J75000D01*
G01*
X127550000Y-123925000D01*
G75*
G02*
X127625000Y-123850000I75000J0D01*
G01*
X129025000Y-123850000D01*
G75*
G02*
X129100000Y-123925000I0J-75000D01*
G01*
X129100000Y-124075000D01*
G75*
G02*
X129025000Y-124150000I-75000J0D01*
G01*
G37*
G36*
G01*
X129025000Y-123650000D02*
X127625000Y-123650000D01*
G75*
G02*
X127550000Y-123575000I0J75000D01*
G01*
X127550000Y-123425000D01*
G75*
G02*
X127625000Y-123350000I75000J0D01*
G01*
X129025000Y-123350000D01*
G75*
G02*
X129100000Y-123425000I0J-75000D01*
G01*
X129100000Y-123575000D01*
G75*
G02*
X129025000Y-123650000I-75000J0D01*
G01*
G37*
G36*
G01*
X129025000Y-123150000D02*
X127625000Y-123150000D01*
G75*
G02*
X127550000Y-123075000I0J75000D01*
G01*
X127550000Y-122925000D01*
G75*
G02*
X127625000Y-122850000I75000J0D01*
G01*
X129025000Y-122850000D01*
G75*
G02*
X129100000Y-122925000I0J-75000D01*
G01*
X129100000Y-123075000D01*
G75*
G02*
X129025000Y-123150000I-75000J0D01*
G01*
G37*
G36*
G01*
X129025000Y-122650000D02*
X127625000Y-122650000D01*
G75*
G02*
X127550000Y-122575000I0J75000D01*
G01*
X127550000Y-122425000D01*
G75*
G02*
X127625000Y-122350000I75000J0D01*
G01*
X129025000Y-122350000D01*
G75*
G02*
X129100000Y-122425000I0J-75000D01*
G01*
X129100000Y-122575000D01*
G75*
G02*
X129025000Y-122650000I-75000J0D01*
G01*
G37*
G36*
G01*
X129025000Y-122150000D02*
X127625000Y-122150000D01*
G75*
G02*
X127550000Y-122075000I0J75000D01*
G01*
X127550000Y-121925000D01*
G75*
G02*
X127625000Y-121850000I75000J0D01*
G01*
X129025000Y-121850000D01*
G75*
G02*
X129100000Y-121925000I0J-75000D01*
G01*
X129100000Y-122075000D01*
G75*
G02*
X129025000Y-122150000I-75000J0D01*
G01*
G37*
G36*
G01*
X129025000Y-121650000D02*
X127625000Y-121650000D01*
G75*
G02*
X127550000Y-121575000I0J75000D01*
G01*
X127550000Y-121425000D01*
G75*
G02*
X127625000Y-121350000I75000J0D01*
G01*
X129025000Y-121350000D01*
G75*
G02*
X129100000Y-121425000I0J-75000D01*
G01*
X129100000Y-121575000D01*
G75*
G02*
X129025000Y-121650000I-75000J0D01*
G01*
G37*
G36*
G01*
X129025000Y-121150000D02*
X127625000Y-121150000D01*
G75*
G02*
X127550000Y-121075000I0J75000D01*
G01*
X127550000Y-120925000D01*
G75*
G02*
X127625000Y-120850000I75000J0D01*
G01*
X129025000Y-120850000D01*
G75*
G02*
X129100000Y-120925000I0J-75000D01*
G01*
X129100000Y-121075000D01*
G75*
G02*
X129025000Y-121150000I-75000J0D01*
G01*
G37*
G36*
G01*
X129025000Y-120650000D02*
X127625000Y-120650000D01*
G75*
G02*
X127550000Y-120575000I0J75000D01*
G01*
X127550000Y-120425000D01*
G75*
G02*
X127625000Y-120350000I75000J0D01*
G01*
X129025000Y-120350000D01*
G75*
G02*
X129100000Y-120425000I0J-75000D01*
G01*
X129100000Y-120575000D01*
G75*
G02*
X129025000Y-120650000I-75000J0D01*
G01*
G37*
G36*
G01*
X130325000Y-119350000D02*
X130175000Y-119350000D01*
G75*
G02*
X130100000Y-119275000I0J75000D01*
G01*
X130100000Y-117875000D01*
G75*
G02*
X130175000Y-117800000I75000J0D01*
G01*
X130325000Y-117800000D01*
G75*
G02*
X130400000Y-117875000I0J-75000D01*
G01*
X130400000Y-119275000D01*
G75*
G02*
X130325000Y-119350000I-75000J0D01*
G01*
G37*
G36*
G01*
X130825000Y-119350000D02*
X130675000Y-119350000D01*
G75*
G02*
X130600000Y-119275000I0J75000D01*
G01*
X130600000Y-117875000D01*
G75*
G02*
X130675000Y-117800000I75000J0D01*
G01*
X130825000Y-117800000D01*
G75*
G02*
X130900000Y-117875000I0J-75000D01*
G01*
X130900000Y-119275000D01*
G75*
G02*
X130825000Y-119350000I-75000J0D01*
G01*
G37*
G36*
G01*
X131325000Y-119350000D02*
X131175000Y-119350000D01*
G75*
G02*
X131100000Y-119275000I0J75000D01*
G01*
X131100000Y-117875000D01*
G75*
G02*
X131175000Y-117800000I75000J0D01*
G01*
X131325000Y-117800000D01*
G75*
G02*
X131400000Y-117875000I0J-75000D01*
G01*
X131400000Y-119275000D01*
G75*
G02*
X131325000Y-119350000I-75000J0D01*
G01*
G37*
G36*
G01*
X131825000Y-119350000D02*
X131675000Y-119350000D01*
G75*
G02*
X131600000Y-119275000I0J75000D01*
G01*
X131600000Y-117875000D01*
G75*
G02*
X131675000Y-117800000I75000J0D01*
G01*
X131825000Y-117800000D01*
G75*
G02*
X131900000Y-117875000I0J-75000D01*
G01*
X131900000Y-119275000D01*
G75*
G02*
X131825000Y-119350000I-75000J0D01*
G01*
G37*
G36*
G01*
X132325000Y-119350000D02*
X132175000Y-119350000D01*
G75*
G02*
X132100000Y-119275000I0J75000D01*
G01*
X132100000Y-117875000D01*
G75*
G02*
X132175000Y-117800000I75000J0D01*
G01*
X132325000Y-117800000D01*
G75*
G02*
X132400000Y-117875000I0J-75000D01*
G01*
X132400000Y-119275000D01*
G75*
G02*
X132325000Y-119350000I-75000J0D01*
G01*
G37*
G36*
G01*
X132825000Y-119350000D02*
X132675000Y-119350000D01*
G75*
G02*
X132600000Y-119275000I0J75000D01*
G01*
X132600000Y-117875000D01*
G75*
G02*
X132675000Y-117800000I75000J0D01*
G01*
X132825000Y-117800000D01*
G75*
G02*
X132900000Y-117875000I0J-75000D01*
G01*
X132900000Y-119275000D01*
G75*
G02*
X132825000Y-119350000I-75000J0D01*
G01*
G37*
G36*
G01*
X133325000Y-119350000D02*
X133175000Y-119350000D01*
G75*
G02*
X133100000Y-119275000I0J75000D01*
G01*
X133100000Y-117875000D01*
G75*
G02*
X133175000Y-117800000I75000J0D01*
G01*
X133325000Y-117800000D01*
G75*
G02*
X133400000Y-117875000I0J-75000D01*
G01*
X133400000Y-119275000D01*
G75*
G02*
X133325000Y-119350000I-75000J0D01*
G01*
G37*
G36*
G01*
X133825000Y-119350000D02*
X133675000Y-119350000D01*
G75*
G02*
X133600000Y-119275000I0J75000D01*
G01*
X133600000Y-117875000D01*
G75*
G02*
X133675000Y-117800000I75000J0D01*
G01*
X133825000Y-117800000D01*
G75*
G02*
X133900000Y-117875000I0J-75000D01*
G01*
X133900000Y-119275000D01*
G75*
G02*
X133825000Y-119350000I-75000J0D01*
G01*
G37*
G36*
G01*
X134325000Y-119350000D02*
X134175000Y-119350000D01*
G75*
G02*
X134100000Y-119275000I0J75000D01*
G01*
X134100000Y-117875000D01*
G75*
G02*
X134175000Y-117800000I75000J0D01*
G01*
X134325000Y-117800000D01*
G75*
G02*
X134400000Y-117875000I0J-75000D01*
G01*
X134400000Y-119275000D01*
G75*
G02*
X134325000Y-119350000I-75000J0D01*
G01*
G37*
G36*
G01*
X134825000Y-119350000D02*
X134675000Y-119350000D01*
G75*
G02*
X134600000Y-119275000I0J75000D01*
G01*
X134600000Y-117875000D01*
G75*
G02*
X134675000Y-117800000I75000J0D01*
G01*
X134825000Y-117800000D01*
G75*
G02*
X134900000Y-117875000I0J-75000D01*
G01*
X134900000Y-119275000D01*
G75*
G02*
X134825000Y-119350000I-75000J0D01*
G01*
G37*
G36*
G01*
X135325000Y-119350000D02*
X135175000Y-119350000D01*
G75*
G02*
X135100000Y-119275000I0J75000D01*
G01*
X135100000Y-117875000D01*
G75*
G02*
X135175000Y-117800000I75000J0D01*
G01*
X135325000Y-117800000D01*
G75*
G02*
X135400000Y-117875000I0J-75000D01*
G01*
X135400000Y-119275000D01*
G75*
G02*
X135325000Y-119350000I-75000J0D01*
G01*
G37*
G36*
G01*
X135825000Y-119350000D02*
X135675000Y-119350000D01*
G75*
G02*
X135600000Y-119275000I0J75000D01*
G01*
X135600000Y-117875000D01*
G75*
G02*
X135675000Y-117800000I75000J0D01*
G01*
X135825000Y-117800000D01*
G75*
G02*
X135900000Y-117875000I0J-75000D01*
G01*
X135900000Y-119275000D01*
G75*
G02*
X135825000Y-119350000I-75000J0D01*
G01*
G37*
G36*
G01*
X136325000Y-119350000D02*
X136175000Y-119350000D01*
G75*
G02*
X136100000Y-119275000I0J75000D01*
G01*
X136100000Y-117875000D01*
G75*
G02*
X136175000Y-117800000I75000J0D01*
G01*
X136325000Y-117800000D01*
G75*
G02*
X136400000Y-117875000I0J-75000D01*
G01*
X136400000Y-119275000D01*
G75*
G02*
X136325000Y-119350000I-75000J0D01*
G01*
G37*
G36*
G01*
X136825000Y-119350000D02*
X136675000Y-119350000D01*
G75*
G02*
X136600000Y-119275000I0J75000D01*
G01*
X136600000Y-117875000D01*
G75*
G02*
X136675000Y-117800000I75000J0D01*
G01*
X136825000Y-117800000D01*
G75*
G02*
X136900000Y-117875000I0J-75000D01*
G01*
X136900000Y-119275000D01*
G75*
G02*
X136825000Y-119350000I-75000J0D01*
G01*
G37*
G36*
G01*
X137325000Y-119350000D02*
X137175000Y-119350000D01*
G75*
G02*
X137100000Y-119275000I0J75000D01*
G01*
X137100000Y-117875000D01*
G75*
G02*
X137175000Y-117800000I75000J0D01*
G01*
X137325000Y-117800000D01*
G75*
G02*
X137400000Y-117875000I0J-75000D01*
G01*
X137400000Y-119275000D01*
G75*
G02*
X137325000Y-119350000I-75000J0D01*
G01*
G37*
G36*
G01*
X137825000Y-119350000D02*
X137675000Y-119350000D01*
G75*
G02*
X137600000Y-119275000I0J75000D01*
G01*
X137600000Y-117875000D01*
G75*
G02*
X137675000Y-117800000I75000J0D01*
G01*
X137825000Y-117800000D01*
G75*
G02*
X137900000Y-117875000I0J-75000D01*
G01*
X137900000Y-119275000D01*
G75*
G02*
X137825000Y-119350000I-75000J0D01*
G01*
G37*
G36*
G01*
X140375000Y-120650000D02*
X138975000Y-120650000D01*
G75*
G02*
X138900000Y-120575000I0J75000D01*
G01*
X138900000Y-120425000D01*
G75*
G02*
X138975000Y-120350000I75000J0D01*
G01*
X140375000Y-120350000D01*
G75*
G02*
X140450000Y-120425000I0J-75000D01*
G01*
X140450000Y-120575000D01*
G75*
G02*
X140375000Y-120650000I-75000J0D01*
G01*
G37*
G36*
G01*
X140375000Y-121150000D02*
X138975000Y-121150000D01*
G75*
G02*
X138900000Y-121075000I0J75000D01*
G01*
X138900000Y-120925000D01*
G75*
G02*
X138975000Y-120850000I75000J0D01*
G01*
X140375000Y-120850000D01*
G75*
G02*
X140450000Y-120925000I0J-75000D01*
G01*
X140450000Y-121075000D01*
G75*
G02*
X140375000Y-121150000I-75000J0D01*
G01*
G37*
G36*
G01*
X140375000Y-121650000D02*
X138975000Y-121650000D01*
G75*
G02*
X138900000Y-121575000I0J75000D01*
G01*
X138900000Y-121425000D01*
G75*
G02*
X138975000Y-121350000I75000J0D01*
G01*
X140375000Y-121350000D01*
G75*
G02*
X140450000Y-121425000I0J-75000D01*
G01*
X140450000Y-121575000D01*
G75*
G02*
X140375000Y-121650000I-75000J0D01*
G01*
G37*
G36*
G01*
X140375000Y-122150000D02*
X138975000Y-122150000D01*
G75*
G02*
X138900000Y-122075000I0J75000D01*
G01*
X138900000Y-121925000D01*
G75*
G02*
X138975000Y-121850000I75000J0D01*
G01*
X140375000Y-121850000D01*
G75*
G02*
X140450000Y-121925000I0J-75000D01*
G01*
X140450000Y-122075000D01*
G75*
G02*
X140375000Y-122150000I-75000J0D01*
G01*
G37*
G36*
G01*
X140375000Y-122650000D02*
X138975000Y-122650000D01*
G75*
G02*
X138900000Y-122575000I0J75000D01*
G01*
X138900000Y-122425000D01*
G75*
G02*
X138975000Y-122350000I75000J0D01*
G01*
X140375000Y-122350000D01*
G75*
G02*
X140450000Y-122425000I0J-75000D01*
G01*
X140450000Y-122575000D01*
G75*
G02*
X140375000Y-122650000I-75000J0D01*
G01*
G37*
G36*
G01*
X140375000Y-123150000D02*
X138975000Y-123150000D01*
G75*
G02*
X138900000Y-123075000I0J75000D01*
G01*
X138900000Y-122925000D01*
G75*
G02*
X138975000Y-122850000I75000J0D01*
G01*
X140375000Y-122850000D01*
G75*
G02*
X140450000Y-122925000I0J-75000D01*
G01*
X140450000Y-123075000D01*
G75*
G02*
X140375000Y-123150000I-75000J0D01*
G01*
G37*
G36*
G01*
X140375000Y-123650000D02*
X138975000Y-123650000D01*
G75*
G02*
X138900000Y-123575000I0J75000D01*
G01*
X138900000Y-123425000D01*
G75*
G02*
X138975000Y-123350000I75000J0D01*
G01*
X140375000Y-123350000D01*
G75*
G02*
X140450000Y-123425000I0J-75000D01*
G01*
X140450000Y-123575000D01*
G75*
G02*
X140375000Y-123650000I-75000J0D01*
G01*
G37*
G36*
G01*
X140375000Y-124150000D02*
X138975000Y-124150000D01*
G75*
G02*
X138900000Y-124075000I0J75000D01*
G01*
X138900000Y-123925000D01*
G75*
G02*
X138975000Y-123850000I75000J0D01*
G01*
X140375000Y-123850000D01*
G75*
G02*
X140450000Y-123925000I0J-75000D01*
G01*
X140450000Y-124075000D01*
G75*
G02*
X140375000Y-124150000I-75000J0D01*
G01*
G37*
G36*
G01*
X140375000Y-124650000D02*
X138975000Y-124650000D01*
G75*
G02*
X138900000Y-124575000I0J75000D01*
G01*
X138900000Y-124425000D01*
G75*
G02*
X138975000Y-124350000I75000J0D01*
G01*
X140375000Y-124350000D01*
G75*
G02*
X140450000Y-124425000I0J-75000D01*
G01*
X140450000Y-124575000D01*
G75*
G02*
X140375000Y-124650000I-75000J0D01*
G01*
G37*
G36*
G01*
X140375000Y-125150000D02*
X138975000Y-125150000D01*
G75*
G02*
X138900000Y-125075000I0J75000D01*
G01*
X138900000Y-124925000D01*
G75*
G02*
X138975000Y-124850000I75000J0D01*
G01*
X140375000Y-124850000D01*
G75*
G02*
X140450000Y-124925000I0J-75000D01*
G01*
X140450000Y-125075000D01*
G75*
G02*
X140375000Y-125150000I-75000J0D01*
G01*
G37*
G36*
G01*
X140375000Y-125650000D02*
X138975000Y-125650000D01*
G75*
G02*
X138900000Y-125575000I0J75000D01*
G01*
X138900000Y-125425000D01*
G75*
G02*
X138975000Y-125350000I75000J0D01*
G01*
X140375000Y-125350000D01*
G75*
G02*
X140450000Y-125425000I0J-75000D01*
G01*
X140450000Y-125575000D01*
G75*
G02*
X140375000Y-125650000I-75000J0D01*
G01*
G37*
G36*
G01*
X140375000Y-126150000D02*
X138975000Y-126150000D01*
G75*
G02*
X138900000Y-126075000I0J75000D01*
G01*
X138900000Y-125925000D01*
G75*
G02*
X138975000Y-125850000I75000J0D01*
G01*
X140375000Y-125850000D01*
G75*
G02*
X140450000Y-125925000I0J-75000D01*
G01*
X140450000Y-126075000D01*
G75*
G02*
X140375000Y-126150000I-75000J0D01*
G01*
G37*
G36*
G01*
X140375000Y-126650000D02*
X138975000Y-126650000D01*
G75*
G02*
X138900000Y-126575000I0J75000D01*
G01*
X138900000Y-126425000D01*
G75*
G02*
X138975000Y-126350000I75000J0D01*
G01*
X140375000Y-126350000D01*
G75*
G02*
X140450000Y-126425000I0J-75000D01*
G01*
X140450000Y-126575000D01*
G75*
G02*
X140375000Y-126650000I-75000J0D01*
G01*
G37*
G36*
G01*
X140375000Y-127150000D02*
X138975000Y-127150000D01*
G75*
G02*
X138900000Y-127075000I0J75000D01*
G01*
X138900000Y-126925000D01*
G75*
G02*
X138975000Y-126850000I75000J0D01*
G01*
X140375000Y-126850000D01*
G75*
G02*
X140450000Y-126925000I0J-75000D01*
G01*
X140450000Y-127075000D01*
G75*
G02*
X140375000Y-127150000I-75000J0D01*
G01*
G37*
G36*
G01*
X140375000Y-127650000D02*
X138975000Y-127650000D01*
G75*
G02*
X138900000Y-127575000I0J75000D01*
G01*
X138900000Y-127425000D01*
G75*
G02*
X138975000Y-127350000I75000J0D01*
G01*
X140375000Y-127350000D01*
G75*
G02*
X140450000Y-127425000I0J-75000D01*
G01*
X140450000Y-127575000D01*
G75*
G02*
X140375000Y-127650000I-75000J0D01*
G01*
G37*
G36*
G01*
X140375000Y-128150000D02*
X138975000Y-128150000D01*
G75*
G02*
X138900000Y-128075000I0J75000D01*
G01*
X138900000Y-127925000D01*
G75*
G02*
X138975000Y-127850000I75000J0D01*
G01*
X140375000Y-127850000D01*
G75*
G02*
X140450000Y-127925000I0J-75000D01*
G01*
X140450000Y-128075000D01*
G75*
G02*
X140375000Y-128150000I-75000J0D01*
G01*
G37*
G36*
G01*
X137825000Y-130700000D02*
X137675000Y-130700000D01*
G75*
G02*
X137600000Y-130625000I0J75000D01*
G01*
X137600000Y-129225000D01*
G75*
G02*
X137675000Y-129150000I75000J0D01*
G01*
X137825000Y-129150000D01*
G75*
G02*
X137900000Y-129225000I0J-75000D01*
G01*
X137900000Y-130625000D01*
G75*
G02*
X137825000Y-130700000I-75000J0D01*
G01*
G37*
G36*
G01*
X137325000Y-130700000D02*
X137175000Y-130700000D01*
G75*
G02*
X137100000Y-130625000I0J75000D01*
G01*
X137100000Y-129225000D01*
G75*
G02*
X137175000Y-129150000I75000J0D01*
G01*
X137325000Y-129150000D01*
G75*
G02*
X137400000Y-129225000I0J-75000D01*
G01*
X137400000Y-130625000D01*
G75*
G02*
X137325000Y-130700000I-75000J0D01*
G01*
G37*
G36*
G01*
X136825000Y-130700000D02*
X136675000Y-130700000D01*
G75*
G02*
X136600000Y-130625000I0J75000D01*
G01*
X136600000Y-129225000D01*
G75*
G02*
X136675000Y-129150000I75000J0D01*
G01*
X136825000Y-129150000D01*
G75*
G02*
X136900000Y-129225000I0J-75000D01*
G01*
X136900000Y-130625000D01*
G75*
G02*
X136825000Y-130700000I-75000J0D01*
G01*
G37*
G36*
G01*
X136325000Y-130700000D02*
X136175000Y-130700000D01*
G75*
G02*
X136100000Y-130625000I0J75000D01*
G01*
X136100000Y-129225000D01*
G75*
G02*
X136175000Y-129150000I75000J0D01*
G01*
X136325000Y-129150000D01*
G75*
G02*
X136400000Y-129225000I0J-75000D01*
G01*
X136400000Y-130625000D01*
G75*
G02*
X136325000Y-130700000I-75000J0D01*
G01*
G37*
G36*
G01*
X135825000Y-130700000D02*
X135675000Y-130700000D01*
G75*
G02*
X135600000Y-130625000I0J75000D01*
G01*
X135600000Y-129225000D01*
G75*
G02*
X135675000Y-129150000I75000J0D01*
G01*
X135825000Y-129150000D01*
G75*
G02*
X135900000Y-129225000I0J-75000D01*
G01*
X135900000Y-130625000D01*
G75*
G02*
X135825000Y-130700000I-75000J0D01*
G01*
G37*
G36*
G01*
X135325000Y-130700000D02*
X135175000Y-130700000D01*
G75*
G02*
X135100000Y-130625000I0J75000D01*
G01*
X135100000Y-129225000D01*
G75*
G02*
X135175000Y-129150000I75000J0D01*
G01*
X135325000Y-129150000D01*
G75*
G02*
X135400000Y-129225000I0J-75000D01*
G01*
X135400000Y-130625000D01*
G75*
G02*
X135325000Y-130700000I-75000J0D01*
G01*
G37*
G36*
G01*
X134825000Y-130700000D02*
X134675000Y-130700000D01*
G75*
G02*
X134600000Y-130625000I0J75000D01*
G01*
X134600000Y-129225000D01*
G75*
G02*
X134675000Y-129150000I75000J0D01*
G01*
X134825000Y-129150000D01*
G75*
G02*
X134900000Y-129225000I0J-75000D01*
G01*
X134900000Y-130625000D01*
G75*
G02*
X134825000Y-130700000I-75000J0D01*
G01*
G37*
G36*
G01*
X134325000Y-130700000D02*
X134175000Y-130700000D01*
G75*
G02*
X134100000Y-130625000I0J75000D01*
G01*
X134100000Y-129225000D01*
G75*
G02*
X134175000Y-129150000I75000J0D01*
G01*
X134325000Y-129150000D01*
G75*
G02*
X134400000Y-129225000I0J-75000D01*
G01*
X134400000Y-130625000D01*
G75*
G02*
X134325000Y-130700000I-75000J0D01*
G01*
G37*
G36*
G01*
X133825000Y-130700000D02*
X133675000Y-130700000D01*
G75*
G02*
X133600000Y-130625000I0J75000D01*
G01*
X133600000Y-129225000D01*
G75*
G02*
X133675000Y-129150000I75000J0D01*
G01*
X133825000Y-129150000D01*
G75*
G02*
X133900000Y-129225000I0J-75000D01*
G01*
X133900000Y-130625000D01*
G75*
G02*
X133825000Y-130700000I-75000J0D01*
G01*
G37*
G36*
G01*
X133325000Y-130700000D02*
X133175000Y-130700000D01*
G75*
G02*
X133100000Y-130625000I0J75000D01*
G01*
X133100000Y-129225000D01*
G75*
G02*
X133175000Y-129150000I75000J0D01*
G01*
X133325000Y-129150000D01*
G75*
G02*
X133400000Y-129225000I0J-75000D01*
G01*
X133400000Y-130625000D01*
G75*
G02*
X133325000Y-130700000I-75000J0D01*
G01*
G37*
G36*
G01*
X132825000Y-130700000D02*
X132675000Y-130700000D01*
G75*
G02*
X132600000Y-130625000I0J75000D01*
G01*
X132600000Y-129225000D01*
G75*
G02*
X132675000Y-129150000I75000J0D01*
G01*
X132825000Y-129150000D01*
G75*
G02*
X132900000Y-129225000I0J-75000D01*
G01*
X132900000Y-130625000D01*
G75*
G02*
X132825000Y-130700000I-75000J0D01*
G01*
G37*
G36*
G01*
X132325000Y-130700000D02*
X132175000Y-130700000D01*
G75*
G02*
X132100000Y-130625000I0J75000D01*
G01*
X132100000Y-129225000D01*
G75*
G02*
X132175000Y-129150000I75000J0D01*
G01*
X132325000Y-129150000D01*
G75*
G02*
X132400000Y-129225000I0J-75000D01*
G01*
X132400000Y-130625000D01*
G75*
G02*
X132325000Y-130700000I-75000J0D01*
G01*
G37*
G36*
G01*
X131825000Y-130700000D02*
X131675000Y-130700000D01*
G75*
G02*
X131600000Y-130625000I0J75000D01*
G01*
X131600000Y-129225000D01*
G75*
G02*
X131675000Y-129150000I75000J0D01*
G01*
X131825000Y-129150000D01*
G75*
G02*
X131900000Y-129225000I0J-75000D01*
G01*
X131900000Y-130625000D01*
G75*
G02*
X131825000Y-130700000I-75000J0D01*
G01*
G37*
G36*
G01*
X131325000Y-130700000D02*
X131175000Y-130700000D01*
G75*
G02*
X131100000Y-130625000I0J75000D01*
G01*
X131100000Y-129225000D01*
G75*
G02*
X131175000Y-129150000I75000J0D01*
G01*
X131325000Y-129150000D01*
G75*
G02*
X131400000Y-129225000I0J-75000D01*
G01*
X131400000Y-130625000D01*
G75*
G02*
X131325000Y-130700000I-75000J0D01*
G01*
G37*
G36*
G01*
X130825000Y-130700000D02*
X130675000Y-130700000D01*
G75*
G02*
X130600000Y-130625000I0J75000D01*
G01*
X130600000Y-129225000D01*
G75*
G02*
X130675000Y-129150000I75000J0D01*
G01*
X130825000Y-129150000D01*
G75*
G02*
X130900000Y-129225000I0J-75000D01*
G01*
X130900000Y-130625000D01*
G75*
G02*
X130825000Y-130700000I-75000J0D01*
G01*
G37*
G36*
G01*
X130325000Y-130700000D02*
X130175000Y-130700000D01*
G75*
G02*
X130100000Y-130625000I0J75000D01*
G01*
X130100000Y-129225000D01*
G75*
G02*
X130175000Y-129150000I75000J0D01*
G01*
X130325000Y-129150000D01*
G75*
G02*
X130400000Y-129225000I0J-75000D01*
G01*
X130400000Y-130625000D01*
G75*
G02*
X130325000Y-130700000I-75000J0D01*
G01*
G37*
%TD*%
%TO.C,R6*%
G36*
G01*
X107187500Y-125143750D02*
X107187500Y-125656250D01*
G75*
G02*
X106968750Y-125875000I-218750J0D01*
G01*
X106531250Y-125875000D01*
G75*
G02*
X106312500Y-125656250I0J218750D01*
G01*
X106312500Y-125143750D01*
G75*
G02*
X106531250Y-124925000I218750J0D01*
G01*
X106968750Y-124925000D01*
G75*
G02*
X107187500Y-125143750I0J-218750D01*
G01*
G37*
G36*
G01*
X108762500Y-125143750D02*
X108762500Y-125656250D01*
G75*
G02*
X108543750Y-125875000I-218750J0D01*
G01*
X108106250Y-125875000D01*
G75*
G02*
X107887500Y-125656250I0J218750D01*
G01*
X107887500Y-125143750D01*
G75*
G02*
X108106250Y-124925000I218750J0D01*
G01*
X108543750Y-124925000D01*
G75*
G02*
X108762500Y-125143750I0J-218750D01*
G01*
G37*
%TD*%
%TO.C,R5*%
G36*
G01*
X107187500Y-123243750D02*
X107187500Y-123756250D01*
G75*
G02*
X106968750Y-123975000I-218750J0D01*
G01*
X106531250Y-123975000D01*
G75*
G02*
X106312500Y-123756250I0J218750D01*
G01*
X106312500Y-123243750D01*
G75*
G02*
X106531250Y-123025000I218750J0D01*
G01*
X106968750Y-123025000D01*
G75*
G02*
X107187500Y-123243750I0J-218750D01*
G01*
G37*
G36*
G01*
X108762500Y-123243750D02*
X108762500Y-123756250D01*
G75*
G02*
X108543750Y-123975000I-218750J0D01*
G01*
X108106250Y-123975000D01*
G75*
G02*
X107887500Y-123756250I0J218750D01*
G01*
X107887500Y-123243750D01*
G75*
G02*
X108106250Y-123025000I218750J0D01*
G01*
X108543750Y-123025000D01*
G75*
G02*
X108762500Y-123243750I0J-218750D01*
G01*
G37*
%TD*%
%TO.C,R8*%
G36*
G01*
X98225000Y-121450001D02*
X98225000Y-120549999D01*
G75*
G02*
X98474999Y-120300000I249999J0D01*
G01*
X99125001Y-120300000D01*
G75*
G02*
X99375000Y-120549999I0J-249999D01*
G01*
X99375000Y-121450001D01*
G75*
G02*
X99125001Y-121700000I-249999J0D01*
G01*
X98474999Y-121700000D01*
G75*
G02*
X98225000Y-121450001I0J249999D01*
G01*
G37*
G36*
G01*
X96175000Y-121450001D02*
X96175000Y-120549999D01*
G75*
G02*
X96424999Y-120300000I249999J0D01*
G01*
X97075001Y-120300000D01*
G75*
G02*
X97325000Y-120549999I0J-249999D01*
G01*
X97325000Y-121450001D01*
G75*
G02*
X97075001Y-121700000I-249999J0D01*
G01*
X96424999Y-121700000D01*
G75*
G02*
X96175000Y-121450001I0J249999D01*
G01*
G37*
%TD*%
%TO.C,R7*%
G36*
G01*
X103950001Y-120800000D02*
X103049999Y-120800000D01*
G75*
G02*
X102800000Y-120550001I0J249999D01*
G01*
X102800000Y-119899999D01*
G75*
G02*
X103049999Y-119650000I249999J0D01*
G01*
X103950001Y-119650000D01*
G75*
G02*
X104200000Y-119899999I0J-249999D01*
G01*
X104200000Y-120550001D01*
G75*
G02*
X103950001Y-120800000I-249999J0D01*
G01*
G37*
G36*
G01*
X103950001Y-122850000D02*
X103049999Y-122850000D01*
G75*
G02*
X102800000Y-122600001I0J249999D01*
G01*
X102800000Y-121949999D01*
G75*
G02*
X103049999Y-121700000I249999J0D01*
G01*
X103950001Y-121700000D01*
G75*
G02*
X104200000Y-121949999I0J-249999D01*
G01*
X104200000Y-122600001D01*
G75*
G02*
X103950001Y-122850000I-249999J0D01*
G01*
G37*
%TD*%
%TO.C,R4*%
G36*
G01*
X144987500Y-127643750D02*
X144987500Y-128156250D01*
G75*
G02*
X144768750Y-128375000I-218750J0D01*
G01*
X144331250Y-128375000D01*
G75*
G02*
X144112500Y-128156250I0J218750D01*
G01*
X144112500Y-127643750D01*
G75*
G02*
X144331250Y-127425000I218750J0D01*
G01*
X144768750Y-127425000D01*
G75*
G02*
X144987500Y-127643750I0J-218750D01*
G01*
G37*
G36*
G01*
X146562500Y-127643750D02*
X146562500Y-128156250D01*
G75*
G02*
X146343750Y-128375000I-218750J0D01*
G01*
X145906250Y-128375000D01*
G75*
G02*
X145687500Y-128156250I0J218750D01*
G01*
X145687500Y-127643750D01*
G75*
G02*
X145906250Y-127425000I218750J0D01*
G01*
X146343750Y-127425000D01*
G75*
G02*
X146562500Y-127643750I0J-218750D01*
G01*
G37*
%TD*%
%TO.C,R3*%
G36*
G01*
X132993750Y-133137500D02*
X133506250Y-133137500D01*
G75*
G02*
X133725000Y-133356250I0J-218750D01*
G01*
X133725000Y-133793750D01*
G75*
G02*
X133506250Y-134012500I-218750J0D01*
G01*
X132993750Y-134012500D01*
G75*
G02*
X132775000Y-133793750I0J218750D01*
G01*
X132775000Y-133356250D01*
G75*
G02*
X132993750Y-133137500I218750J0D01*
G01*
G37*
G36*
G01*
X132993750Y-131562500D02*
X133506250Y-131562500D01*
G75*
G02*
X133725000Y-131781250I0J-218750D01*
G01*
X133725000Y-132218750D01*
G75*
G02*
X133506250Y-132437500I-218750J0D01*
G01*
X132993750Y-132437500D01*
G75*
G02*
X132775000Y-132218750I0J218750D01*
G01*
X132775000Y-131781250D01*
G75*
G02*
X132993750Y-131562500I218750J0D01*
G01*
G37*
%TD*%
%TO.C,R2*%
G36*
G01*
X122612500Y-129493750D02*
X122612500Y-130006250D01*
G75*
G02*
X122393750Y-130225000I-218750J0D01*
G01*
X121956250Y-130225000D01*
G75*
G02*
X121737500Y-130006250I0J218750D01*
G01*
X121737500Y-129493750D01*
G75*
G02*
X121956250Y-129275000I218750J0D01*
G01*
X122393750Y-129275000D01*
G75*
G02*
X122612500Y-129493750I0J-218750D01*
G01*
G37*
G36*
G01*
X124187500Y-129493750D02*
X124187500Y-130006250D01*
G75*
G02*
X123968750Y-130225000I-218750J0D01*
G01*
X123531250Y-130225000D01*
G75*
G02*
X123312500Y-130006250I0J218750D01*
G01*
X123312500Y-129493750D01*
G75*
G02*
X123531250Y-129275000I218750J0D01*
G01*
X123968750Y-129275000D01*
G75*
G02*
X124187500Y-129493750I0J-218750D01*
G01*
G37*
%TD*%
D12*
%TO.C,Q1*%
X98000000Y-88950000D03*
X100000000Y-88000000D03*
X100000000Y-89900000D03*
%TD*%
D13*
%TO.C,J1*%
X117210000Y-125950000D03*
X117210000Y-122050000D03*
X118480000Y-125950000D03*
X118480000Y-122050000D03*
X119750000Y-125950000D03*
X119750000Y-122050000D03*
X121020000Y-125950000D03*
X121020000Y-122050000D03*
X122290000Y-125950000D03*
X122290000Y-122050000D03*
%TD*%
D14*
%TO.C,HSE1*%
X131150000Y-135750000D03*
X133350000Y-135750000D03*
X133350000Y-137450000D03*
X131150000Y-137450000D03*
%TD*%
%TO.C,FB2*%
G36*
G01*
X140206250Y-131300000D02*
X139293750Y-131300000D01*
G75*
G02*
X139050000Y-131056250I0J243750D01*
G01*
X139050000Y-130568750D01*
G75*
G02*
X139293750Y-130325000I243750J0D01*
G01*
X140206250Y-130325000D01*
G75*
G02*
X140450000Y-130568750I0J-243750D01*
G01*
X140450000Y-131056250D01*
G75*
G02*
X140206250Y-131300000I-243750J0D01*
G01*
G37*
G36*
G01*
X140206250Y-133175000D02*
X139293750Y-133175000D01*
G75*
G02*
X139050000Y-132931250I0J243750D01*
G01*
X139050000Y-132443750D01*
G75*
G02*
X139293750Y-132200000I243750J0D01*
G01*
X140206250Y-132200000D01*
G75*
G02*
X140450000Y-132443750I0J-243750D01*
G01*
X140450000Y-132931250D01*
G75*
G02*
X140206250Y-133175000I-243750J0D01*
G01*
G37*
%TD*%
%TO.C,FB1*%
G36*
G01*
X101543750Y-88512500D02*
X102456250Y-88512500D01*
G75*
G02*
X102700000Y-88756250I0J-243750D01*
G01*
X102700000Y-89243750D01*
G75*
G02*
X102456250Y-89487500I-243750J0D01*
G01*
X101543750Y-89487500D01*
G75*
G02*
X101300000Y-89243750I0J243750D01*
G01*
X101300000Y-88756250D01*
G75*
G02*
X101543750Y-88512500I243750J0D01*
G01*
G37*
G36*
G01*
X101543750Y-86637500D02*
X102456250Y-86637500D01*
G75*
G02*
X102700000Y-86881250I0J-243750D01*
G01*
X102700000Y-87368750D01*
G75*
G02*
X102456250Y-87612500I-243750J0D01*
G01*
X101543750Y-87612500D01*
G75*
G02*
X101300000Y-87368750I0J243750D01*
G01*
X101300000Y-86881250D01*
G75*
G02*
X101543750Y-86637500I243750J0D01*
G01*
G37*
%TD*%
%TO.C,F1*%
G36*
G01*
X95625000Y-88225000D02*
X94375000Y-88225000D01*
G75*
G02*
X94125000Y-87975000I0J250000D01*
G01*
X94125000Y-87050000D01*
G75*
G02*
X94375000Y-86800000I250000J0D01*
G01*
X95625000Y-86800000D01*
G75*
G02*
X95875000Y-87050000I0J-250000D01*
G01*
X95875000Y-87975000D01*
G75*
G02*
X95625000Y-88225000I-250000J0D01*
G01*
G37*
G36*
G01*
X95625000Y-91200000D02*
X94375000Y-91200000D01*
G75*
G02*
X94125000Y-90950000I0J250000D01*
G01*
X94125000Y-90025000D01*
G75*
G02*
X94375000Y-89775000I250000J0D01*
G01*
X95625000Y-89775000D01*
G75*
G02*
X95875000Y-90025000I0J-250000D01*
G01*
X95875000Y-90950000D01*
G75*
G02*
X95625000Y-91200000I-250000J0D01*
G01*
G37*
%TD*%
%TO.C,D4*%
G36*
G01*
X111562500Y-125656250D02*
X111562500Y-125143750D01*
G75*
G02*
X111781250Y-124925000I218750J0D01*
G01*
X112218750Y-124925000D01*
G75*
G02*
X112437500Y-125143750I0J-218750D01*
G01*
X112437500Y-125656250D01*
G75*
G02*
X112218750Y-125875000I-218750J0D01*
G01*
X111781250Y-125875000D01*
G75*
G02*
X111562500Y-125656250I0J218750D01*
G01*
G37*
G36*
G01*
X109987500Y-125656250D02*
X109987500Y-125143750D01*
G75*
G02*
X110206250Y-124925000I218750J0D01*
G01*
X110643750Y-124925000D01*
G75*
G02*
X110862500Y-125143750I0J-218750D01*
G01*
X110862500Y-125656250D01*
G75*
G02*
X110643750Y-125875000I-218750J0D01*
G01*
X110206250Y-125875000D01*
G75*
G02*
X109987500Y-125656250I0J218750D01*
G01*
G37*
%TD*%
%TO.C,D3*%
G36*
G01*
X109962500Y-123756250D02*
X109962500Y-123243750D01*
G75*
G02*
X110181250Y-123025000I218750J0D01*
G01*
X110618750Y-123025000D01*
G75*
G02*
X110837500Y-123243750I0J-218750D01*
G01*
X110837500Y-123756250D01*
G75*
G02*
X110618750Y-123975000I-218750J0D01*
G01*
X110181250Y-123975000D01*
G75*
G02*
X109962500Y-123756250I0J218750D01*
G01*
G37*
G36*
G01*
X111537500Y-123756250D02*
X111537500Y-123243750D01*
G75*
G02*
X111756250Y-123025000I218750J0D01*
G01*
X112193750Y-123025000D01*
G75*
G02*
X112412500Y-123243750I0J-218750D01*
G01*
X112412500Y-123756250D01*
G75*
G02*
X112193750Y-123975000I-218750J0D01*
G01*
X111756250Y-123975000D01*
G75*
G02*
X111537500Y-123756250I0J218750D01*
G01*
G37*
%TD*%
%TO.C,D2*%
G36*
G01*
X145012500Y-125893750D02*
X145012500Y-126406250D01*
G75*
G02*
X144793750Y-126625000I-218750J0D01*
G01*
X144356250Y-126625000D01*
G75*
G02*
X144137500Y-126406250I0J218750D01*
G01*
X144137500Y-125893750D01*
G75*
G02*
X144356250Y-125675000I218750J0D01*
G01*
X144793750Y-125675000D01*
G75*
G02*
X145012500Y-125893750I0J-218750D01*
G01*
G37*
G36*
G01*
X146587500Y-125893750D02*
X146587500Y-126406250D01*
G75*
G02*
X146368750Y-126625000I-218750J0D01*
G01*
X145931250Y-126625000D01*
G75*
G02*
X145712500Y-126406250I0J218750D01*
G01*
X145712500Y-125893750D01*
G75*
G02*
X145931250Y-125675000I218750J0D01*
G01*
X146368750Y-125675000D01*
G75*
G02*
X146587500Y-125893750I0J-218750D01*
G01*
G37*
%TD*%
%TO.C,D1*%
G36*
G01*
X106262500Y-94850000D02*
X106737500Y-94850000D01*
G75*
G02*
X106975000Y-95087500I0J-237500D01*
G01*
X106975000Y-95662500D01*
G75*
G02*
X106737500Y-95900000I-237500J0D01*
G01*
X106262500Y-95900000D01*
G75*
G02*
X106025000Y-95662500I0J237500D01*
G01*
X106025000Y-95087500D01*
G75*
G02*
X106262500Y-94850000I237500J0D01*
G01*
G37*
G36*
G01*
X106262500Y-93100000D02*
X106737500Y-93100000D01*
G75*
G02*
X106975000Y-93337500I0J-237500D01*
G01*
X106975000Y-93912500D01*
G75*
G02*
X106737500Y-94150000I-237500J0D01*
G01*
X106262500Y-94150000D01*
G75*
G02*
X106025000Y-93912500I0J237500D01*
G01*
X106025000Y-93337500D01*
G75*
G02*
X106262500Y-93100000I237500J0D01*
G01*
G37*
%TD*%
%TO.C,C16*%
G36*
G01*
X115256250Y-123612500D02*
X114743750Y-123612500D01*
G75*
G02*
X114525000Y-123393750I0J218750D01*
G01*
X114525000Y-122956250D01*
G75*
G02*
X114743750Y-122737500I218750J0D01*
G01*
X115256250Y-122737500D01*
G75*
G02*
X115475000Y-122956250I0J-218750D01*
G01*
X115475000Y-123393750D01*
G75*
G02*
X115256250Y-123612500I-218750J0D01*
G01*
G37*
G36*
G01*
X115256250Y-125187500D02*
X114743750Y-125187500D01*
G75*
G02*
X114525000Y-124968750I0J218750D01*
G01*
X114525000Y-124531250D01*
G75*
G02*
X114743750Y-124312500I218750J0D01*
G01*
X115256250Y-124312500D01*
G75*
G02*
X115475000Y-124531250I0J-218750D01*
G01*
X115475000Y-124968750D01*
G75*
G02*
X115256250Y-125187500I-218750J0D01*
G01*
G37*
%TD*%
%TO.C,C17*%
G36*
G01*
X113743750Y-118350000D02*
X114256250Y-118350000D01*
G75*
G02*
X114475000Y-118568750I0J-218750D01*
G01*
X114475000Y-119006250D01*
G75*
G02*
X114256250Y-119225000I-218750J0D01*
G01*
X113743750Y-119225000D01*
G75*
G02*
X113525000Y-119006250I0J218750D01*
G01*
X113525000Y-118568750D01*
G75*
G02*
X113743750Y-118350000I218750J0D01*
G01*
G37*
G36*
G01*
X113743750Y-116775000D02*
X114256250Y-116775000D01*
G75*
G02*
X114475000Y-116993750I0J-218750D01*
G01*
X114475000Y-117431250D01*
G75*
G02*
X114256250Y-117650000I-218750J0D01*
G01*
X113743750Y-117650000D01*
G75*
G02*
X113525000Y-117431250I0J218750D01*
G01*
X113525000Y-116993750D01*
G75*
G02*
X113743750Y-116775000I218750J0D01*
G01*
G37*
%TD*%
%TO.C,C15*%
G36*
G01*
X143237500Y-118106250D02*
X143237500Y-117593750D01*
G75*
G02*
X143456250Y-117375000I218750J0D01*
G01*
X143893750Y-117375000D01*
G75*
G02*
X144112500Y-117593750I0J-218750D01*
G01*
X144112500Y-118106250D01*
G75*
G02*
X143893750Y-118325000I-218750J0D01*
G01*
X143456250Y-118325000D01*
G75*
G02*
X143237500Y-118106250I0J218750D01*
G01*
G37*
G36*
G01*
X141662500Y-118106250D02*
X141662500Y-117593750D01*
G75*
G02*
X141881250Y-117375000I218750J0D01*
G01*
X142318750Y-117375000D01*
G75*
G02*
X142537500Y-117593750I0J-218750D01*
G01*
X142537500Y-118106250D01*
G75*
G02*
X142318750Y-118325000I-218750J0D01*
G01*
X141881250Y-118325000D01*
G75*
G02*
X141662500Y-118106250I0J218750D01*
G01*
G37*
%TD*%
%TO.C,C14*%
G36*
G01*
X126506250Y-127187500D02*
X125993750Y-127187500D01*
G75*
G02*
X125775000Y-126968750I0J218750D01*
G01*
X125775000Y-126531250D01*
G75*
G02*
X125993750Y-126312500I218750J0D01*
G01*
X126506250Y-126312500D01*
G75*
G02*
X126725000Y-126531250I0J-218750D01*
G01*
X126725000Y-126968750D01*
G75*
G02*
X126506250Y-127187500I-218750J0D01*
G01*
G37*
G36*
G01*
X126506250Y-128762500D02*
X125993750Y-128762500D01*
G75*
G02*
X125775000Y-128543750I0J218750D01*
G01*
X125775000Y-128106250D01*
G75*
G02*
X125993750Y-127887500I218750J0D01*
G01*
X126506250Y-127887500D01*
G75*
G02*
X126725000Y-128106250I0J-218750D01*
G01*
X126725000Y-128543750D01*
G75*
G02*
X126506250Y-128762500I-218750J0D01*
G01*
G37*
%TD*%
%TO.C,C13*%
G36*
G01*
X136187500Y-131743750D02*
X136187500Y-132256250D01*
G75*
G02*
X135968750Y-132475000I-218750J0D01*
G01*
X135531250Y-132475000D01*
G75*
G02*
X135312500Y-132256250I0J218750D01*
G01*
X135312500Y-131743750D01*
G75*
G02*
X135531250Y-131525000I218750J0D01*
G01*
X135968750Y-131525000D01*
G75*
G02*
X136187500Y-131743750I0J-218750D01*
G01*
G37*
G36*
G01*
X137762500Y-131743750D02*
X137762500Y-132256250D01*
G75*
G02*
X137543750Y-132475000I-218750J0D01*
G01*
X137106250Y-132475000D01*
G75*
G02*
X136887500Y-132256250I0J218750D01*
G01*
X136887500Y-131743750D01*
G75*
G02*
X137106250Y-131525000I218750J0D01*
G01*
X137543750Y-131525000D01*
G75*
G02*
X137762500Y-131743750I0J-218750D01*
G01*
G37*
%TD*%
%TO.C,C11*%
G36*
G01*
X127612500Y-117743750D02*
X127612500Y-118256250D01*
G75*
G02*
X127393750Y-118475000I-218750J0D01*
G01*
X126956250Y-118475000D01*
G75*
G02*
X126737500Y-118256250I0J218750D01*
G01*
X126737500Y-117743750D01*
G75*
G02*
X126956250Y-117525000I218750J0D01*
G01*
X127393750Y-117525000D01*
G75*
G02*
X127612500Y-117743750I0J-218750D01*
G01*
G37*
G36*
G01*
X129187500Y-117743750D02*
X129187500Y-118256250D01*
G75*
G02*
X128968750Y-118475000I-218750J0D01*
G01*
X128531250Y-118475000D01*
G75*
G02*
X128312500Y-118256250I0J218750D01*
G01*
X128312500Y-117743750D01*
G75*
G02*
X128531250Y-117525000I218750J0D01*
G01*
X128968750Y-117525000D01*
G75*
G02*
X129187500Y-117743750I0J-218750D01*
G01*
G37*
%TD*%
%TO.C,C10*%
G36*
G01*
X136187500Y-133493750D02*
X136187500Y-134006250D01*
G75*
G02*
X135968750Y-134225000I-218750J0D01*
G01*
X135531250Y-134225000D01*
G75*
G02*
X135312500Y-134006250I0J218750D01*
G01*
X135312500Y-133493750D01*
G75*
G02*
X135531250Y-133275000I218750J0D01*
G01*
X135968750Y-133275000D01*
G75*
G02*
X136187500Y-133493750I0J-218750D01*
G01*
G37*
G36*
G01*
X137762500Y-133493750D02*
X137762500Y-134006250D01*
G75*
G02*
X137543750Y-134225000I-218750J0D01*
G01*
X137106250Y-134225000D01*
G75*
G02*
X136887500Y-134006250I0J218750D01*
G01*
X136887500Y-133493750D01*
G75*
G02*
X137106250Y-133275000I218750J0D01*
G01*
X137543750Y-133275000D01*
G75*
G02*
X137762500Y-133493750I0J-218750D01*
G01*
G37*
%TD*%
%TO.C,C12*%
G36*
G01*
X101743750Y-134137500D02*
X102256250Y-134137500D01*
G75*
G02*
X102475000Y-134356250I0J-218750D01*
G01*
X102475000Y-134793750D01*
G75*
G02*
X102256250Y-135012500I-218750J0D01*
G01*
X101743750Y-135012500D01*
G75*
G02*
X101525000Y-134793750I0J218750D01*
G01*
X101525000Y-134356250D01*
G75*
G02*
X101743750Y-134137500I218750J0D01*
G01*
G37*
G36*
G01*
X101743750Y-132562500D02*
X102256250Y-132562500D01*
G75*
G02*
X102475000Y-132781250I0J-218750D01*
G01*
X102475000Y-133218750D01*
G75*
G02*
X102256250Y-133437500I-218750J0D01*
G01*
X101743750Y-133437500D01*
G75*
G02*
X101525000Y-133218750I0J218750D01*
G01*
X101525000Y-132781250D01*
G75*
G02*
X101743750Y-132562500I218750J0D01*
G01*
G37*
%TD*%
%TO.C,C9*%
G36*
G01*
X135093750Y-136562500D02*
X135606250Y-136562500D01*
G75*
G02*
X135825000Y-136781250I0J-218750D01*
G01*
X135825000Y-137218750D01*
G75*
G02*
X135606250Y-137437500I-218750J0D01*
G01*
X135093750Y-137437500D01*
G75*
G02*
X134875000Y-137218750I0J218750D01*
G01*
X134875000Y-136781250D01*
G75*
G02*
X135093750Y-136562500I218750J0D01*
G01*
G37*
G36*
G01*
X135093750Y-134987500D02*
X135606250Y-134987500D01*
G75*
G02*
X135825000Y-135206250I0J-218750D01*
G01*
X135825000Y-135643750D01*
G75*
G02*
X135606250Y-135862500I-218750J0D01*
G01*
X135093750Y-135862500D01*
G75*
G02*
X134875000Y-135643750I0J218750D01*
G01*
X134875000Y-135206250D01*
G75*
G02*
X135093750Y-134987500I218750J0D01*
G01*
G37*
%TD*%
%TO.C,C8*%
G36*
G01*
X143250000Y-119906250D02*
X143250000Y-119393750D01*
G75*
G02*
X143468750Y-119175000I218750J0D01*
G01*
X143906250Y-119175000D01*
G75*
G02*
X144125000Y-119393750I0J-218750D01*
G01*
X144125000Y-119906250D01*
G75*
G02*
X143906250Y-120125000I-218750J0D01*
G01*
X143468750Y-120125000D01*
G75*
G02*
X143250000Y-119906250I0J218750D01*
G01*
G37*
G36*
G01*
X141675000Y-119906250D02*
X141675000Y-119393750D01*
G75*
G02*
X141893750Y-119175000I218750J0D01*
G01*
X142331250Y-119175000D01*
G75*
G02*
X142550000Y-119393750I0J-218750D01*
G01*
X142550000Y-119906250D01*
G75*
G02*
X142331250Y-120125000I-218750J0D01*
G01*
X141893750Y-120125000D01*
G75*
G02*
X141675000Y-119906250I0J218750D01*
G01*
G37*
%TD*%
%TO.C,C7*%
G36*
G01*
X129356250Y-136612500D02*
X128843750Y-136612500D01*
G75*
G02*
X128625000Y-136393750I0J218750D01*
G01*
X128625000Y-135956250D01*
G75*
G02*
X128843750Y-135737500I218750J0D01*
G01*
X129356250Y-135737500D01*
G75*
G02*
X129575000Y-135956250I0J-218750D01*
G01*
X129575000Y-136393750D01*
G75*
G02*
X129356250Y-136612500I-218750J0D01*
G01*
G37*
G36*
G01*
X129356250Y-138187500D02*
X128843750Y-138187500D01*
G75*
G02*
X128625000Y-137968750I0J218750D01*
G01*
X128625000Y-137531250D01*
G75*
G02*
X128843750Y-137312500I218750J0D01*
G01*
X129356250Y-137312500D01*
G75*
G02*
X129575000Y-137531250I0J-218750D01*
G01*
X129575000Y-137968750D01*
G75*
G02*
X129356250Y-138187500I-218750J0D01*
G01*
G37*
%TD*%
%TO.C,C6*%
G36*
G01*
X141743750Y-127387500D02*
X142256250Y-127387500D01*
G75*
G02*
X142475000Y-127606250I0J-218750D01*
G01*
X142475000Y-128043750D01*
G75*
G02*
X142256250Y-128262500I-218750J0D01*
G01*
X141743750Y-128262500D01*
G75*
G02*
X141525000Y-128043750I0J218750D01*
G01*
X141525000Y-127606250D01*
G75*
G02*
X141743750Y-127387500I218750J0D01*
G01*
G37*
G36*
G01*
X141743750Y-125812500D02*
X142256250Y-125812500D01*
G75*
G02*
X142475000Y-126031250I0J-218750D01*
G01*
X142475000Y-126468750D01*
G75*
G02*
X142256250Y-126687500I-218750J0D01*
G01*
X141743750Y-126687500D01*
G75*
G02*
X141525000Y-126468750I0J218750D01*
G01*
X141525000Y-126031250D01*
G75*
G02*
X141743750Y-125812500I218750J0D01*
G01*
G37*
%TD*%
%TO.C,C5*%
G36*
G01*
X128862500Y-131993750D02*
X128862500Y-132506250D01*
G75*
G02*
X128643750Y-132725000I-218750J0D01*
G01*
X128206250Y-132725000D01*
G75*
G02*
X127987500Y-132506250I0J218750D01*
G01*
X127987500Y-131993750D01*
G75*
G02*
X128206250Y-131775000I218750J0D01*
G01*
X128643750Y-131775000D01*
G75*
G02*
X128862500Y-131993750I0J-218750D01*
G01*
G37*
G36*
G01*
X130437500Y-131993750D02*
X130437500Y-132506250D01*
G75*
G02*
X130218750Y-132725000I-218750J0D01*
G01*
X129781250Y-132725000D01*
G75*
G02*
X129562500Y-132506250I0J218750D01*
G01*
X129562500Y-131993750D01*
G75*
G02*
X129781250Y-131775000I218750J0D01*
G01*
X130218750Y-131775000D01*
G75*
G02*
X130437500Y-131993750I0J-218750D01*
G01*
G37*
%TD*%
%TO.C,C3*%
G36*
G01*
X102456250Y-83487500D02*
X101543750Y-83487500D01*
G75*
G02*
X101300000Y-83243750I0J243750D01*
G01*
X101300000Y-82756250D01*
G75*
G02*
X101543750Y-82512500I243750J0D01*
G01*
X102456250Y-82512500D01*
G75*
G02*
X102700000Y-82756250I0J-243750D01*
G01*
X102700000Y-83243750D01*
G75*
G02*
X102456250Y-83487500I-243750J0D01*
G01*
G37*
G36*
G01*
X102456250Y-85362500D02*
X101543750Y-85362500D01*
G75*
G02*
X101300000Y-85118750I0J243750D01*
G01*
X101300000Y-84631250D01*
G75*
G02*
X101543750Y-84387500I243750J0D01*
G01*
X102456250Y-84387500D01*
G75*
G02*
X102700000Y-84631250I0J-243750D01*
G01*
X102700000Y-85118750D01*
G75*
G02*
X102456250Y-85362500I-243750J0D01*
G01*
G37*
%TD*%
%TO.C,C2*%
G36*
G01*
X128900000Y-115993750D02*
X128900000Y-116506250D01*
G75*
G02*
X128681250Y-116725000I-218750J0D01*
G01*
X128243750Y-116725000D01*
G75*
G02*
X128025000Y-116506250I0J218750D01*
G01*
X128025000Y-115993750D01*
G75*
G02*
X128243750Y-115775000I218750J0D01*
G01*
X128681250Y-115775000D01*
G75*
G02*
X128900000Y-115993750I0J-218750D01*
G01*
G37*
G36*
G01*
X130475000Y-115993750D02*
X130475000Y-116506250D01*
G75*
G02*
X130256250Y-116725000I-218750J0D01*
G01*
X129818750Y-116725000D01*
G75*
G02*
X129600000Y-116506250I0J218750D01*
G01*
X129600000Y-115993750D01*
G75*
G02*
X129818750Y-115775000I218750J0D01*
G01*
X130256250Y-115775000D01*
G75*
G02*
X130475000Y-115993750I0J-218750D01*
G01*
G37*
%TD*%
%TO.C,C1*%
G36*
G01*
X143250000Y-121706250D02*
X143250000Y-121193750D01*
G75*
G02*
X143468750Y-120975000I218750J0D01*
G01*
X143906250Y-120975000D01*
G75*
G02*
X144125000Y-121193750I0J-218750D01*
G01*
X144125000Y-121706250D01*
G75*
G02*
X143906250Y-121925000I-218750J0D01*
G01*
X143468750Y-121925000D01*
G75*
G02*
X143250000Y-121706250I0J218750D01*
G01*
G37*
G36*
G01*
X141675000Y-121706250D02*
X141675000Y-121193750D01*
G75*
G02*
X141893750Y-120975000I218750J0D01*
G01*
X142331250Y-120975000D01*
G75*
G02*
X142550000Y-121193750I0J-218750D01*
G01*
X142550000Y-121706250D01*
G75*
G02*
X142331250Y-121925000I-218750J0D01*
G01*
X141893750Y-121925000D01*
G75*
G02*
X141675000Y-121706250I0J218750D01*
G01*
G37*
%TD*%
M02*
