%TF.GenerationSoftware,KiCad,Pcbnew,(5.1.6)-1*%
%TF.CreationDate,2021-01-30T20:05:59+01:00*%
%TF.ProjectId,f405RG_tof_can_custom_pcb,66343035-5247-45f7-946f-665f63616e5f,rev?*%
%TF.SameCoordinates,Original*%
%TF.FileFunction,Legend,Bot*%
%TF.FilePolarity,Positive*%
%FSLAX46Y46*%
G04 Gerber Fmt 4.6, Leading zero omitted, Abs format (unit mm)*
G04 Created by KiCad (PCBNEW (5.1.6)-1) date 2021-01-30 20:05:59*
%MOMM*%
%LPD*%
G01*
G04 APERTURE LIST*
%ADD10C,0.150000*%
%ADD11C,0.120000*%
G04 APERTURE END LIST*
D10*
X138392976Y-80928571D02*
X138059642Y-80928571D01*
X137982261Y-81452380D02*
X138458452Y-81452380D01*
X138333452Y-80452380D01*
X137857261Y-80452380D01*
X137541785Y-81357142D02*
X137500119Y-81404761D01*
X137553690Y-81452380D01*
X137595357Y-81404761D01*
X137541785Y-81357142D01*
X137553690Y-81452380D01*
X136315595Y-81452380D02*
X136190595Y-80452380D01*
X135946547Y-81166666D01*
X135523928Y-80452380D01*
X135648928Y-81452380D01*
X135107261Y-80928571D02*
X134773928Y-80928571D01*
X134696547Y-81452380D02*
X135172738Y-81452380D01*
X135047738Y-80452380D01*
X134571547Y-80452380D01*
X134309642Y-81404761D02*
X134172738Y-81452380D01*
X133934642Y-81452380D01*
X133833452Y-81404761D01*
X133779880Y-81357142D01*
X133720357Y-81261904D01*
X133708452Y-81166666D01*
X133744166Y-81071428D01*
X133785833Y-81023809D01*
X133875119Y-80976190D01*
X134059642Y-80928571D01*
X134148928Y-80880952D01*
X134190595Y-80833333D01*
X134226309Y-80738095D01*
X134214404Y-80642857D01*
X134154880Y-80547619D01*
X134101309Y-80500000D01*
X134000119Y-80452380D01*
X133762023Y-80452380D01*
X133625119Y-80500000D01*
X133357261Y-81404761D02*
X133220357Y-81452380D01*
X132982261Y-81452380D01*
X132881071Y-81404761D01*
X132827500Y-81357142D01*
X132767976Y-81261904D01*
X132756071Y-81166666D01*
X132791785Y-81071428D01*
X132833452Y-81023809D01*
X132922738Y-80976190D01*
X133107261Y-80928571D01*
X133196547Y-80880952D01*
X133238214Y-80833333D01*
X133273928Y-80738095D01*
X133262023Y-80642857D01*
X133202500Y-80547619D01*
X133148928Y-80500000D01*
X133047738Y-80452380D01*
X132809642Y-80452380D01*
X132672738Y-80500000D01*
X132375119Y-81166666D02*
X131898928Y-81166666D01*
X132506071Y-81452380D02*
X132047738Y-80452380D01*
X131839404Y-81452380D01*
X130934642Y-81452380D02*
X131208452Y-80976190D01*
X131506071Y-81452380D02*
X131381071Y-80452380D01*
X131000119Y-80452380D01*
X130910833Y-80500000D01*
X130869166Y-80547619D01*
X130833452Y-80642857D01*
X130851309Y-80785714D01*
X130910833Y-80880952D01*
X130964404Y-80928571D01*
X131065595Y-80976190D01*
X131446547Y-80976190D01*
X130517976Y-81166666D02*
X130041785Y-81166666D01*
X130648928Y-81452380D02*
X130190595Y-80452380D01*
X129982261Y-81452380D01*
X128690595Y-81785714D02*
X128512023Y-80357142D01*
X126773928Y-80928571D02*
X127107261Y-80928571D01*
X127172738Y-81452380D02*
X127047738Y-80452380D01*
X126571547Y-80452380D01*
X126250119Y-80928571D02*
X125916785Y-80928571D01*
X125839404Y-81452380D02*
X126315595Y-81452380D01*
X126190595Y-80452380D01*
X125714404Y-80452380D01*
X125012023Y-80928571D02*
X124875119Y-80976190D01*
X124833452Y-81023809D01*
X124797738Y-81119047D01*
X124815595Y-81261904D01*
X124875119Y-81357142D01*
X124928690Y-81404761D01*
X125029880Y-81452380D01*
X125410833Y-81452380D01*
X125285833Y-80452380D01*
X124952500Y-80452380D01*
X124863214Y-80500000D01*
X124821547Y-80547619D01*
X124785833Y-80642857D01*
X124797738Y-80738095D01*
X124857261Y-80833333D01*
X124910833Y-80880952D01*
X125012023Y-80928571D01*
X125345357Y-80928571D01*
X123583452Y-80547619D02*
X123529880Y-80500000D01*
X123428690Y-80452380D01*
X123190595Y-80452380D01*
X123101309Y-80500000D01*
X123059642Y-80547619D01*
X123023928Y-80642857D01*
X123035833Y-80738095D01*
X123101309Y-80880952D01*
X123744166Y-81452380D01*
X123125119Y-81452380D01*
X122381071Y-80452380D02*
X122285833Y-80452380D01*
X122196547Y-80500000D01*
X122154880Y-80547619D01*
X122119166Y-80642857D01*
X122095357Y-80833333D01*
X122125119Y-81071428D01*
X122196547Y-81261904D01*
X122256071Y-81357142D01*
X122309642Y-81404761D01*
X122410833Y-81452380D01*
X122506071Y-81452380D01*
X122595357Y-81404761D01*
X122637023Y-81357142D01*
X122672738Y-81261904D01*
X122696547Y-81071428D01*
X122666785Y-80833333D01*
X122595357Y-80642857D01*
X122535833Y-80547619D01*
X122482261Y-80500000D01*
X122381071Y-80452380D01*
X121678690Y-80547619D02*
X121625119Y-80500000D01*
X121523928Y-80452380D01*
X121285833Y-80452380D01*
X121196547Y-80500000D01*
X121154880Y-80547619D01*
X121119166Y-80642857D01*
X121131071Y-80738095D01*
X121196547Y-80880952D01*
X121839404Y-81452380D01*
X121220357Y-81452380D01*
X120267976Y-81452380D02*
X120839404Y-81452380D01*
X120553690Y-81452380D02*
X120428690Y-80452380D01*
X120541785Y-80595238D01*
X120648928Y-80690476D01*
X120750119Y-80738095D01*
X123242842Y-137000000D02*
X123332127Y-136952380D01*
X123474985Y-136952380D01*
X123623794Y-137000000D01*
X123730937Y-137095238D01*
X123790461Y-137190476D01*
X123861889Y-137380952D01*
X123879747Y-137523809D01*
X123855937Y-137714285D01*
X123820223Y-137809523D01*
X123736889Y-137904761D01*
X123599985Y-137952380D01*
X123504747Y-137952380D01*
X123355937Y-137904761D01*
X123302366Y-137857142D01*
X123260699Y-137523809D01*
X123451175Y-137523809D01*
X122885699Y-137952380D02*
X122760699Y-136952380D01*
X122314270Y-137952380D01*
X122189270Y-136952380D01*
X121838080Y-137952380D02*
X121713080Y-136952380D01*
X121474985Y-136952380D01*
X121338080Y-137000000D01*
X121254747Y-137095238D01*
X121219032Y-137190476D01*
X121195223Y-137380952D01*
X121213080Y-137523809D01*
X121284508Y-137714285D01*
X121344032Y-137809523D01*
X121451175Y-137904761D01*
X121599985Y-137952380D01*
X121838080Y-137952380D01*
X117766651Y-137952380D02*
X118040461Y-137476190D01*
X118338080Y-137952380D02*
X118213080Y-136952380D01*
X117832127Y-136952380D01*
X117742842Y-137000000D01*
X117701175Y-137047619D01*
X117665461Y-137142857D01*
X117683318Y-137285714D01*
X117742842Y-137380952D01*
X117796413Y-137428571D01*
X117897604Y-137476190D01*
X118278556Y-137476190D01*
X117308318Y-136952380D02*
X116766651Y-137952380D01*
X116641651Y-136952380D02*
X117433318Y-137952380D01*
X120736889Y-136952380D02*
X120165461Y-136952380D01*
X120576175Y-137952380D02*
X120451175Y-136952380D01*
X119927366Y-136952380D02*
X119385699Y-137952380D01*
X119260699Y-136952380D02*
X120052366Y-137952380D01*
D11*
X138500000Y-92750000D02*
X109000000Y-92750000D01*
X138500000Y-90250000D02*
X138500000Y-92750000D01*
X109000000Y-90250000D02*
X138500000Y-90250000D01*
X109000000Y-87750000D02*
X109000000Y-90250000D01*
X138500000Y-87750000D02*
X109000000Y-87750000D01*
X138500000Y-85250000D02*
X138500000Y-87750000D01*
X109000000Y-85250000D02*
X138500000Y-85250000D01*
X109000000Y-82750000D02*
X109000000Y-88750000D01*
X138500000Y-82750000D02*
X109000000Y-82750000D01*
X138500000Y-95250000D02*
X138500000Y-82750000D01*
X109000000Y-95250000D02*
X138500000Y-95250000D01*
X109000000Y-88750000D02*
X109000000Y-95250000D01*
X109000000Y-95000000D02*
X109000000Y-95500000D01*
D10*
X113970089Y-83500000D02*
X114059375Y-83452380D01*
X114202232Y-83452380D01*
X114351041Y-83500000D01*
X114458184Y-83595238D01*
X114517708Y-83690476D01*
X114589136Y-83880952D01*
X114606994Y-84023809D01*
X114583184Y-84214285D01*
X114547470Y-84309523D01*
X114464136Y-84404761D01*
X114327232Y-84452380D01*
X114231994Y-84452380D01*
X114083184Y-84404761D01*
X114029613Y-84357142D01*
X113987946Y-84023809D01*
X114178422Y-84023809D01*
X113612946Y-84452380D02*
X113487946Y-83452380D01*
X113041517Y-84452380D01*
X112916517Y-83452380D01*
X112565327Y-84452380D02*
X112440327Y-83452380D01*
X112202232Y-83452380D01*
X112065327Y-83500000D01*
X111981994Y-83595238D01*
X111946279Y-83690476D01*
X111922470Y-83880952D01*
X111940327Y-84023809D01*
X112011755Y-84214285D01*
X112071279Y-84309523D01*
X112178422Y-84404761D01*
X112327232Y-84452380D01*
X112565327Y-84452380D01*
X114297470Y-85952380D02*
X113678422Y-85952380D01*
X114059375Y-86333333D01*
X113916517Y-86333333D01*
X113827232Y-86380952D01*
X113785565Y-86428571D01*
X113749851Y-86523809D01*
X113779613Y-86761904D01*
X113839136Y-86857142D01*
X113892708Y-86904761D01*
X113993898Y-86952380D01*
X114279613Y-86952380D01*
X114368898Y-86904761D01*
X114410565Y-86857142D01*
X113392708Y-85952380D02*
X113184375Y-86952380D01*
X112726041Y-85952380D01*
X112487946Y-85952380D02*
X111868898Y-85952380D01*
X112249851Y-86333333D01*
X112106994Y-86333333D01*
X112017708Y-86380952D01*
X111976041Y-86428571D01*
X111940327Y-86523809D01*
X111970089Y-86761904D01*
X112029613Y-86857142D01*
X112083184Y-86904761D01*
X112184375Y-86952380D01*
X112470089Y-86952380D01*
X112559375Y-86904761D01*
X112601041Y-86857142D01*
X114297470Y-88452380D02*
X113755803Y-89452380D01*
X113630803Y-88452380D02*
X114422470Y-89452380D01*
X113416517Y-89404761D02*
X113279613Y-89452380D01*
X113041517Y-89452380D01*
X112940327Y-89404761D01*
X112886755Y-89357142D01*
X112827232Y-89261904D01*
X112815327Y-89166666D01*
X112851041Y-89071428D01*
X112892708Y-89023809D01*
X112981994Y-88976190D01*
X113166517Y-88928571D01*
X113255803Y-88880952D01*
X113297470Y-88833333D01*
X113333184Y-88738095D01*
X113321279Y-88642857D01*
X113261755Y-88547619D01*
X113208184Y-88500000D01*
X113106994Y-88452380D01*
X112868898Y-88452380D01*
X112731994Y-88500000D01*
X112422470Y-89452380D02*
X112297470Y-88452380D01*
X112356994Y-88928571D02*
X111785565Y-88928571D01*
X111851041Y-89452380D02*
X111726041Y-88452380D01*
X111249851Y-88452380D02*
X111351041Y-89261904D01*
X111315327Y-89357142D01*
X111273660Y-89404761D01*
X111184375Y-89452380D01*
X110993898Y-89452380D01*
X110892708Y-89404761D01*
X110839136Y-89357142D01*
X110779613Y-89261904D01*
X110678422Y-88452380D01*
X110345089Y-88452380D02*
X109773660Y-88452380D01*
X110184375Y-89452380D02*
X110059375Y-88452380D01*
X114416517Y-91904761D02*
X114279613Y-91952380D01*
X114041517Y-91952380D01*
X113940327Y-91904761D01*
X113886755Y-91857142D01*
X113827232Y-91761904D01*
X113815327Y-91666666D01*
X113851041Y-91571428D01*
X113892708Y-91523809D01*
X113981994Y-91476190D01*
X114166517Y-91428571D01*
X114255803Y-91380952D01*
X114297470Y-91333333D01*
X114333184Y-91238095D01*
X114321279Y-91142857D01*
X114261755Y-91047619D01*
X114208184Y-91000000D01*
X114106994Y-90952380D01*
X113868898Y-90952380D01*
X113731994Y-91000000D01*
X113422470Y-91952380D02*
X113297470Y-90952380D01*
X113059375Y-90952380D01*
X112922470Y-91000000D01*
X112839136Y-91095238D01*
X112803422Y-91190476D01*
X112779613Y-91380952D01*
X112797470Y-91523809D01*
X112868898Y-91714285D01*
X112928422Y-91809523D01*
X113035565Y-91904761D01*
X113184375Y-91952380D01*
X113422470Y-91952380D01*
X112434375Y-91666666D02*
X111958184Y-91666666D01*
X112565327Y-91952380D02*
X112106994Y-90952380D01*
X111898660Y-91952380D01*
X114368898Y-94404761D02*
X114231994Y-94452380D01*
X113993898Y-94452380D01*
X113892708Y-94404761D01*
X113839136Y-94357142D01*
X113779613Y-94261904D01*
X113767708Y-94166666D01*
X113803422Y-94071428D01*
X113845089Y-94023809D01*
X113934375Y-93976190D01*
X114118898Y-93928571D01*
X114208184Y-93880952D01*
X114249851Y-93833333D01*
X114285565Y-93738095D01*
X114273660Y-93642857D01*
X114214136Y-93547619D01*
X114160565Y-93500000D01*
X114059375Y-93452380D01*
X113821279Y-93452380D01*
X113684375Y-93500000D01*
X112791517Y-94357142D02*
X112845089Y-94404761D01*
X112993898Y-94452380D01*
X113089136Y-94452380D01*
X113226041Y-94404761D01*
X113309375Y-94309523D01*
X113345089Y-94214285D01*
X113368898Y-94023809D01*
X113351041Y-93880952D01*
X113279613Y-93690476D01*
X113220089Y-93595238D01*
X113112946Y-93500000D01*
X112964136Y-93452380D01*
X112868898Y-93452380D01*
X112731994Y-93500000D01*
X112690327Y-93547619D01*
X111898660Y-94452380D02*
X112374851Y-94452380D01*
X112249851Y-93452380D01*
D11*
X101750000Y-101250000D02*
X145250000Y-101250000D01*
X101750000Y-103750000D02*
X101750000Y-101250000D01*
X101750000Y-98750000D02*
X101750000Y-101250000D01*
X145500000Y-98750000D02*
X101750000Y-98750000D01*
X145500000Y-101250000D02*
X145500000Y-98750000D01*
X145500000Y-101250000D02*
X145250000Y-101250000D01*
X145500000Y-103750000D02*
X145500000Y-101250000D01*
X101750000Y-103750000D02*
X101750000Y-111250000D01*
X145500000Y-103750000D02*
X145500000Y-106250000D01*
X101750000Y-103750000D02*
X145500000Y-103750000D01*
D10*
X106720089Y-99500000D02*
X106809375Y-99452380D01*
X106952232Y-99452380D01*
X107101041Y-99500000D01*
X107208184Y-99595238D01*
X107267708Y-99690476D01*
X107339136Y-99880952D01*
X107356994Y-100023809D01*
X107333184Y-100214285D01*
X107297470Y-100309523D01*
X107214136Y-100404761D01*
X107077232Y-100452380D01*
X106981994Y-100452380D01*
X106833184Y-100404761D01*
X106779613Y-100357142D01*
X106737946Y-100023809D01*
X106928422Y-100023809D01*
X106362946Y-100452380D02*
X106237946Y-99452380D01*
X105791517Y-100452380D01*
X105666517Y-99452380D01*
X105315327Y-100452380D02*
X105190327Y-99452380D01*
X104952232Y-99452380D01*
X104815327Y-99500000D01*
X104731994Y-99595238D01*
X104696279Y-99690476D01*
X104672470Y-99880952D01*
X104690327Y-100023809D01*
X104761755Y-100214285D01*
X104821279Y-100309523D01*
X104928422Y-100404761D01*
X105077232Y-100452380D01*
X105315327Y-100452380D01*
X107047470Y-101952380D02*
X106428422Y-101952380D01*
X106809375Y-102333333D01*
X106666517Y-102333333D01*
X106577232Y-102380952D01*
X106535565Y-102428571D01*
X106499851Y-102523809D01*
X106529613Y-102761904D01*
X106589136Y-102857142D01*
X106642708Y-102904761D01*
X106743898Y-102952380D01*
X107029613Y-102952380D01*
X107118898Y-102904761D01*
X107160565Y-102857142D01*
X106142708Y-101952380D02*
X105934375Y-102952380D01*
X105476041Y-101952380D01*
X105237946Y-101952380D02*
X104618898Y-101952380D01*
X104999851Y-102333333D01*
X104856994Y-102333333D01*
X104767708Y-102380952D01*
X104726041Y-102428571D01*
X104690327Y-102523809D01*
X104720089Y-102761904D01*
X104779613Y-102857142D01*
X104833184Y-102904761D01*
X104934375Y-102952380D01*
X105220089Y-102952380D01*
X105309375Y-102904761D01*
X105351041Y-102857142D01*
X107047470Y-104452380D02*
X106505803Y-105452380D01*
X106380803Y-104452380D02*
X107172470Y-105452380D01*
X106166517Y-105404761D02*
X106029613Y-105452380D01*
X105791517Y-105452380D01*
X105690327Y-105404761D01*
X105636755Y-105357142D01*
X105577232Y-105261904D01*
X105565327Y-105166666D01*
X105601041Y-105071428D01*
X105642708Y-105023809D01*
X105731994Y-104976190D01*
X105916517Y-104928571D01*
X106005803Y-104880952D01*
X106047470Y-104833333D01*
X106083184Y-104738095D01*
X106071279Y-104642857D01*
X106011755Y-104547619D01*
X105958184Y-104500000D01*
X105856994Y-104452380D01*
X105618898Y-104452380D01*
X105481994Y-104500000D01*
X105172470Y-105452380D02*
X105047470Y-104452380D01*
X105106994Y-104928571D02*
X104535565Y-104928571D01*
X104601041Y-105452380D02*
X104476041Y-104452380D01*
X103999851Y-104452380D02*
X104101041Y-105261904D01*
X104065327Y-105357142D01*
X104023660Y-105404761D01*
X103934375Y-105452380D01*
X103743898Y-105452380D01*
X103642708Y-105404761D01*
X103589136Y-105357142D01*
X103529613Y-105261904D01*
X103428422Y-104452380D01*
X103095089Y-104452380D02*
X102523660Y-104452380D01*
X102934375Y-105452380D02*
X102809375Y-104452380D01*
D11*
X145500000Y-106250000D02*
X145500000Y-108750000D01*
X101750000Y-106250000D02*
X145500000Y-106250000D01*
D10*
X107166517Y-107904761D02*
X107029613Y-107952380D01*
X106791517Y-107952380D01*
X106690327Y-107904761D01*
X106636755Y-107857142D01*
X106577232Y-107761904D01*
X106565327Y-107666666D01*
X106601041Y-107571428D01*
X106642708Y-107523809D01*
X106731994Y-107476190D01*
X106916517Y-107428571D01*
X107005803Y-107380952D01*
X107047470Y-107333333D01*
X107083184Y-107238095D01*
X107071279Y-107142857D01*
X107011755Y-107047619D01*
X106958184Y-107000000D01*
X106856994Y-106952380D01*
X106618898Y-106952380D01*
X106481994Y-107000000D01*
X106172470Y-107952380D02*
X106047470Y-106952380D01*
X105809375Y-106952380D01*
X105672470Y-107000000D01*
X105589136Y-107095238D01*
X105553422Y-107190476D01*
X105529613Y-107380952D01*
X105547470Y-107523809D01*
X105618898Y-107714285D01*
X105678422Y-107809523D01*
X105785565Y-107904761D01*
X105934375Y-107952380D01*
X106172470Y-107952380D01*
X105184375Y-107666666D02*
X104708184Y-107666666D01*
X105315327Y-107952380D02*
X104856994Y-106952380D01*
X104648660Y-107952380D01*
D11*
X145500000Y-108750000D02*
X109000000Y-108750000D01*
X145500000Y-111250000D02*
X145500000Y-108750000D01*
X101750000Y-111250000D02*
X145500000Y-111250000D01*
X109000000Y-108750000D02*
X101750000Y-108750000D01*
D10*
X107118898Y-110404761D02*
X106981994Y-110452380D01*
X106743898Y-110452380D01*
X106642708Y-110404761D01*
X106589136Y-110357142D01*
X106529613Y-110261904D01*
X106517708Y-110166666D01*
X106553422Y-110071428D01*
X106595089Y-110023809D01*
X106684375Y-109976190D01*
X106868898Y-109928571D01*
X106958184Y-109880952D01*
X106999851Y-109833333D01*
X107035565Y-109738095D01*
X107023660Y-109642857D01*
X106964136Y-109547619D01*
X106910565Y-109500000D01*
X106809375Y-109452380D01*
X106571279Y-109452380D01*
X106434375Y-109500000D01*
X105541517Y-110357142D02*
X105595089Y-110404761D01*
X105743898Y-110452380D01*
X105839136Y-110452380D01*
X105976041Y-110404761D01*
X106059375Y-110309523D01*
X106095089Y-110214285D01*
X106118898Y-110023809D01*
X106101041Y-109880952D01*
X106029613Y-109690476D01*
X105970089Y-109595238D01*
X105862946Y-109500000D01*
X105714136Y-109452380D01*
X105618898Y-109452380D01*
X105481994Y-109500000D01*
X105440327Y-109547619D01*
X104648660Y-110452380D02*
X105124851Y-110452380D01*
X104999851Y-109452380D01*
M02*
