"enc = "," Δt = "," dist = "," raw speed = "," filtered speed = ",e:,ei:,ed:,KP:,KD:,KI:,commande:
"enc = "," Δt = "," dist = ",,,,,,,,,
4,16908,2.46,145.63,9.45,440.55,19.40,-638.69,5.00,0.10,10.00,450
10,16692,6.16,368.79,45.52,404.48,26.15,-2160.92,5.00,0.10,10.00,450
10,16710,6.16,368.39,92.54,357.46,32.12,-2813.94,5.00,0.10,10.00,450
2,16687,1.23,73.78,111.22,338.78,37.78,-1119.38,5.00,0.10,10.00,450
-6,16720,-3.69,-220.90,84.27,365.73,43.89,1611.76,5.00,0.10,10.00,450
-5,11272,-3.08,-273.06,-31.81,481.81,56.45,4925.22,5.00,0.10,10.00,450
0,16713,0.00,0.00,-47.04,497.04,64.75,911.54,5.00,0.10,10.00,450
7,16714,4.31,257.81,-21.41,471.41,72.63,-1533.86,5.00,0.10,10.00,450
13,16713,8.00,478.82,35.35,414.65,79.56,-3395.70,5.00,0.10,10.00,450
11,16701,6.77,405.45,94.56,355.44,85.50,-3545.56,5.00,0.10,10.00,450
4,16705,2.46,147.40,121.00,329.00,91.00,-1582.85,5.00,0.10,10.00,450
-3,16711,-1.85,-110.51,106.02,343.98,96.74,896.46,5.00,0.10,10.00,450
-10,16711,-6.16,-368.37,55.68,394.32,103.33,3012.49,5.00,0.10,10.00,450
-9,16691,-5.54,-331.93,-3.43,453.43,110.90,3541.49,5.00,0.10,10.00,450
0,16720,0.00,0.00,-27.09,477.09,118.88,1415.29,5.00,0.10,10.00,450
7,16716,4.31,257.78,-4.37,454.37,126.47,-1359.32,5.00,0.10,10.00,450
9,11272,5.54,491.50,50.81,399.19,130.97,-4895.88,5.00,0.10,10.00,450
10,16705,6.16,368.50,106.00,344.00,136.72,-3303.78,5.00,0.10,10.00,450
3,16716,1.85,110.48,125.40,324.60,142.15,-1160.16,5.00,0.10,10.00,450
-4,16714,-2.46,-147.32,104.41,345.59,147.92,1255.84,5.00,0.10,10.00,450
-11,16716,-6.77,-405.09,48.95,401.05,154.63,3317.69,5.00,0.10,10.00,450
-10,16720,-6.16,-368.17,-14.49,464.49,162.39,3794.23,5.00,0.10,10.00,450
-2,16713,-1.23,-73.67,-44.54,494.54,170.66,1798.00,5.00,0.10,10.00,450
7,16712,4.31,257.84,-24.63,474.63,178.59,-1191.43,5.00,0.10,10.00,450
12,16704,7.39,442.23,29.93,420.07,185.61,-3266.36,5.00,0.10,10.00,450
12,16711,7.39,442.04,89.94,360.06,191.62,-3590.75,5.00,0.10,10.00,450
4,16714,2.46,147.32,119.71,330.29,197.14,-1781.44,5.00,0.10,10.00,450
-4,16687,-2.46,-147.56,102.22,347.78,202.95,1048.43,5.00,0.10,10.00,450
-9,16723,-5.54,-331.29,52.43,397.57,209.60,2976.99,5.00,0.10,10.00,450
-4,16721,-2.46,-147.26,9.94,440.06,216.95,2541.34,5.00,0.10,10.00,450
4,16715,2.46,147.31,8.49,441.51,224.33,86.58,5.00,0.10,10.00,450
6,11264,3.69,327.90,41.85,408.15,228.93,-2961.29,5.00,0.10,10.00,450
14,16712,8.62,515.69,97.15,352.85,234.83,-3309.22,5.00,0.10,10.00,450
13,16711,8.00,478.88,155.37,294.63,239.75,-3483.96,5.00,0.10,10.00,450
5,16716,3.08,184.13,180.95,269.05,244.25,-1530.45,5.00,0.10,10.00,450
-3,16708,-1.85,-110.53,159.89,290.11,249.10,1260.55,5.00,0.10,10.00,450
-9,16716,-5.54,-331.43,104.37,345.63,254.87,3321.33,5.00,0.10,10.00,450
-8,16718,-4.92,-294.57,43.56,406.44,261.67,3637.50,5.00,0.10,10.00,450
0,16700,0.00,0.00,15.76,434.24,268.92,1664.96,5.00,0.10,10.00,450
7,16707,4.31,257.92,32.23,417.77,275.90,-986.18,5.00,0.10,10.00,450
13,16690,8.00,479.48,81.21,368.79,282.06,-2934.51,5.00,0.10,10.00,450
8,16719,4.92,294.55,125.70,324.30,287.48,-2661.24,5.00,0.10,10.00,450
0,16712,0.00,0.00,128.79,321.21,292.85,-184.95,5.00,0.10,10.00,450
-4,11265,-2.46,-218.58,94.08,355.92,296.85,3081.82,5.00,0.10,10.00,450
-10,16719,-6.16,-368.19,37.62,412.38,303.75,3376.55,5.00,0.10,10.00,450
-8,16715,-4.92,-294.63,-16.12,466.12,311.54,3215.46,5.00,0.10,10.00,450
0,16717,0.00,0.00,-35.22,485.22,319.65,1142.25,5.00,0.10,10.00,450
7,16706,4.31,257.94,-11.30,461.30,327.36,-1431.78,5.00,0.10,10.00,450
14,16713,8.62,515.66,46.67,403.33,334.10,-3468.37,5.00,0.10,10.00,450
12,16702,7.39,442.28,109.59,340.41,339.78,-3767.46,5.00,0.10,10.00,450
4,16713,2.46,147.33,136.52,313.48,345.02,-1610.91,5.00,0.10,10.00,450
-4,16714,-2.46,-147.32,116.59,333.41,350.60,1192.46,5.00,0.10,10.00,450
-9,16713,-5.54,-331.49,64.71,385.29,357.04,3104.12,5.00,0.10,10.00,450
-9,16695,-5.54,-331.85,6.97,443.03,364.43,3458.43,5.00,0.10,10.00,450
0,16721,0.00,0.00,-18.21,468.21,372.26,1505.65,5.00,0.10,10.00,450
4,11323,2.46,217.46,0.28,449.72,377.35,-1632.93,5.00,0.10,10.00,450
12,16650,7.39,443.66,48.37,401.63,384.04,-2888.22,5.00,0.10,10.00,450
10,16716,6.16,368.26,100.42,349.58,389.88,-3113.53,5.00,0.10,10.00,450
3,16715,1.85,110.48,120.61,329.39,395.39,-1208.00,5.00,0.10,10.00,450
-4,16713,-2.46,-147.33,100.32,349.68,401.23,1214.09,5.00,0.10,10.00,450
-11,16721,-6.77,-404.96,45.46,404.54,408.00,3280.50,5.00,0.10,10.00,450
-9,16708,-5.54,-331.59,-14.80,464.80,415.76,3606.60,5.00,0.10,10.00,450
-2,16715,-1.23,-73.66,-42.14,492.14,423.99,1635.78,5.00,0.10,10.00,450
7,16707,4.31,257.92,-22.57,472.57,431.89,-1171.16,5.00,0.10,10.00,450
12,16711,7.39,442.04,31.68,418.32,438.88,-3246.53,5.00,0.10,10.00,450
12,16714,7.39,441.96,91.41,358.59,444.87,-3573.66,5.00,0.10,10.00,450
4,16687,2.46,147.56,120.98,329.02,450.36,-1772.11,5.00,0.10,10.00,450
-4,16721,-2.46,-147.26,103.34,346.66,456.16,1055.06,5.00,0.10,10.00,450
-9,16721,-5.54,-331.33,53.41,396.59,462.79,2986.04,5.00,0.10,10.00,450
-5,16714,-3.08,-184.15,8.09,441.91,470.17,2711.83,5.00,0.10,10.00,450
1,11270,0.62,54.62,-2.52,452.52,475.27,941.48,5.00,0.10,10.00,450
8,16707,4.92,294.77,23.28,426.72,482.40,-1544.50,5.00,0.10,10.00,450
14,16713,8.62,515.66,78.88,371.12,488.61,-3326.74,5.00,0.10,10.00,450
13,16717,8.00,478.71,139.75,310.25,493.79,-3641.40,5.00,0.10,10.00,450
4,16707,2.46,147.38,164.93,285.07,498.55,-1506.89,5.00,0.10,10.00,450
-4,16713,-2.46,-147.33,140.85,309.15,503.72,1440.54,5.00,0.10,10.00,450
-9,16706,-5.54,-331.63,85.42,364.58,509.81,3318.14,5.00,0.10,10.00,450
-9,16710,-5.54,-331.55,24.67,425.33,516.92,3635.62,5.00,0.10,10.00,450
0,16723,0.00,0.00,-3.07,453.07,524.50,1658.71,5.00,0.10,10.00,450
6,16677,3.69,221.47,13.50,436.50,531.78,-993.67,5.00,0.10,10.00,450
13,16719,8.00,478.65,62.50,387.50,538.25,-2930.66,5.00,0.10,10.00,450
8,16710,4.92,294.71,109.68,340.32,543.94,-2823.22,5.00,0.10,10.00,450
1,11272,0.62,54.61,119.09,330.91,547.67,-835.54,5.00,0.10,10.00,450
-5,16713,-3.08,-184.16,92.27,357.73,553.65,1604.68,5.00,0.10,10.00,450
-11,16713,-6.77,-405.16,35.90,414.10,560.57,3373.10,5.00,0.10,10.00,450
-10,16716,-6.16,-368.26,-25.65,475.65,568.52,3681.87,5.00,0.10,10.00,450
-2,16717,-1.23,-73.65,-54.07,504.07,576.95,1700.45,5.00,0.10,10.00,450
6,16717,3.69,220.94,-35.46,485.46,585.06,-1113.70,5.00,0.10,10.00,450
12,16707,7.39,442.15,17.99,432.01,592.28,-3199.23,5.00,0.10,10.00,450
11,16704,6.77,405.38,77.07,372.93,598.51,-3536.44,5.00,0.10,10.00,450
3,16711,1.85,110.51,103.37,346.63,604.30,-1574.10,5.00,0.10,10.00,450
-5,16714,-3.08,-184.15,82.92,367.08,610.44,1223.73,5.00,0.10,10.00,450
-9,16688,-5.54,-331.99,33.24,416.76,617.39,2977.06,5.00,0.10,10.00,450
-5,16721,-3.08,-184.07,-9.18,459.18,625.07,2537.06,5.00,0.10,10.00,450
4,16722,2.46,147.25,-10.52,460.52,632.77,80.12,5.00,0.10,10.00,450
6,11323,3.69,326.19,25.48,424.52,637.58,-3179.67,5.00,0.10,10.00,450
14,16652,8.62,517.54,83.18,366.82,643.69,-3465.30,5.00,0.10,10.00,450
13,16719,8.00,478.65,143.56,306.44,648.81,-3611.36,5.00,0.10,10.00,450
5,16713,3.08,184.16,170.85,279.15,653.48,-1633.03,5.00,0.10,10.00,450
-3,16713,-1.85,-110.50,151.27,298.73,658.47,1171.66,5.00,0.10,10.00,450
-10,16720,-6.16,-368.17,94.34,355.66,664.41,3405.08,5.00,0.10,10.00,450
-8,16711,-4.92,-294.70,32.31,417.69,671.40,3711.94,5.00,0.10,10.00,450
-1,16712,-0.62,-36.83,3.46,446.54,678.86,1726.46,5.00,0.10,10.00,450
7,16700,4.31,258.03,19.05,430.95,686.05,-934.03,5.00,0.10,10.00,450
14,16714,8.62,515.62,72.59,377.41,692.36,-3203.30,5.00,0.10,10.00,450
12,16684,7.39,442.76,131.77,318.23,697.67,-3546.60,5.00,0.10,10.00,450
4,16719,2.46,147.28,155.48,294.52,702.60,-1418.55,5.00,0.10,10.00,450
-3,16720,-1.85,-110.45,135.46,314.54,707.85,1197.35,5.00,0.10,10.00,450
-10,16718,-6.16,-368.22,80.84,369.16,714.03,3267.41,5.00,0.10,10.00,450
-4,16713,-2.46,-147.33,31.50,418.50,721.02,2951.85,5.00,0.10,10.00,450
1,11273,0.62,54.61,20.15,429.85,725.87,1006.83,5.00,0.10,10.00,450
9,16710,5.54,331.55,45.32,404.68,732.63,-1506.27,5.00,0.10,10.00,450
14,16712,8.62,515.69,100.39,349.61,738.47,-3294.73,5.00,0.10,10.00,450
14,16721,8.62,515.41,160.79,289.21,743.31,-3612.67,5.00,0.10,10.00,450
5,16708,3.08,184.22,188.25,261.75,747.68,-1643.34,5.00,0.10,10.00,450
-2,16710,-1.23,-73.68,168.81,281.19,752.38,1163.21,5.00,0.10,10.00,450
-9,16705,-5.54,-331.65,114.66,335.34,757.98,3241.83,5.00,0.10,10.00,450
-8,16712,-4.92,-294.68,52.32,397.68,764.63,3730.07,5.00,0.10,10.00,450
1,16719,0.62,36.82,25.91,424.09,771.72,1579.70,5.00,0.10,10.00,450
8,16679,4.92,295.26,46.30,403.70,778.45,-1222.65,5.00,0.10,10.00,450
13,16722,8.00,478.57,95.88,354.12,784.37,-2964.62,5.00,0.10,10.00,450
8,16717,4.92,294.59,138.16,311.84,789.59,-2529.62,5.00,0.10,10.00,450
1,11270,0.62,54.62,143.42,306.58,793.04,-465.88,5.00,0.10,10.00,450
-5,16707,-3.08,-184.23,113.04,336.96,798.67,1818.05,5.00,0.10,10.00,450
-11,16719,-6.77,-405.01,53.64,396.36,805.30,3552.89,5.00,0.10,10.00,450
-10,16717,-6.16,-368.24,-10.48,460.48,812.99,3835.86,5.00,0.10,10.00,450
0,16717,0.00,0.00,-35.76,485.76,821.11,1512.06,5.00,0.10,10.00,450
6,16710,3.69,221.03,-14.45,464.45,828.88,-1275.43,5.00,0.10,10.00,450
12,16707,7.39,442.15,35.94,414.06,835.79,-3016.06,5.00,0.10,10.00,450
12,16704,7.39,442.23,95.08,354.92,841.72,-3540.19,5.00,0.10,10.00,450
3,16711,1.85,110.51,121.43,328.57,847.21,-1577.30,5.00,0.10,10.00,450
-3,16714,-1.85,-110.49,103.71,346.29,853.00,1060.67,5.00,0.10,10.00,450
-11,16717,-6.77,-405.06,51.03,398.97,859.67,3150.88,5.00,0.10,10.00,450
-8,16691,-4.92,-295.05,-7.39,457.39,867.30,3500.02,5.00,0.10,10.00,450
-1,16722,-0.62,-36.81,-30.47,480.47,875.34,1380.29,5.00,0.10,10.00,450
7,16719,4.31,257.74,-9.94,459.94,883.03,-1228.02,5.00,0.10,10.00,450
8,11326,4.92,434.81,41.93,408.07,887.65,-4579.54,5.00,0.10,10.00,450
10,16652,6.16,369.67,94.38,355.62,893.57,-3149.43,5.00,0.10,10.00,450
2,16717,1.23,73.65,112.87,337.13,899.21,-1106.35,5.00,0.10,10.00,450
-6,16716,-3.69,-220.96,85.67,364.33,905.30,1627.38,5.00,0.10,10.00,450
-11,16710,-6.77,-405.23,27.57,422.43,912.36,3476.60,5.00,0.10,10.00,450
-10,16721,-6.16,-368.15,-32.75,482.75,920.43,3607.91,5.00,0.10,10.00,450
-1,16710,-0.62,-36.84,-57.45,507.45,928.91,1478.23,5.00,0.10,10.00,450
5,16713,3.08,184.16,-38.34,488.34,937.07,-1143.63,5.00,0.10,10.00,450
12,16703,7.39,442.26,12.86,437.14,944.37,-3065.38,5.00,0.10,10.00,450
11,16713,6.77,405.16,72.67,377.33,950.68,-3578.90,5.00,0.10,10.00,450
2,16710,1.23,73.68,96.92,353.08,956.58,-1451.16,5.00,0.10,10.00,450
-5,16689,-3.08,-184.43,74.71,375.29,962.84,1331.02,5.00,0.10,10.00,450
-10,16723,-6.16,-368.11,23.58,426.42,969.97,3057.58,5.00,0.10,10.00,450
-5,16717,-3.08,-184.12,-20.07,470.07,977.83,2610.77,5.00,0.10,10.00,450
3,16717,1.85,110.47,-22.50,472.50,985.73,145.47,5.00,0.10,10.00,450
5,11267,3.08,273.18,8.72,441.28,990.70,-2770.44,5.00,0.10,10.00,450
13,16710,8.00,478.91,62.20,387.80,997.18,-3200.45,5.00,0.10,10.00,450
12,16714,7.39,441.96,120.15,329.85,1002.69,-3467.69,5.00,0.10,10.00,450
4,16715,2.46,147.31,145.51,304.49,1007.78,-1517.01,5.00,0.10,10.00,450
-4,16717,-2.46,-147.29,124.27,325.73,1013.23,1270.76,5.00,0.10,10.00,450
-10,16715,-6.16,-368.28,68.59,381.41,1019.60,3330.97,5.00,0.10,10.00,450
-9,16716,-5.54,-331.43,7.64,442.36,1027.00,3646.42,5.00,0.10,10.00,450
-1,16717,-0.62,-36.82,-20.29,470.29,1034.86,1670.41,5.00,0.10,10.00,450
8,16706,4.92,294.78,1.45,448.55,1042.35,-1301.41,5.00,0.10,10.00,450
13,16711,8.00,478.88,57.56,392.44,1048.91,-3357.69,5.00,0.10,10.00,450
12,16711,7.39,442.04,116.20,333.80,1054.49,-3508.99,5.00,0.10,10.00,450
4,16689,2.46,147.54,142.16,307.84,1059.63,-1555.28,5.00,0.10,10.00,450
-4,16720,-2.46,-147.27,121.42,328.58,1065.12,1240.16,5.00,0.10,10.00,450
-9,16721,-5.54,-331.33,68.85,381.15,1071.49,3143.97,5.00,0.10,10.00,450
-4,16721,-2.46,-147.26,23.96,426.04,1078.62,2684.91,5.00,0.10,10.00,450
4,16717,2.46,147.29,20.46,429.54,1085.80,209.10,5.00,0.10,10.00,450
6,11266,3.69,327.84,52.07,397.93,1090.28,-2805.11,5.00,0.10,10.00,450
14,16711,8.62,515.72,105.88,344.12,1096.03,-3220.01,5.00,0.10,10.00,450
13,16720,8.00,478.62,162.81,287.19,1100.83,-3404.91,5.00,0.10,10.00,450
5,16715,3.08,184.14,187.29,262.71,1105.23,-1464.52,5.00,0.10,10.00,450
-3,16715,-1.85,-110.48,165.30,284.70,1109.98,1315.08,5.00,0.10,10.00,450
-9,16717,-5.54,-331.41,109.00,341.00,1115.69,3368.10,5.00,0.10,10.00,450
-7,16721,-4.31,-257.70,50.20,399.80,1122.37,3516.64,5.00,0.10,10.00,450
0,16712,0.00,0.00,24.11,425.89,1129.49,1561.14,5.00,0.10,10.00,450
8,16708,4.92,294.75,42.05,407.95,1136.30,-1073.61,5.00,0.10,10.00,450
13,16700,8.00,479.20,92.25,357.75,1142.28,-3006.25,5.00,0.10,10.00,450
13,16718,8.00,478.68,148.52,301.48,1147.32,-3365.52,5.00,0.10,10.00,450
4,16713,2.46,147.33,172.41,277.59,1151.96,-1429.45,5.00,0.10,10.00,450
-3,16690,-1.85,-110.65,149.90,300.10,1156.97,1348.17,5.00,0.10,10.00,450
-8,16721,-4.92,-294.52,98.52,351.48,1162.84,3072.93,5.00,0.10,10.00,450
-4,16720,-2.46,-147.27,51.98,398.02,1169.50,2783.87,5.00,0.10,10.00,450
4,16722,2.46,147.25,44.39,405.61,1176.28,453.88,5.00,0.10,10.00,450
7,11323,4.31,380.56,76.33,373.67,1180.51,-2821.18,5.00,0.10,10.00,450
14,16656,8.62,517.42,130.56,319.44,1185.83,-3255.81,5.00,0.10,10.00,450
14,16720,8.62,515.44,186.69,263.31,1190.24,-3357.09,5.00,0.10,10.00,450
5,16715,3.08,184.14,210.36,239.64,1194.24,-1416.26,5.00,0.10,10.00,450
-2,16716,-1.23,-73.65,187.69,262.31,1198.63,1356.15,5.00,0.10,10.00,450
-9,16716,-5.54,-331.43,130.80,319.20,1203.96,3403.53,5.00,0.10,10.00,450
-7,16717,-4.31,-257.77,68.81,381.19,1210.33,3708.23,5.00,0.10,10.00,450
0,16719,0.00,0.00,40.00,410.00,1217.19,1723.28,5.00,0.10,10.00,450
8,16703,4.92,294.84,55.62,394.38,1223.78,-935.43,5.00,0.10,10.00,450
15,16699,9.23,552.95,109.22,340.78,1229.47,-3209.66,5.00,0.10,10.00,450
13,16723,8.00,478.54,168.37,281.63,1234.18,-3536.82,5.00,0.10,10.00,450
4,16713,2.46,147.33,189.35,260.65,1238.53,-1255.41,5.00,0.10,10.00,450
-3,16710,-1.85,-110.52,164.38,285.62,1243.31,1494.01,5.00,0.10,10.00,450
-9,16695,-5.54,-331.85,108.18,341.82,1249.01,3366.54,5.00,0.10,10.00,450
-3,16721,-1.85,-110.44,60.19,389.81,1255.53,2870.24,5.00,0.10,10.00,450
4,16721,2.46,147.26,54.08,395.92,1262.15,365.23,5.00,0.10,10.00,450
11,16715,6.77,405.11,86.40,363.60,1268.23,-1933.41,5.00,0.10,10.00,450
11,11270,6.77,600.83,147.01,302.99,1271.64,-5378.79,5.00,0.10,10.00,450
13,16720,8.00,478.62,204.13,245.87,1275.75,-3416.29,5.00,0.10,10.00,450
6,16711,3.69,221.02,225.27,224.73,1279.51,-1264.46,5.00,0.10,10.00,450
-2,16717,-1.23,-73.65,203.11,246.89,1283.64,1325.59,5.00,0.10,10.00,450
-9,16716,-5.54,-331.43,143.96,306.04,1288.75,3538.12,5.00,0.10,10.00,450
-8,16718,-4.92,-294.57,77.37,372.63,1294.98,3983.23,5.00,0.10,10.00,450
0,16716,0.00,0.00,44.63,405.37,1301.76,1958.66,5.00,0.10,10.00,450
8,16706,4.92,294.78,59.57,390.43,1308.28,-894.55,5.00,0.10,10.00,450
14,16716,8.62,515.56,109.87,340.13,1313.97,-3008.82,5.00,0.10,10.00,450
12,16700,7.39,442.33,163.56,286.44,1318.75,-3215.21,5.00,0.10,10.00,450
4,16716,2.46,147.30,182.61,267.39,1323.22,-1139.35,5.00,0.10,10.00,450
-3,16717,-1.85,-110.47,158.63,291.37,1328.09,1434.44,5.00,0.10,10.00,450
-10,16716,-6.16,-368.26,100.62,349.38,1333.93,3470.42,5.00,0.10,10.00,450
-9,16718,-5.54,-331.39,34.99,415.01,1340.87,3925.41,5.00,0.10,10.00,450
0,16691,0.00,0.00,5.76,444.24,1348.28,1751.51,5.00,0.10,10.00,450
7,16719,4.31,257.74,23.68,426.32,1355.41,-1071.98,5.00,0.10,10.00,450
12,16711,7.39,442.04,71.17,378.83,1361.74,-2841.63,5.00,0.10,10.00,450
6,11274,3.69,327.61,116.81,333.19,1365.50,-4048.29,5.00,0.10,10.00,450
3,16711,1.85,110.51,131.65,318.35,1370.82,-888.12,5.00,0.10,10.00,450
-4,16717,-2.46,-147.29,109.75,340.25,1376.51,1309.96,5.00,0.10,10.00,450
-11,16717,-6.77,-405.06,53.52,396.48,1383.13,3363.95,5.00,0.10,10.00,450
-9,16718,-5.54,-331.39,-7.91,457.91,1390.79,3674.31,5.00,0.10,10.00,450
-1,16715,-0.62,-36.83,-33.56,483.56,1398.87,1534.64,5.00,0.10,10.00,450
6,16719,3.69,220.92,-15.26,465.26,1406.65,-1094.67,5.00,0.10,10.00,450
13,16712,8.00,478.85,37.91,412.09,1413.54,-3181.62,5.00,0.10,10.00,450
12,16712,7.39,442.02,99.41,350.59,1419.40,-3680.26,5.00,0.10,10.00,450
3,16705,1.85,110.55,125.13,324.87,1424.82,-1539.20,5.00,0.10,10.00,450
-4,16711,-2.46,-147.35,104.18,345.82,1430.60,1253.51,5.00,0.10,10.00,450
-10,16719,-6.16,-368.19,51.44,398.56,1437.27,3154.59,5.00,0.10,10.00,450
-9,16719,-5.54,-331.37,-7.00,457.00,1444.91,3495.33,5.00,0.10,10.00,450
-1,16714,-0.62,-36.83,-32.78,482.78,1452.98,1542.61,5.00,0.10,10.00,450
7,16691,4.31,258.17,-11.88,461.88,1460.69,-1252.16,5.00,0.10,10.00,450
12,16718,7.39,441.86,40.81,409.19,1467.53,-3152.11,5.00,0.10,10.00,450
7,16722,4.31,257.69,85.78,364.22,1473.62,-2689.17,5.00,0.10,10.00,450
-1,16715,-0.62,-36.83,89.34,360.66,1479.64,-212.66,5.00,0.10,10.00,450
-4,11272,-2.46,-218.45,57.71,392.29,1484.07,2805.81,5.00,0.10,10.00,450
-10,16716,-6.16,-368.26,6.57,443.43,1491.48,3059.20,5.00,0.10,10.00,450
-7,16713,-4.31,-257.83,-39.97,489.97,1499.67,2784.57,5.00,0.10,10.00,450
0,16720,0.00,0.00,-52.90,502.90,1508.08,773.60,5.00,0.10,10.00,450
8,16712,4.92,294.68,-23.73,473.73,1515.99,-1745.83,5.00,0.10,10.00,450
14,16715,8.62,515.59,38.73,411.27,1522.87,-3736.27,5.00,0.10,10.00,450
13,16713,8.00,478.82,105.47,344.53,1528.63,-3993.27,5.00,0.10,10.00,450
5,16712,3.08,184.17,138.33,311.67,1533.83,-1966.74,5.00,0.10,10.00,450
-3,16719,-1.85,-110.46,123.50,326.50,1539.29,887.03,5.00,0.10,10.00,450
-9,16702,-5.54,-331.71,73.28,376.72,1545.59,3006.91,5.00,0.10,10.00,450
-8,16714,-4.92,-294.64,16.98,433.02,1552.82,3368.30,5.00,0.10,10.00,450
0,16720,0.00,0.00,-6.95,456.95,1560.46,1431.20,5.00,0.10,10.00,450
7,16679,4.31,258.35,12.88,437.12,1567.75,-1188.45,5.00,0.10,10.00,450
13,16721,8.00,478.59,64.65,385.35,1574.20,-3096.09,5.00,0.10,10.00,450
7,16719,4.31,257.74,108.81,341.19,1579.90,-2641.69,5.00,0.10,10.00,450
0,16716,0.00,0.00,111.69,338.31,1585.56,-172.08,5.00,0.10,10.00,450
-4,11267,-2.46,-218.54,79.47,370.53,1589.73,2859.38,5.00,0.10,10.00,450
-7,16713,-4.31,-257.83,33.19,416.81,1596.70,2769.27,5.00,0.10,10.00,450
-2,16719,-1.23,-73.64,4.21,445.79,1604.15,1733.15,5.00,0.10,10.00,450
6,16713,3.69,221.00,14.33,435.67,1611.43,-605.06,5.00,0.10,10.00,450
12,16713,7.39,441.99,60.50,389.50,1617.94,-2762.75,5.00,0.10,10.00,450
11,16711,6.77,405.21,113.34,336.66,1623.57,-3162.17,5.00,0.10,10.00,450
4,16713,2.46,147.33,137.02,312.98,1628.80,-1416.66,5.00,0.10,10.00,450
-4,16717,-2.46,-147.29,117.02,332.98,1634.36,1196.52,5.00,0.10,10.00,450
-11,16706,-6.77,-405.33,59.70,390.30,1640.89,3430.83,5.00,0.10,10.00,450
-9,16714,-5.54,-331.47,-2.65,452.65,1648.45,3730.74,5.00,0.10,10.00,450
-2,16720,-1.23,-73.63,-31.76,481.76,1656.51,1740.69,5.00,0.10,10.00,450
7,16717,4.31,257.77,-13.72,463.72,1664.26,-1079.23,5.00,0.10,10.00,450
13,16713,8.00,478.82,41.91,408.09,1671.08,-3328.33,5.00,0.10,10.00,450
11,16692,6.77,405.67,100.18,349.82,1676.92,-3491.02,5.00,0.10,10.00,450
4,16722,2.46,147.25,125.81,324.19,1682.34,-1532.47,5.00,0.10,10.00,450
-3,16719,-1.85,-110.46,110.12,339.88,1688.02,938.42,5.00,0.10,10.00,450
-9,16717,-5.54,-331.41,61.87,388.13,1694.51,2886.02,5.00,0.10,10.00,450
-4,11331,-2.46,-217.31,12.89,437.11,1699.46,4322.69,5.00,0.10,10.00,450
2,16658,1.23,73.91,0.57,449.43,1706.95,739.69,5.00,0.10,10.00,450
8,16710,4.92,294.71,27.32,422.68,1714.01,-1600.98,5.00,0.10,10.00,450
14,16713,8.62,515.66,82.33,367.67,1720.16,-3291.19,5.00,0.10,10.00,450
13,16713,8.00,478.82,142.71,307.29,1725.29,-3612.64,5.00,0.10,10.00,450
4,16718,2.46,147.29,167.45,282.55,1730.02,-1480.18,5.00,0.10,10.00,450
-2,16708,-1.23,-73.69,148.36,301.64,1735.06,1142.57,5.00,0.10,10.00,450
-9,16720,-5.54,-331.35,97.21,352.79,1740.95,3059.08,5.00,0.10,10.00,450
-9,16703,-5.54,-331.69,34.75,415.25,1747.89,3739.63,5.00,0.10,10.00,450
0,16713,0.00,0.00,5.53,444.47,1755.32,1748.39,5.00,0.10,10.00,450
7,16707,4.31,257.92,23.50,426.50,1762.44,-1075.55,5.00,0.10,10.00,450
13,16692,8.00,479.43,73.75,376.25,1768.72,-3010.29,5.00,0.10,10.00,450
8,16721,4.92,294.52,119.32,330.68,1774.25,-2725.68,5.00,0.10,10.00,450
-1,16717,-0.62,-36.82,120.66,329.34,1779.76,-80.10,5.00,0.10,10.00,450
-6,16713,-3.69,-221.00,84.28,365.72,1785.87,2177.10,5.00,0.10,10.00,450
-2,11274,-1.23,-109.20,47.93,402.07,1790.40,3223.60,5.00,0.10,10.00,450
4,16719,2.46,147.28,43.71,406.29,1797.20,252.80,5.00,0.10,10.00,450
11,16713,6.77,405.16,77.54,372.46,1803.42,-2024.54,5.00,0.10,10.00,450
16,16713,9.85,589.32,138.62,311.38,1808.63,-3654.45,5.00,0.10,10.00,450
15,16715,9.23,552.42,201.50,248.50,1812.78,-3761.91,5.00,0.10,10.00,450
7,16718,4.31,257.75,231.06,218.94,1816.44,-1768.25,5.00,0.10,10.00,450
-2,16711,-1.23,-73.67,210.73,239.27,1820.44,1216.82,5.00,0.10,10.00,450
-7,16714,-4.31,-257.81,155.83,294.17,1825.36,3284.58,5.00,0.10,10.00,450
-7,16721,-4.31,-257.70,95.55,354.45,1831.28,3605.09,5.00,0.10,10.00,450
2,16704,1.23,73.70,68.20,381.80,1837.66,1637.05,5.00,0.10,10.00,450
9,16711,5.54,331.53,87.75,362.25,1843.71,-1169.51,5.00,0.10,10.00,450
14,16708,8.62,515.81,136.62,313.38,1848.95,-2925.27,5.00,0.10,10.00,450
13,16693,8.00,479.40,189.13,260.87,1853.30,-3145.28,5.00,0.10,10.00,450
5,16720,3.08,184.09,209.82,240.18,1857.32,-1237.38,5.00,0.10,10.00,450
-1,16721,-0.62,-36.81,189.90,260.10,1861.67,1190.82,5.00,0.10,10.00,450
-8,16719,-4.92,-294.55,138.05,311.95,1866.88,3101.24,5.00,0.10,10.00,450
-3,16718,-1.85,-110.46,88.41,361.59,1872.93,2969.33,5.00,0.10,10.00,450
3,11330,1.85,163.00,79.33,370.67,1877.13,801.76,5.00,0.10,10.00,450
9,16653,5.54,332.69,103.83,346.17,1882.89,-1471.43,5.00,0.10,10.00,450
15,16715,9.23,552.42,153.11,296.89,1887.86,-2948.03,5.00,0.10,10.00,450
14,16716,8.62,515.56,208.50,241.50,1891.89,-3313.91,5.00,0.10,10.00,450
6,16717,3.69,220.94,231.68,218.32,1895.54,-1386.37,5.00,0.10,10.00,450
-2,16715,-1.23,-73.66,208.58,241.42,1899.58,1382.17,5.00,0.10,10.00,450
-9,16718,-5.54,-331.39,148.64,301.36,1904.62,3585.35,5.00,0.10,10.00,450
-8,16721,-4.92,-294.52,81.37,368.63,1910.78,4022.94,5.00,0.10,10.00,450
2,16710,1.23,73.68,53.41,396.59,1917.41,1673.08,5.00,0.10,10.00,450
7,16695,4.31,258.11,69.77,380.23,1923.76,-979.67,5.00,0.10,10.00,450
14,16715,8.62,515.59,115.91,334.09,1929.34,-2760.34,5.00,0.10,10.00,450
12,16713,7.39,441.99,168.70,281.30,1934.04,-3158.60,5.00,0.10,10.00,450
5,16690,3.08,184.42,189.67,260.33,1938.39,-1256.60,5.00,0.10,10.00,450
-2,16719,-1.23,-73.64,170.04,279.96,1943.07,1173.94,5.00,0.10,10.00,450
-9,16723,-5.54,-331.29,115.74,334.26,1948.66,3247.35,5.00,0.10,10.00,450
-3,16720,-1.85,-110.45,66.68,383.32,1955.07,2934.02,5.00,0.10,10.00,450
4,16717,2.46,147.29,59.63,390.37,1961.59,421.91,5.00,0.10,10.00,450
6,11266,3.69,327.84,85.51,364.49,1965.70,-2297.58,5.00,0.10,10.00,450
15,16711,9.23,552.55,137.12,312.88,1970.93,-3088.28,5.00,0.10,10.00,450
13,16721,8.00,478.59,192.17,257.83,1975.24,-3292.15,5.00,0.10,10.00,450
5,16714,3.08,184.15,212.36,237.64,1979.21,-1208.05,5.00,0.10,10.00,450
-3,16716,-1.85,-110.48,186.72,263.28,1983.61,1533.92,5.00,0.10,10.00,450
-9,16717,-5.54,-331.41,127.29,322.71,1989.01,3555.10,5.00,0.10,10.00,450
-8,16720,-4.92,-294.54,63.13,386.87,1995.47,3836.92,5.00,0.10,10.00,450
0,16712,0.00,0.00,32.47,417.53,2002.45,1834.61,5.00,0.10,10.00,450
7,16708,4.31,257.90,46.51,403.49,2009.19,-839.97,5.00,0.10,10.00,450
13,16699,8.00,479.22,93.38,356.62,2015.15,-2806.92,5.00,0.10,10.00,450
12,16717,7.39,441.88,146.80,303.20,2020.22,-3195.73,5.00,0.10,10.00,450
4,16712,2.46,147.34,168.27,281.73,2024.93,-1284.23,5.00,0.10,10.00,450
-4,16693,-2.46,-147.51,143.69,306.31,2030.04,1472.42,5.00,0.10,10.00,450
-9,16722,-5.54,-331.31,87.85,362.15,2036.09,3339.11,5.00,0.10,10.00,450
-4,16721,-2.46,-147.26,40.18,409.82,2042.95,2850.69,5.00,0.10,10.00,450
4,16719,2.46,147.28,34.32,415.68,2049.90,350.84,5.00,0.10,10.00,450
7,11267,4.31,382.45,67.87,382.13,2054.20,-2978.05,5.00,0.10,10.00,450
14,16710,8.62,515.75,123.35,326.65,2059.66,-3320.14,5.00,0.10,10.00,450
14,16727,8.62,515.22,180.40,269.60,2064.17,-3410.38,5.00,0.10,10.00,450
5,16709,3.08,184.21,204.98,245.02,2068.26,-1471.09,5.00,0.10,10.00,450
-2,16715,-1.23,-73.66,183.10,266.90,2072.72,1308.93,5.00,0.10,10.00,450
-9,16715,-5.54,-331.45,126.87,323.13,2078.13,3363.71,5.00,0.10,10.00,450
-8,16719,-4.92,-294.55,62.78,387.22,2084.60,3833.79,5.00,0.10,10.00,450
0,16718,0.00,0.00,32.17,417.83,2091.59,1830.91,5.00,0.10,10.00,450
7,16705,4.31,257.95,46.25,403.75,2098.33,-843.00,5.00,0.10,10.00,450
13,16697,8.00,479.28,93.17,356.83,2104.29,-2809.96,5.00,0.10,10.00,450
12,16717,7.39,441.88,146.63,303.37,2109.36,-3197.84,5.00,0.10,10.00,450
4,16714,2.46,147.32,168.11,281.89,2114.07,-1285.55,5.00,0.10,10.00,450
-3,16689,-1.85,-110.66,146.24,303.76,2119.14,1310.77,5.00,0.10,10.00,450
-10,16722,-6.16,-368.13,90.03,359.97,2125.16,3361.22,5.00,0.10,10.00,450
-4,16720,-2.46,-147.27,39.37,410.63,2132.03,3030.23,5.00,0.10,10.00,450
4,16721,2.46,147.26,33.62,416.38,2138.99,343.77,5.00,0.10,10.00,450
10,16709,6.16,368.41,66.25,383.75,2145.40,-1953.00,5.00,0.10,10.00,450
11,11280,6.77,600.30,127.10,322.90,2149.04,-5394.49,5.00,0.10,10.00,450
13,16715,8.00,478.77,187.10,262.90,2153.44,-3589.55,5.00,0.10,10.00,450
4,16711,2.46,147.35,205.36,244.64,2157.52,-1092.96,5.00,0.10,10.00,450
-1,16714,-0.62,-36.83,183.43,266.57,2161.98,1312.53,5.00,0.10,10.00,450
-9,16717,-5.54,-331.41,129.84,320.16,2167.33,3205.63,5.00,0.10,10.00,450
-8,16719,-4.92,-294.55,65.31,384.69,2173.76,3859.50,5.00,0.10,10.00,450
1,16717,0.62,36.82,37.01,412.99,2180.67,1692.79,5.00,0.10,10.00,450
7,16705,4.31,257.95,53.07,396.93,2187.30,-961.13,5.00,0.10,10.00,450
14,16717,8.62,515.53,101.63,348.37,2193.12,-2904.92,5.00,0.10,10.00,450
12,16699,7.39,442.36,156.53,293.47,2198.02,-3287.42,5.00,0.10,10.00,450
4,16719,2.46,147.28,176.60,273.40,2202.59,-1200.59,5.00,0.10,10.00,450
-3,16713,-1.85,-110.50,153.49,296.51,2207.55,1382.52,5.00,0.10,10.00,450
-10,16716,-6.16,-368.26,96.23,353.77,2213.46,3425.68,5.00,0.10,10.00,450
-8,16693,-4.92,-295.01,33.89,416.11,2220.41,3734.25,5.00,0.10,10.00,450
0,16720,0.00,0.00,7.47,442.53,2227.81,1580.48,5.00,0.10,10.00,450
7,16717,4.31,257.77,25.14,424.86,2234.91,-1057.30,5.00,0.10,10.00,450
8,11268,4.92,437.05,72.06,377.94,2239.17,-4163.25,5.00,0.10,10.00,450
10,16711,6.16,368.37,120.17,329.83,2244.68,-2879.20,5.00,0.10,10.00,450
3,16719,1.85,110.46,137.48,312.52,2249.91,-1035.58,5.00,0.10,10.00,450
-5,16714,-3.08,-184.15,112.05,337.95,2255.55,1521.93,5.00,0.10,10.00,450
-11,16721,-6.77,-404.96,52.80,397.20,2262.20,3543.23,5.00,0.10,10.00,450
-9,16717,-5.54,-331.41,-8.52,458.52,2269.86,3667.95,5.00,0.10,10.00,450
-1,16715,-0.62,-36.83,-34.08,484.08,2277.95,1529.43,5.00,0.10,10.00,450
5,16720,3.08,184.09,-18.39,468.39,2285.78,-938.77,5.00,0.10,10.00,450
13,16710,8.00,478.91,32.56,417.44,2292.76,-3049.09,5.00,0.10,10.00,450
11,16714,6.77,405.13,92.17,357.83,2298.74,-3566.10,5.00,0.10,10.00,450
3,16700,1.85,110.58,116.26,333.74,2304.31,-1442.37,5.00,0.10,10.00,450
-4,16715,-2.46,-147.31,96.61,353.39,2310.22,1175.43,5.00,0.10,10.00,450
-11,16718,-6.77,-405.04,42.29,407.71,2317.04,3248.95,5.00,0.10,10.00,450
-9,16715,-5.54,-331.45,-17.50,467.50,2324.85,3577.10,5.00,0.10,10.00,450
-2,16714,-1.23,-73.66,-44.44,494.44,2333.11,1611.67,5.00,0.10,10.00,450
6,16697,3.69,221.21,-27.21,477.21,2341.08,-1031.86,5.00,0.10,10.00,450
12,16720,7.39,441.81,25.03,424.97,2348.19,-3124.37,5.00,0.10,10.00,450
7,16719,4.31,257.74,72.30,377.70,2354.50,-2827.43,5.00,0.10,10.00,450
0,16712,0.00,0.00,80.51,369.49,2360.68,-491.06,5.00,0.10,10.00,450
-5,11265,-3.08,-273.23,48.87,401.13,2365.20,2809.20,5.00,0.10,10.00,450
-11,16718,-6.77,-405.04,-7.65,457.65,2372.85,3380.31,5.00,0.10,10.00,450
-11,16719,-6.77,-405.01,-65.50,515.50,2381.47,3460.45,5.00,0.10,10.00,450
-1,16719,-0.62,-36.82,-88.10,538.10,2390.46,1351.88,5.00,0.10,10.00,450
5,16717,3.08,184.12,-64.52,514.52,2399.06,-1410.93,5.00,0.10,10.00,450
12,16716,7.39,441.91,-9.52,459.52,2406.75,-3289.93,5.00,0.10,10.00,450
11,16716,6.77,405.09,53.53,396.47,2413.37,-3771.93,5.00,0.10,10.00,450
2,16708,1.23,73.69,80.57,369.43,2419.54,-1618.35,5.00,0.10,10.00,450
-4,16704,-2.46,-147.41,63.44,386.56,2426.00,1025.50,5.00,0.10,10.00,450
-11,16712,-6.77,-405.18,13.95,436.05,2433.29,2961.39,5.00,0.10,10.00,450
-9,16719,-5.54,-331.37,-41.71,491.71,2441.51,3329.01,5.00,0.10,10.00,450
0,16721,0.00,0.00,-59.74,509.74,2450.03,1078.55,5.00,0.10,10.00,450
6,16681,3.69,221.42,-34.90,484.90,2458.12,-1489.24,5.00,0.10,10.00,450
12,16720,7.39,441.81,18.48,431.52,2465.34,-3192.49,5.00,0.10,10.00,450
7,16720,4.31,257.72,66.70,383.30,2471.75,-2884.45,5.00,0.10,10.00,450
-1,16715,-0.62,-36.83,73.05,376.95,2478.05,-379.43,5.00,0.10,10.00,450
-5,11271,-3.08,-273.08,39.82,410.18,2482.67,2947.94,5.00,0.10,10.00,450
-11,16717,-6.77,-405.06,-15.36,465.36,2490.45,3300.98,5.00,0.10,10.00,450
-10,16719,-6.16,-368.19,-69.41,519.41,2499.13,3232.85,5.00,0.10,10.00,450
-1,16718,-0.62,-36.82,-88.76,538.76,2508.14,1157.48,5.00,0.10,10.00,450
5,16717,3.08,184.12,-65.08,515.08,2516.75,-1416.68,5.00,0.10,10.00,450
12,16718,7.39,441.86,-10.01,460.01,2524.44,-3294.23,5.00,0.10,10.00,450
11,16716,6.77,405.09,53.11,396.89,2531.08,-3775.94,5.00,0.10,10.00,450
3,16714,1.85,110.49,82.89,367.11,2537.21,-1781.73,5.00,0.10,10.00,450
-4,16713,-2.46,-147.33,68.11,381.89,2543.59,884.58,5.00,0.10,10.00,450
-10,16711,-6.16,-368.37,20.62,429.38,2550.00,2841.63,5.00,0.10,10.00,450
-9,16720,-5.54,-331.35,-33.33,483.33,2550.00,3226.70,5.00,0.10,10.00,450
-2,16718,-1.23,-73.64,-57.95,507.95,2550.00,1472.52,5.00,0.10,10.00,450
6,16703,3.69,221.13,-38.75,488.75,2550.00,-1149.33,5.00,0.10,10.00,450
13,16716,8.00,478.74,17.86,432.14,2550.00,-3386.44,5.00,0.10,10.00,450
11,16714,6.77,405.13,79.60,370.40,2550.00,-3693.83,5.00,0.10,10.00,450
3,16689,1.85,110.66,105.52,344.48,2550.00,-1553.63,5.00,0.10,10.00,450
-4,16719,-2.46,-147.28,87.45,362.55,2550.00,1080.96,5.00,0.10,10.00,450
-10,16721,-6.16,-368.15,37.16,412.84,2550.00,3007.66,5.00,0.10,10.00,450
-5,16722,-3.08,-184.06,-8.47,458.47,2550.00,2728.54,5.00,0.10,10.00,450
3,16717,1.85,110.47,-12.59,462.59,2550.00,246.55,5.00,0.10,10.00,450
6,11266,3.69,327.84,21.16,428.84,2550.00,-2995.48,5.00,0.10,10.00,450
13,16711,8.00,478.88,76.80,373.20,2550.00,-3329.56,5.00,0.10,10.00,450
13,16719,8.00,478.65,135.30,314.70,2550.00,-3498.74,5.00,0.10,10.00,450
4,16715,2.46,147.31,161.11,288.89,2550.00,-1544.54,5.00,0.10,10.00,450
-3,16717,-1.85,-110.47,140.27,309.73,2550.00,1246.66,5.00,0.10,10.00,450
-9,16717,-5.54,-331.41,87.62,362.38,2550.00,3149.42,5.00,0.10,10.00,450
-8,16719,-4.92,-294.55,29.26,420.74,2550.00,3490.85,5.00,0.10,10.00,450
0,16711,0.00,0.00,3.54,446.46,2550.00,1538.84,5.00,0.10,10.00,450
7,16695,4.31,258.11,21.82,428.18,2550.00,-1094.50,5.00,0.10,10.00,450
14,16713,8.62,515.66,74.96,375.04,2550.00,-3179.83,5.00,0.10,10.00,450
12,16713,7.39,441.99,133.73,316.27,2550.00,-3516.56,5.00,0.10,10.00,450
4,16713,2.46,147.33,157.11,292.89,2550.00,-1398.76,5.00,0.10,10.00,450
-4,16695,-2.46,-147.49,134.16,315.84,2550.00,1374.65,5.00,0.10,10.00,450
-9,16722,-5.54,-331.31,79.72,370.28,2550.00,3255.86,5.00,0.10,10.00,450
-4,16721,-2.46,-147.26,33.24,416.76,2550.00,2779.67,5.00,0.10,10.00,450
3,16718,1.85,110.46,25.71,424.29,2550.00,450.50,5.00,0.10,10.00,450
6,11266,3.69,327.84,53.86,396.14,2550.00,-2499.18,5.00,0.10,10.00,450
15,16717,9.23,552.36,110.08,339.92,2550.00,-3362.73,5.00,0.10,10.00,450
12,16715,7.39,441.94,166.39,283.61,2550.00,-3369.03,5.00,0.10,10.00,450
5,16715,3.08,184.14,187.68,262.32,2550.00,-1273.44,5.00,0.10,10.00,450
-3,16724,-1.85,-110.42,165.64,284.36,2550.00,1317.52,5.00,0.10,10.00,450
-8,16709,-4.92,-294.73,111.96,338.04,2550.00,3212.58,5.00,0.10,10.00,450
-8,16719,-4.92,-294.55,52.72,397.28,2550.00,3543.66,5.00,0.10,10.00,450
0,16718,0.00,0.00,23.58,426.42,2550.00,1743.04,5.00,0.10,10.00,450
7,16705,4.31,257.95,38.91,411.09,2550.00,-918.09,5.00,0.10,10.00,450
13,16696,8.00,479.31,86.90,363.10,2550.00,-2874.43,5.00,0.10,10.00,450
12,16718,7.39,441.86,141.28,308.72,2550.00,-3252.37,5.00,0.10,10.00,450
4,16714,2.46,147.32,163.54,286.46,2550.00,-1332.17,5.00,0.10,10.00,450
-3,16689,-1.85,-110.66,142.33,307.67,2550.00,1270.78,5.00,0.10,10.00,450
-9,16722,-5.54,-331.31,89.38,360.62,2550.00,3166.87,5.00,0.10,10.00,450
-4,16720,-2.46,-147.27,41.49,408.51,2550.00,2864.24,5.00,0.10,10.00,450
4,16721,2.46,147.26,35.43,414.57,2550.00,362.30,5.00,0.10,10.00,450
6,11324,3.69,326.17,64.72,385.28,2550.00,-2586.76,5.00,0.10,10.00,450
14,16655,8.62,517.45,116.69,333.31,2550.00,-3120.13,5.00,0.10,10.00,450
13,16717,8.00,478.71,172.17,277.83,2550.00,-3319.01,5.00,0.10,10.00,450
5,16718,3.08,184.11,195.29,254.71,2550.00,-1382.69,5.00,0.10,10.00,450
-3,16716,-1.85,-110.48,172.14,277.86,2550.00,1385.01,5.00,0.10,10.00,450
-9,16717,-5.54,-331.41,114.83,335.17,2550.00,3427.74,5.00,0.10,10.00,450
-8,16716,-4.92,-294.61,52.49,397.51,2550.00,3729.38,5.00,0.10,10.00,450
1,16718,0.62,36.82,26.06,423.94,2550.00,1580.99,5.00,0.10,10.00,450
7,16704,4.31,257.97,43.72,406.28,2550.00,-1056.95,5.00,0.10,10.00,450
13,16705,8.00,479.05,90.99,359.01,2550.00,-2829.81,5.00,0.10,10.00,450
12,16713,7.39,441.99,144.76,305.24,2550.00,-3217.09,5.00,0.10,10.00,450
4,16722,2.46,147.25,166.52,283.48,2550.00,-1301.40,5.00,0.10,10.00,450
-4,16709,-2.46,-147.37,142.20,307.80,2550.00,1455.52,5.00,0.10,10.00,450
-10,16715,-6.16,-368.28,83.90,366.10,2550.00,3487.90,5.00,0.10,10.00,450
-8,16695,-4.92,-294.98,23.37,426.63,2550.00,3625.91,5.00,0.10,10.00,450
-2,16720,-1.23,-73.63,-6.88,456.88,2550.00,1808.99,5.00,0.10,10.00,450
7,16722,4.31,257.69,7.52,442.48,2550.00,-861.37,5.00,0.10,10.00,450
12,16709,7.39,442.10,57.37,392.63,2550.00,-2983.19,5.00,0.10,10.00,450
6,11273,3.69,327.64,105.03,344.97,2550.00,-4227.89,5.00,0.10,10.00,450
2,16712,1.23,73.67,118.91,331.09,2550.00,-830.60,5.00,0.10,10.00,450
-5,16716,-3.08,-184.13,93.51,356.49,2550.00,1519.65,5.00,0.10,10.00,450
-12,16715,-7.39,-441.94,34.28,415.72,2550.00,3543.52,5.00,0.10,10.00,450
-10,16717,-6.16,-368.24,-29.71,479.71,2550.00,3827.56,5.00,0.10,10.00,450
-2,16720,-1.23,-73.63,-57.54,507.54,2550.00,1664.53,5.00,0.10,10.00,450
6,16718,3.69,220.93,-38.41,488.41,2550.00,-1143.89,5.00,0.10,10.00,450
12,16711,7.39,442.04,15.46,434.54,2550.00,-3223.80,5.00,0.10,10.00,450
11,16713,6.77,405.16,74.88,375.12,2550.00,-3555.28,5.00,0.10,10.00,450
3,16706,1.85,110.54,101.49,348.51,2550.00,-1592.90,5.00,0.10,10.00,450
-4,16711,-2.46,-147.35,83.99,366.01,2550.00,1047.02,5.00,0.10,10.00,450
-10,16719,-6.16,-368.19,34.20,415.80,2550.00,2978.30,5.00,0.10,10.00,450
-9,16718,-5.54,-331.39,-21.72,471.72,2550.00,3345.07,5.00,0.10,10.00,450
-1,16715,-0.62,-36.83,-45.36,495.36,2550.00,1413.98,5.00,0.10,10.00,450
7,16690,4.31,258.18,-22.62,472.62,2550.00,-1362.32,5.00,0.10,10.00,450
12,16720,7.39,441.81,31.64,418.36,2550.00,-3245.34,5.00,0.10,10.00,450
7,16722,4.31,257.69,77.94,372.06,2550.00,-2769.04,5.00,0.10,10.00,450
-1,16713,-0.62,-36.83,82.64,367.36,2550.00,-281.13,5.00,0.10,10.00,450
-4,11273,-2.46,-218.43,51.99,398.01,2550.00,2718.76,5.00,0.10,10.00,450
-11,16715,-6.77,-405.11,-0.99,450.99,2550.00,3169.88,5.00,0.10,10.00,450
-10,16717,-6.16,-368.24,-57.15,507.15,2550.00,3359.15,5.00,0.10,10.00,450
-2,16718,-1.23,-73.64,-80.97,530.97,2550.00,1425.15,5.00,0.10,10.00,450
6,16719,3.69,220.92,-58.43,508.43,2550.00,-1348.37,5.00,0.10,10.00,450
12,16716,7.39,441.91,-1.64,451.64,2550.00,-3397.01,5.00,0.10,10.00,450
11,16715,6.77,405.11,60.26,389.74,2550.00,-3703.45,5.00,0.10,10.00,450
3,16717,1.85,110.47,89.00,361.00,2550.00,-1719.00,5.00,0.10,10.00,450
-3,16707,-1.85,-110.54,76.00,374.00,2550.00,778.01,5.00,0.10,10.00,450
-11,16716,-6.77,-405.09,27.36,422.64,2550.00,2909.37,5.00,0.10,10.00,450
-8,16720,-4.92,-294.54,-27.56,477.56,2550.00,3285.15,5.00,0.10,10.00,450
-1,16705,-0.62,-36.85,-47.66,497.66,2550.00,1203.28,5.00,0.10,10.00,450
6,16714,3.69,220.98,-27.30,477.30,2550.00,-1218.36,5.00,0.10,10.00,450
13,16718,8.00,478.68,27.62,422.38,2550.00,-3285.16,5.00,0.10,10.00,450
12,16712,7.39,442.02,90.62,359.38,2550.00,-3769.39,5.00,0.10,10.00,450
4,16692,2.46,147.52,120.30,329.70,2550.00,-1778.59,5.00,0.10,10.00,450
-3,16721,-1.85,-110.44,105.44,344.56,2550.00,889.03,5.00,0.10,10.00,450
-10,16722,-6.16,-368.13,55.20,394.80,2550.00,3004.06,5.00,0.10,10.00,450
-4,16718,-2.46,-147.29,9.62,440.38,2550.00,2726.51,5.00,0.10,10.00,450
4,16712,2.46,147.34,8.22,441.78,2550.00,83.83,5.00,0.10,10.00,450
6,11266,3.69,327.84,41.61,408.39,2550.00,-2964.06,5.00,0.10,10.00,450
14,16711,8.62,515.72,96.95,353.05,2550.00,-3311.33,5.00,0.10,10.00,450
13,16718,8.00,478.68,155.19,294.81,2550.00,-3483.52,5.00,0.10,10.00,450
6,16715,3.69,220.97,183.46,266.54,2550.00,-1691.72,5.00,0.10,10.00,450
-2,16717,-1.23,-73.65,167.40,282.60,2550.00,960.75,5.00,0.10,10.00,450
-9,16708,-5.54,-331.59,113.46,336.54,2550.00,3228.53,5.00,0.10,10.00,450
-7,16719,-4.31,-257.74,53.99,396.01,2550.00,3556.93,5.00,0.10,10.00,450
1,16718,0.62,36.82,30.03,419.97,2550.00,1433.51,5.00,0.10,10.00,450
7,16697,4.31,258.07,47.11,402.89,2550.00,-1023.21,5.00,0.10,10.00,450
14,16711,8.62,515.72,96.57,353.43,2550.00,-2959.35,5.00,0.10,10.00,450
13,16689,8.00,479.51,154.92,295.08,2550.00,-3496.56,5.00,0.10,10.00,450
4,16720,2.46,147.27,177.93,272.07,2550.00,-1376.28,5.00,0.10,10.00,450
-4,16725,-2.46,-147.22,151.96,298.04,2550.00,1553.05,5.00,0.10,10.00,450
-8,16715,-4.92,-294.63,97.60,352.40,2550.00,3251.70,5.00,0.10,10.00,450
-4,16717,-2.46,-147.29,51.18,398.82,2550.00,2776.93,5.00,0.10,10.00,450
2,11331,1.23,108.65,40.90,409.10,2550.00,907.74,5.00,0.10,10.00,450
9,16656,5.54,332.63,67.05,382.95,2550.00,-1570.27,5.00,0.10,10.00,450
14,16711,8.62,515.72,119.02,330.98,2550.00,-3109.93,5.00,0.10,10.00,450
14,16717,8.62,515.53,176.72,273.28,2550.00,-3451.45,5.00,0.10,10.00,450
5,16715,3.08,184.14,201.85,248.15,2550.00,-1503.75,5.00,0.10,10.00,450
-3,16716,-1.85,-110.48,177.75,272.25,2550.00,1442.21,5.00,0.10,10.00,450
-9,16718,-5.54,-331.39,119.63,330.37,2550.00,3476.44,5.00,0.10,10.00,450
-8,16715,-4.92,-294.63,56.59,393.41,2550.00,3771.44,5.00,0.10,10.00,450
1,16712,0.62,36.83,29.56,420.44,2550.00,1617.33,5.00,0.10,10.00,450
8,16700,4.92,294.89,49.39,400.61,2550.00,-1187.67,5.00,0.10,10.00,450
13,16717,8.00,478.71,98.50,351.50,2550.00,-2937.53,5.00,0.10,10.00,450
13,16711,8.00,478.88,153.83,296.17,2550.00,-3311.09,5.00,0.10,10.00,450
4,16690,2.46,147.53,176.97,273.03,2550.00,-1386.68,5.00,0.10,10.00,450
-3,16719,-1.85,-110.46,153.84,296.16,2550.00,1384.00,5.00,0.10,10.00,450
-8,16721,-4.92,-294.52,101.89,348.11,2550.00,3106.41,5.00,0.10,10.00,450
-4,16721,-2.46,-147.26,54.85,395.15,2550.00,2813.10,5.00,0.10,10.00,450
4,16720,2.46,147.27,46.85,403.15,2550.00,478.96,5.00,0.10,10.00,450
7,11267,4.31,382.45,78.57,371.43,2550.00,-2815.65,5.00,0.10,10.00,450
14,16710,8.62,515.75,132.49,317.51,2550.00,-3226.67,5.00,0.10,10.00,450
13,16721,8.00,478.59,185.53,264.47,2550.00,-3172.35,5.00,0.10,10.00,450
5,16713,3.08,184.16,206.69,243.31,2550.00,-1266.13,5.00,0.10,10.00,450
-2,16717,-1.23,-73.65,184.56,265.44,2550.00,1323.91,5.00,0.10,10.00,450
-9,16715,-5.54,-331.45,128.12,321.88,2550.00,3376.45,5.00,0.10,10.00,450
-7,16722,-4.31,-257.69,66.53,383.47,2550.00,3683.52,5.00,0.10,10.00,450
0,16712,0.00,0.00,38.06,411.94,2550.00,1703.75,5.00,0.10,10.00,450
8,16711,4.92,294.70,53.95,396.05,2550.00,-951.33,5.00,0.10,10.00,450
13,16695,8.00,479.34,102.43,347.57,2550.00,-2903.41,5.00,0.10,10.00,450
13,16719,8.00,478.65,157.21,292.79,2550.00,-3276.96,5.00,0.10,10.00,450
4,16713,2.46,147.33,179.83,270.17,2550.00,-1353.33,5.00,0.10,10.00,450
-3,16689,-1.85,-110.66,156.25,293.75,2550.00,1413.24,5.00,0.10,10.00,450
-8,16722,-4.92,-294.50,103.94,346.06,2550.00,3128.06,5.00,0.10,10.00,450
-3,16720,-1.85,-110.45,59.28,390.72,2550.00,2670.79,5.00,0.10,10.00,450
4,16722,2.46,147.25,53.31,396.69,2550.00,357.39,5.00,0.10,10.00,450
10,16708,6.16,368.44,83.07,366.93,2550.00,-1781.13,5.00,0.10,10.00,450
11,11274,6.77,600.62,141.49,308.51,2550.00,-5181.81,5.00,0.10,10.00,450
13,16714,8.00,478.79,199.41,250.59,2550.00,-3465.63,5.00,0.10,10.00,450
5,16719,3.08,184.10,218.55,231.45,2550.00,-1145.08,5.00,0.10,10.00,450
-3,16719,-1.85,-110.46,192.01,257.99,2550.00,1587.90,5.00,0.10,10.00,450
-9,16716,-5.54,-331.43,131.80,318.20,2550.00,3601.50,5.00,0.10,10.00,450
-8,16718,-4.92,-294.57,66.99,383.01,2550.00,3877.06,5.00,0.10,10.00,450
-1,16714,-0.62,-36.83,33.08,416.92,2550.00,2028.62,5.00,0.10,10.00,450
7,16718,4.31,257.75,44.33,405.67,2550.00,-673.12,5.00,0.10,10.00,450
13,16705,8.00,479.05,91.50,358.50,2550.00,-2823.49,5.00,0.10,10.00,450
12,16705,7.39,442.20,145.21,304.79,2550.00,-3215.10,5.00,0.10,10.00,450
4,16713,2.46,147.33,166.93,283.07,2550.00,-1299.44,5.00,0.10,10.00,450
-3,16720,-1.85,-110.45,145.24,304.76,2550.00,1297.04,5.00,0.10,10.00,450
-10,16718,-6.16,-368.22,89.19,360.81,2550.00,3352.79,5.00,0.10,10.00,450
-8,16715,-4.92,-294.63,27.91,422.09,2550.00,3665.94,5.00,0.10,10.00,450
0,16690,0.00,0.00,2.39,447.61,2550.00,1529.29,5.00,0.10,10.00,450
6,16720,3.69,220.90,18.12,431.88,2550.00,-940.97,5.00,0.10,10.00,450
12,16709,7.39,442.10,63.74,386.26,2550.00,-2730.30,5.00,0.10,10.00,450
6,11273,3.69,327.64,110.47,339.53,2550.00,-4145.36,5.00,0.10,10.00,450
2,16713,1.23,73.67,123.56,326.44,2550.00,-782.99,5.00,0.10,10.00,450
-5,16714,-3.08,-184.15,97.48,352.52,2550.00,1560.54,5.00,0.10,10.00,450
-12,16717,-7.39,-441.88,37.67,412.33,2550.00,3577.61,5.00,0.10,10.00,450
-10,16719,-6.16,-368.19,-26.80,476.80,2550.00,3856.29,5.00,0.10,10.00,450
-1,16717,-0.62,-36.82,-52.38,502.38,2550.00,1529.69,5.00,0.10,10.00,450
5,16718,3.08,184.11,-34.01,484.01,2550.00,-1098.77,5.00,0.10,10.00,450
11,16713,6.77,405.16,13.86,436.14,2550.00,-2863.86,5.00,0.10,10.00,450
10,16712,6.16,368.35,68.14,381.86,2550.00,-3248.45,5.00,0.10,10.00,450
3,16706,1.85,110.54,93.06,356.94,2550.00,-1491.33,5.00,0.10,10.00,450
-5,16710,-3.08,-184.20,74.11,375.89,2550.00,1133.96,5.00,0.10,10.00,450
-11,16720,-6.77,-404.99,20.40,429.60,2550.00,3212.48,5.00,0.10,10.00,450
-9,16715,-5.54,-331.45,-36.19,486.19,2550.00,3385.64,5.00,0.10,10.00,450
-1,16717,-0.62,-36.82,-57.72,507.72,2550.00,1287.69,5.00,0.10,10.00,450
5,16691,3.08,184.41,-38.55,488.55,2550.00,-1148.58,5.00,0.10,10.00,450
12,16721,7.39,441.78,12.67,437.33,2550.00,-3062.88,5.00,0.10,10.00,450
6,16721,3.69,220.89,59.06,390.94,2550.00,-2774.54,5.00,0.10,10.00,450
0,16713,0.00,0.00,66.52,383.48,2550.00,-446.25,5.00,0.10,10.00,450
-5,11264,-3.08,-273.25,36.91,413.09,2550.00,2628.22,5.00,0.10,10.00,450
-12,16714,-7.39,-441.96,-20.54,470.54,2550.00,3437.66,5.00,0.10,10.00,450
-10,16722,-6.16,-368.13,-76.52,526.52,2550.00,3347.40,5.00,0.10,10.00,450
-3,16722,-1.85,-110.44,-100.19,550.19,2550.00,1415.36,5.00,0.10,10.00,450
5,16718,3.08,184.11,-80.20,530.20,2550.00,-1195.75,5.00,0.10,10.00,450
12,16722,7.39,441.75,-22.93,472.93,2550.00,-3424.91,5.00,0.10,10.00,450
10,16709,6.16,368.41,39.40,410.60,2550.00,-3730.16,5.00,0.10,10.00,450
3,16718,1.85,110.46,68.51,381.49,2550.00,-1741.22,5.00,0.10,10.00,450
-4,16706,-2.46,-147.39,55.82,394.18,2550.00,759.67,5.00,0.10,10.00,450
-11,16720,-6.77,-404.99,7.46,442.54,2550.00,2892.53,5.00,0.10,10.00,450
-9,16702,-5.54,-331.71,-47.26,497.26,2550.00,3276.29,5.00,0.10,10.00,450
-2,16715,-1.23,-73.66,-69.87,519.87,2550.00,1352.70,5.00,0.10,10.00,450
6,16718,3.69,220.93,-48.95,498.95,2550.00,-1251.52,5.00,0.10,10.00,450
12,16712,7.39,442.02,6.46,443.54,2550.00,-3315.54,5.00,0.10,10.00,450
12,16688,7.39,442.65,69.92,380.08,2550.00,-3802.79,5.00,0.10,10.00,450
3,16720,1.85,110.45,99.98,350.02,2550.00,-1797.71,5.00,0.10,10.00,450
-4,16719,-2.46,-147.28,82.70,367.30,2550.00,1033.41,5.00,0.10,10.00,450
-10,16717,-6.16,-368.24,33.10,416.90,2550.00,2967.26,5.00,0.10,10.00,450
-4,16717,-2.46,-147.29,-9.27,459.27,2550.00,2534.11,5.00,0.10,10.00,450
2,11273,1.23,109.21,-10.69,460.69,2550.00,125.91,5.00,0.10,10.00,450
8,16711,4.92,294.70,20.28,429.72,2550.00,-1852.96,5.00,0.10,10.00,450
14,16716,8.62,515.56,76.30,373.70,2550.00,-3351.65,5.00,0.10,10.00,450
13,16715,8.00,478.77,137.55,312.45,2550.00,-3664.17,5.00,0.10,10.00,450
5,16715,3.08,184.14,165.73,284.27,2550.00,-1685.74,5.00,0.10,10.00,450
-3,16717,-1.85,-110.47,146.90,303.10,2550.00,1126.59,5.00,0.10,10.00,450
-9,16713,-5.54,-331.49,93.27,356.73,2550.00,3208.38,5.00,0.10,10.00,450
-8,16714,-4.92,-294.64,34.07,415.93,2550.00,3541.98,5.00,0.10,10.00,450
1,16720,0.62,36.82,10.33,439.67,2550.00,1420.12,5.00,0.10,10.00,450
7,16696,4.31,258.09,30.29,419.71,2550.00,-1195.57,5.00,0.10,10.00,450
13,16713,8.00,478.82,79.51,370.49,2550.00,-2945.31,5.00,0.10,10.00,450
12,16690,7.39,442.60,134.99,315.01,2550.00,-3323.57,5.00,0.10,10.00,450
3,16719,1.85,110.46,155.54,294.46,2550.00,-1229.42,5.00,0.10,10.00,450
-3,16720,-1.85,-110.45,132.83,317.17,2550.00,1358.16,5.00,0.10,10.00,450
-9,16723,-5.54,-331.29,81.28,368.72,2550.00,3082.73,5.00,0.10,10.00,450
-4,16717,-2.46,-147.29,34.57,415.43,2550.00,2794.05,5.00,0.10,10.00,450
4,16714,2.46,147.32,29.53,420.47,2550.00,301.87,5.00,0.10,10.00,450
6,11269,3.69,327.76,59.80,390.20,2550.00,-2686.57,5.00,0.10,10.00,450
14,16715,8.62,515.59,112.47,337.53,2550.00,-3150.77,5.00,0.10,10.00,450
13,16713,8.00,478.82,168.44,281.56,2550.00,-3349.10,5.00,0.10,10.00,450
5,16719,3.08,184.10,192.11,257.89,2550.00,-1415.66,5.00,0.10,10.00,450
-1,16714,-0.62,-36.83,174.78,275.22,2550.00,1036.66,5.00,0.10,10.00,450
-9,16717,-5.54,-331.41,122.45,327.55,2550.00,3130.12,5.00,0.10,10.00,450
-7,16714,-4.31,-257.81,61.68,388.32,2550.00,3636.12,5.00,0.10,10.00,450
0,16713,0.00,0.00,33.91,416.09,2550.00,1661.83,5.00,0.10,10.00,450
8,16698,4.92,294.93,50.43,399.57,2550.00,-989.35,5.00,0.10,10.00,450
14,16713,8.62,515.66,102.07,347.93,2550.00,-3090.29,5.00,0.10,10.00,450
13,16713,8.00,478.82,159.57,290.43,2550.00,-3440.15,5.00,0.10,10.00,450
4,16692,2.46,147.52,181.87,268.13,2550.00,-1335.98,5.00,0.10,10.00,450
-3,16721,-1.85,-110.44,158.02,291.98,2550.00,1426.61,5.00,0.10,10.00,450
-8,16721,-4.92,-294.52,105.46,344.54,2550.00,3142.86,5.00,0.10,10.00,450
-4,16722,-2.46,-147.25,57.91,392.09,2550.00,2844.08,5.00,0.10,10.00,450
4,16717,2.46,147.29,49.45,400.55,2550.00,505.53,5.00,0.10,10.00,450
7,11265,4.31,382.52,80.80,369.20,2550.00,-2782.96,5.00,0.10,10.00,450
14,16713,8.62,515.66,134.39,315.61,2550.00,-3206.46,5.00,0.10,10.00,450
14,16718,8.62,515.50,189.84,260.16,2550.00,-3316.59,5.00,0.10,10.00,450
5,16716,3.08,184.13,213.06,236.94,2550.00,-1388.87,5.00,0.10,10.00,450
-3,16715,-1.85,-110.48,187.31,262.69,2550.00,1540.23,5.00,0.10,10.00,450
-9,16717,-5.54,-331.41,127.79,322.21,2550.00,3560.32,5.00,0.10,10.00,450
-7,16719,-4.31,-257.74,66.25,383.75,2550.00,3681.32,5.00,0.10,10.00,450
0,16714,0.00,0.00,37.81,412.19,2550.00,1701.28,5.00,0.10,10.00,450
8,16709,4.92,294.73,53.75,396.25,2550.00,-953.73,5.00,0.10,10.00,450
13,16698,8.00,479.25,102.25,347.75,2550.00,-2904.48,5.00,0.10,10.00,450
12,16719,7.39,441.83,154.37,295.63,2550.00,-3117.83,5.00,0.10,10.00,450
5,16713,3.08,184.16,177.41,272.59,2550.00,-1378.20,5.00,0.10,10.00,450
-3,16689,-1.85,-110.66,156.86,293.14,2550.00,1231.36,5.00,0.10,10.00,450
-9,16722,-5.54,-331.31,101.78,348.22,2550.00,3293.66,5.00,0.10,10.00,450
-4,16720,-2.46,-147.27,52.08,397.92,2550.00,2972.54,5.00,0.10,10.00,450
3,16723,1.85,110.43,41.79,408.21,2550.00,615.04,5.00,0.10,10.00,450
11,16708,6.77,405.28,73.24,376.76,2550.00,-1881.84,5.00,0.10,10.00,450
10,11275,6.16,545.97,131.79,318.21,2550.00,-5193.67,5.00,0.10,10.00,450
12,16711,7.39,442.04,184.48,265.52,2550.00,-3152.74,5.00,0.10,10.00,450
5,16720,3.08,184.09,203.13,246.87,2550.00,-1115.32,5.00,0.10,10.00,450
-2,16715,-1.23,-73.66,181.51,268.49,2550.00,1293.30,5.00,0.10,10.00,450
-9,16717,-5.54,-331.41,125.52,324.48,2550.00,3349.26,5.00,0.10,10.00,450
-8,16719,-4.92,-294.55,61.62,388.38,2550.00,3821.79,5.00,0.10,10.00,450
2,16721,1.23,73.63,36.54,413.46,2550.00,1499.94,5.00,0.10,10.00,450
7,16701,4.31,258.01,55.35,394.65,2550.00,-1126.17,5.00,0.10,10.00,450
14,16715,8.62,515.59,103.59,346.41,2550.00,-2885.86,5.00,0.10,10.00,450
12,16702,7.39,442.28,158.20,291.80,2550.00,-3269.63,5.00,0.10,10.00,450
5,16716,3.08,184.13,180.70,269.30,2550.00,-1346.36,5.00,0.10,10.00,450
-3,16721,-1.85,-110.44,159.69,290.31,2550.00,1257.02,5.00,0.10,10.00,450
-9,16712,-5.54,-331.51,104.20,345.80,2550.00,3320.29,5.00,0.10,10.00,450
-8,16714,-4.92,-294.64,43.40,406.60,2550.00,3637.48,5.00,0.10,10.00,450
0,16696,0.00,0.00,15.61,434.39,2550.00,1664.26,5.00,0.10,10.00,450
7,16720,4.31,257.72,32.10,417.90,2550.00,-985.79,5.00,0.10,10.00,450
8,11327,4.92,434.77,77.82,372.18,2550.00,-4037.02,5.00,0.10,10.00,450
9,16651,5.54,332.73,122.34,327.66,2550.00,-2673.21,5.00,0.10,10.00,450
2,16716,1.23,73.65,134.06,315.94,2550.00,-701.33,5.00,0.10,10.00,450
-5,16715,-3.08,-184.14,106.44,343.56,2550.00,1652.18,5.00,0.10,10.00,450
-11,16716,-6.77,-405.09,48.01,401.99,2550.00,3495.83,5.00,0.10,10.00,450
-10,16716,-6.16,-368.26,-15.30,465.30,2550.00,3787.29,5.00,0.10,10.00,450
-1,16720,-0.62,-36.82,-42.56,492.56,2550.00,1630.11,5.00,0.10,10.00,450
6,16721,3.69,220.89,-22.94,472.94,2550.00,-1173.01,5.00,0.10,10.00,450
12,16707,7.39,442.15,28.68,421.32,2550.00,-3089.66,5.00,0.10,10.00,450
11,16715,6.77,405.11,86.17,363.83,2550.00,-3439.65,5.00,0.10,10.00,450
3,16704,1.85,110.56,111.13,338.87,2550.00,-1494.24,5.00,0.10,10.00,450
-4,16712,-2.46,-147.34,92.23,357.77,2550.00,1131.08,5.00,0.10,10.00,450
-11,16723,-6.77,-404.92,38.56,411.44,2550.00,3209.31,5.00,0.10,10.00,450
-9,16712,-5.54,-331.51,-20.68,470.68,2550.00,3544.84,5.00,0.10,10.00,450
0,16717,0.00,0.00,-41.80,491.80,2550.00,1263.04,5.00,0.10,10.00,450
6,16691,3.69,221.29,-19.59,469.59,2550.00,-1330.79,5.00,0.10,10.00,450
12,16722,7.39,441.75,31.54,418.46,2550.00,-3057.58,5.00,0.10,10.00,450
7,16714,4.31,257.81,77.87,372.13,2550.00,-2771.51,5.00,0.10,10.00,450
1,11270,0.62,54.62,89.24,360.76,2550.00,-1009.47,5.00,0.10,10.00,450
-6,16720,-3.69,-220.90,64.11,385.89,2550.00,1503.27,5.00,0.10,10.00,450
-11,16710,-6.77,-405.23,9.17,440.83,2550.00,3287.99,5.00,0.10,10.00,450
-10,16716,-6.16,-368.26,-48.48,498.48,2550.00,3448.69,5.00,0.10,10.00,450
-1,16720,-0.62,-36.82,-70.89,520.89,2550.00,1340.38,5.00,0.10,10.00,450
5,16717,3.08,184.12,-49.82,499.82,2550.00,-1260.64,5.00,0.10,10.00,450
11,16716,6.77,405.09,0.35,449.65,2550.00,-3001.18,5.00,0.10,10.00,450
11,16708,6.77,405.28,59.29,390.71,2550.00,-3527.88,5.00,0.10,10.00,450
3,16716,1.85,110.48,88.18,361.82,2550.00,-1728.31,5.00,0.10,10.00,450
-4,16700,-2.46,-147.44,72.62,377.38,2550.00,932.08,5.00,0.10,10.00,450
-10,16716,-6.16,-368.26,24.47,425.53,2550.00,2880.19,5.00,0.10,10.00,450
-10,16720,-6.16,-368.17,-32.71,482.71,2550.00,3420.15,5.00,0.10,10.00,450
-1,16719,-0.62,-36.82,-57.42,507.42,2550.00,1477.79,5.00,0.10,10.00,450
6,16713,3.69,221.00,-35.63,485.63,2550.00,-1303.86,5.00,0.10,10.00,450
11,16693,6.77,405.64,15.19,434.81,2550.00,-3044.46,5.00,0.10,10.00,450
7,16722,4.31,257.69,61.26,388.74,2550.00,-2755.21,5.00,0.10,10.00,450
0,16718,0.00,0.00,71.08,378.92,2550.00,-587.10,5.00,0.10,10.00,450
-4,11268,-2.46,-218.52,44.79,405.21,2550.00,2332.82,5.00,0.10,10.00,450
-12,16716,-7.39,-441.91,-9.83,459.83,2550.00,3267.50,5.00,0.10,10.00,450
-9,16711,-5.54,-331.53,-64.70,514.70,2550.00,3283.59,5.00,0.10,10.00,450
-2,16721,-1.23,-73.63,-84.75,534.75,2550.00,1199.08,5.00,0.10,10.00,450
6,16716,3.69,220.96,-61.65,511.65,2550.00,-1381.82,5.00,0.10,10.00,450
12,16717,7.39,441.88,-4.39,454.39,2550.00,-3424.99,5.00,0.10,10.00,450
11,16714,6.77,405.13,57.91,392.09,2550.00,-3727.68,5.00,0.10,10.00,450
3,16717,1.85,110.47,86.99,363.01,2550.00,-1739.61,5.00,0.10,10.00,450
-4,16706,-2.46,-147.39,71.60,378.40,2550.00,921.14,5.00,0.10,10.00,450
-11,16719,-6.77,-405.01,20.93,429.07,2550.00,3030.63,5.00,0.10,10.00,450
-9,16702,-5.54,-331.71,-35.76,485.76,2550.00,3394.20,5.00,0.10,10.00,450
0,16718,0.00,0.00,-54.68,504.68,2550.00,1132.21,5.00,0.10,10.00,450
6,16710,3.69,221.03,-30.61,480.61,2550.00,-1440.77,5.00,0.10,10.00,450
11,16689,6.77,405.74,19.49,430.51,2550.00,-3001.87,5.00,0.10,10.00,450
6,16721,3.69,220.89,62.26,387.74,2550.00,-2558.06,5.00,0.10,10.00,450
0,16718,0.00,0.00,69.25,380.75,2550.00,-418.14,5.00,0.10,10.00,450
-4,11265,-2.46,-218.58,43.23,406.77,2550.00,2310.14,5.00,0.10,10.00,450
-11,16716,-6.77,-405.09,-8.49,458.49,2550.00,3093.71,5.00,0.10,10.00,450
-10,16714,-6.16,-368.30,-63.55,513.55,2550.00,3294.47,5.00,0.10,10.00,450
-1,16722,-0.62,-36.81,-83.76,533.76,2550.00,1208.84,5.00,0.10,10.00,450
5,16720,3.08,184.09,-60.81,510.81,2550.00,-1372.66,5.00,0.10,10.00,450
12,16716,7.39,441.91,-6.36,456.36,2550.00,-3257.43,5.00,0.10,10.00,450
11,16712,6.77,405.18,56.24,393.76,2550.00,-3745.64,5.00,0.10,10.00,450
3,16720,1.85,110.45,85.56,364.44,2550.00,-1754.05,5.00,0.10,10.00,450
-4,16704,-2.46,-147.41,70.38,379.62,2550.00,908.93,5.00,0.10,10.00,450
-11,16725,-6.77,-404.87,19.90,430.10,2550.00,3018.32,5.00,0.10,10.00,450
-8,16701,-4.92,-294.87,-33.95,483.95,2550.00,3224.14,5.00,0.10,10.00,450
-2,16715,-1.23,-73.66,-55.82,505.82,2550.00,1308.56,5.00,0.10,10.00,450
7,16717,4.31,257.77,-34.27,484.27,2550.00,-1289.28,5.00,0.10,10.00,450
13,16717,8.00,478.71,24.35,425.65,2550.00,-3506.51,5.00,0.10,10.00,450
12,16711,7.39,442.04,87.83,362.17,2550.00,-3798.42,5.00,0.10,10.00,450
3,16694,1.85,110.62,115.24,334.76,2550.00,-1641.99,5.00,0.10,10.00,450
-4,16721,-2.46,-147.26,95.75,354.25,2550.00,1165.72,5.00,0.10,10.00,450
-9,16719,-5.54,-331.37,46.92,403.08,2550.00,2920.24,5.00,0.10,10.00,450
-4,16717,-2.46,-147.29,5.23,444.77,2550.00,2494.34,5.00,0.10,10.00,450
1,11270,0.62,54.62,-2.28,452.28,2550.00,666.33,5.00,0.10,10.00,450
8,16708,4.92,294.75,23.48,426.52,2550.00,-1542.23,5.00,0.10,10.00,450
14,16715,8.62,515.59,79.05,370.95,2550.00,-3324.22,5.00,0.10,10.00,450
13,16715,8.00,478.77,139.90,310.10,2550.00,-3640.35,5.00,0.10,10.00,450
5,16717,3.08,184.12,167.73,282.27,2550.00,-1664.96,5.00,0.10,10.00,450
-3,16713,-1.85,-110.50,148.60,301.40,2550.00,1144.55,5.00,0.10,10.00,450
-10,16716,-6.16,-368.26,92.05,357.95,2550.00,3382.93,5.00,0.10,10.00,450
-8,16717,-4.92,-294.59,30.36,419.64,2550.00,3690.55,5.00,0.10,10.00,450
-1,16719,-0.62,-36.82,1.80,448.20,2550.00,1708.15,5.00,0.10,10.00,450
7,16697,4.31,258.07,17.64,432.36,2550.00,-948.97,5.00,0.10,10.00,450
13,16716,8.00,478.74,68.71,381.29,2550.00,-3054.80,5.00,0.10,10.00,450
11,16710,6.77,405.23,123.03,326.97,2550.00,-3250.85,5.00,0.10,10.00,450
4,16695,2.46,147.49,145.30,304.70,2550.00,-1334.28,5.00,0.10,10.00,450
-4,16722,-2.46,-147.25,124.11,325.89,2550.00,1267.62,5.00,0.10,10.00,450
-9,16721,-5.54,-331.33,71.15,378.85,2550.00,3167.31,5.00,0.10,10.00,450
-4,16718,-2.46,-147.29,25.92,424.08,2550.00,2705.52,5.00,0.10,10.00,450
3,16716,1.85,110.48,19.45,430.55,2550.00,386.65,5.00,0.10,10.00,450
6,11267,3.69,327.82,48.52,401.48,2550.00,-2579.90,5.00,0.10,10.00,450
14,16714,8.62,515.62,102.84,347.16,2550.00,-3249.88,5.00,0.10,10.00,450
13,16716,8.00,478.74,160.21,289.79,2550.00,-3432.35,5.00,0.10,10.00,450
5,16718,3.08,184.11,185.08,264.92,2550.00,-1487.25,5.00,0.10,10.00,450
-2,16714,-1.23,-73.66,166.10,283.90,2550.00,1135.62,5.00,0.10,10.00,450
-9,16719,-5.54,-331.37,112.36,337.64,2550.00,3214.11,5.00,0.10,10.00,450
-8,16714,-4.92,-294.64,50.38,399.62,2550.00,3708.19,5.00,0.10,10.00,450
1,16712,0.62,36.83,24.26,425.74,2550.00,1563.20,5.00,0.10,10.00,450
7,16702,4.31,258.00,42.18,407.82,2550.00,-1073.06,5.00,0.10,10.00,450
13,16713,8.00,478.82,89.66,360.34,2550.00,-2841.04,5.00,0.10,10.00,450
12,16712,7.39,442.02,143.61,306.39,2550.00,-3228.01,5.00,0.10,10.00,450
5,16713,3.08,184.16,168.23,281.77,2550.00,-1473.05,5.00,0.10,10.00,450
-3,16695,-1.85,-110.62,149.02,300.98,2550.00,1150.47,5.00,0.10,10.00,450
-9,16721,-5.54,-331.33,95.09,354.91,2550.00,3225.35,5.00,0.10,10.00,450
-3,16721,-1.85,-110.44,49.04,400.96,2550.00,2753.70,5.00,0.10,10.00,450
4,16719,2.46,147.28,44.57,405.43,2550.00,267.91,5.00,0.10,10.00,450
7,11265,4.31,382.52,76.63,373.37,2550.00,-2846.21,5.00,0.10,10.00,450
15,16718,9.23,552.32,133.50,316.50,2550.00,-3401.65,5.00,0.10,10.00,450
13,16714,8.00,478.79,189.07,260.93,2550.00,-3325.04,5.00,0.10,10.00,450
5,16714,3.08,184.15,209.73,240.27,2550.00,-1235.97,5.00,0.10,10.00,450
-3,16716,-1.85,-110.48,184.47,265.53,2550.00,1510.95,5.00,0.10,10.00,450
-9,16717,-5.54,-331.41,125.37,324.63,2550.00,3535.49,5.00,0.10,10.00,450
-7,16720,-4.31,-257.72,64.18,385.82,2550.00,3659.86,5.00,0.10,10.00,450
1,16717,0.62,36.82,38.73,411.27,2550.00,1522.47,5.00,0.10,10.00,450
7,16705,4.31,257.95,54.53,395.47,2550.00,-946.16,5.00,0.10,10.00,450
14,16697,8.62,516.15,102.92,347.08,2550.00,-2898.30,5.00,0.10,10.00,450
12,16719,7.39,441.83,157.64,292.36,2550.00,-3272.57,5.00,0.10,10.00,450
5,16718,3.08,184.11,180.19,269.81,2550.00,-1349.03,5.00,0.10,10.00,450
-3,16709,-1.85,-110.52,159.24,290.76,2550.00,1253.88,5.00,0.10,10.00,450
-8,16696,-4.92,-294.96,106.47,343.53,2550.00,3160.54,5.00,0.10,10.00,450
-4,16721,-2.46,-147.26,58.73,391.27,2550.00,2855.01,5.00,0.10,10.00,450
4,16720,2.46,147.27,50.16,399.84,2550.00,512.83,5.00,0.10,10.00,450
11,16715,6.77,405.11,83.05,366.95,2550.00,-1967.69,5.00,0.10,10.00,450
10,11270,6.16,546.21,140.18,309.82,2550.00,-5069.31,5.00,0.10,10.00,450
13,16719,8.00,478.65,194.32,255.68,2550.00,-3238.46,5.00,0.10,10.00,450
5,16713,3.08,184.16,214.21,235.79,2550.00,-1189.59,5.00,0.10,10.00,450
-2,16720,-1.23,-73.63,190.98,259.02,2550.00,1389.21,5.00,0.10,10.00,450
-8,16712,-4.92,-294.68,136.28,313.72,2550.00,3272.85,5.00,0.10,10.00,450
-8,16721,-4.92,-294.52,73.49,376.51,2550.00,3755.20,5.00,0.10,10.00,450
1,16713,0.62,36.83,44.00,406.00,2550.00,1764.46,5.00,0.10,10.00,450
7,16709,4.31,257.89,59.03,390.97,2550.00,-899.60,5.00,0.10,10.00,450
14,16713,8.62,515.66,106.73,343.27,2550.00,-2853.78,5.00,0.10,10.00,450
12,16702,7.39,442.28,160.88,289.12,2550.00,-3242.45,5.00,0.10,10.00,450
4,16714,2.46,147.32,180.32,269.68,2550.00,-1162.74,5.00,0.10,10.00,450
-3,16718,-1.85,-110.46,156.67,293.33,2550.00,1414.24,5.00,0.10,10.00,450
-9,16716,-5.54,-331.43,101.63,348.37,2550.00,3292.94,5.00,0.10,10.00,450
-8,16716,-4.92,-294.61,41.22,408.78,2550.00,3614.13,5.00,0.10,10.00,450
0,16692,0.00,0.00,13.75,436.25,2550.00,1645.40,5.00,0.10,10.00,450
7,16720,4.31,257.72,30.51,419.49,2550.00,-1002.05,5.00,0.10,10.00,450
13,16713,8.00,478.82,79.67,370.33,2550.00,-2941.81,5.00,0.10,10.00,450
6,11272,3.69,327.67,126.75,323.25,2550.00,-4176.77,5.00,0.10,10.00,450
2,16710,1.23,73.68,137.46,312.54,2550.00,-641.07,5.00,0.10,10.00,450
-4,16717,-2.46,-147.29,112.04,337.96,2550.00,1521.16,5.00,0.10,10.00,450
-11,16716,-6.77,-405.09,55.47,394.53,2550.00,3384.21,5.00,0.10,10.00,450
-9,16719,-5.54,-331.37,-6.25,456.25,2550.00,3691.14,5.00,0.10,10.00,450
-2,16714,-1.23,-73.66,-34.82,484.82,2550.00,1709.61,5.00,0.10,10.00,450
6,16718,3.69,220.93,-19.02,469.02,2550.00,-945.39,5.00,0.10,10.00,450
12,16709,7.39,442.10,32.03,417.97,2550.00,-3054.92,5.00,0.10,10.00,450
11,16715,6.77,405.11,89.03,360.97,2550.00,-3410.14,5.00,0.10,10.00,450
3,16704,1.85,110.56,113.57,336.43,2550.00,-1469.25,5.00,0.10,10.00,450
-4,16713,-2.46,-147.33,94.31,355.69,2550.00,1152.30,5.00,0.10,10.00,450
-11,16720,-6.77,-404.99,40.33,409.67,2550.00,3228.37,5.00,0.10,10.00,450
-9,16715,-5.54,-331.45,-19.17,469.17,2550.00,3559.78,5.00,0.10,10.00,450
0,16716,0.00,0.00,-40.50,490.50,2550.00,1276.10,5.00,0.10,10.00,450
6,16692,3.69,221.27,-18.48,468.48,2550.00,-1319.29,5.00,0.10,10.00,450
12,16722,7.39,441.75,32.49,417.51,2550.00,-3047.84,5.00,0.10,10.00,450
7,16714,4.31,257.81,78.67,371.33,2550.00,-2763.25,5.00,0.10,10.00,450
-1,11270,-0.62,-54.62,81.98,368.02,2550.00,-293.34,5.00,0.10,10.00,450
-5,16715,-3.08,-184.14,52.63,397.37,2550.00,1755.96,5.00,0.10,10.00,450
-12,16718,-7.39,-441.86,-0.63,450.63,2550.00,3185.58,5.00,0.10,10.00,450
-10,16719,-6.16,-368.19,-59.51,509.51,2550.00,3521.75,5.00,0.10,10.00,450
-2,16717,-1.23,-73.65,-82.99,532.99,2550.00,1404.43,5.00,0.10,10.00,450
5,16718,3.08,184.11,-62.83,512.83,2550.00,-1205.73,5.00,0.10,10.00,450
11,16714,6.77,405.13,-10.76,460.76,2550.00,-3115.34,5.00,0.10,10.00,450
11,16718,6.77,405.04,49.79,400.21,2550.00,-3621.92,5.00,0.10,10.00,450
2,16711,1.23,73.67,77.37,372.63,2550.00,-1650.44,5.00,0.10,10.00,450
-5,16713,-3.08,-184.16,58.03,391.97,2550.00,1157.19,5.00,0.10,10.00,450
-11,16703,-6.77,-405.40,6.64,443.36,2550.00,3076.87,5.00,0.10,10.00,450
-10,16713,-6.16,-368.33,-50.66,500.66,2550.00,3428.27,5.00,0.10,10.00,450
-2,16721,-1.23,-73.63,-75.44,525.44,2550.00,1481.88,5.00,0.10,10.00,450
6,16719,3.69,220.92,-53.70,503.70,2550.00,-1300.08,5.00,0.10,10.00,450
12,16711,7.39,442.04,2.40,447.60,2550.00,-3357.28,5.00,0.10,10.00,450
10,16691,6.16,368.81,61.08,388.92,2550.00,-3515.62,5.00,0.10,10.00,450
4,16721,2.46,147.26,89.74,360.26,2550.00,-1713.52,5.00,0.10,10.00,450
-4,16717,-2.46,-147.29,76.63,373.37,2550.00,783.87,5.00,0.10,10.00,450
-7,11328,-4.31,-380.39,27.03,422.97,2550.00,4378.86,5.00,0.10,10.00,450
-7,16659,-4.31,-258.66,-23.44,473.44,2550.00,3029.55,5.00,0.10,10.00,450
0,16717,0.00,0.00,-38.85,488.85,2550.00,921.71,5.00,0.10,10.00,450
8,16710,4.92,294.71,-11.72,461.72,2550.00,-1623.41,5.00,0.10,10.00,450
14,16720,8.62,515.44,48.97,401.03,2550.00,-3629.82,5.00,0.10,10.00,450
12,16710,7.39,442.07,111.53,338.47,2550.00,-3743.71,5.00,0.10,10.00,450
4,16718,2.46,147.29,138.15,311.85,2550.00,-1592.44,5.00,0.10,10.00,450
-3,16707,-1.85,-110.54,120.65,329.35,2550.00,1047.12,5.00,0.10,10.00,450
-9,16720,-5.54,-331.35,70.87,379.13,2550.00,2977.58,5.00,0.10,10.00,450
-8,16717,-4.92,-294.59,14.95,435.05,2550.00,3344.83,5.00,0.10,10.00,450
0,16702,0.00,0.00,-8.68,458.68,2550.00,1414.76,5.00,0.10,10.00,450
7,16709,4.31,257.89,11.36,438.64,2550.00,-1199.42,5.00,0.10,10.00,450
12,16687,7.39,442.68,60.71,389.29,2550.00,-2956.92,5.00,0.10,10.00,450
8,16721,4.92,294.52,105.51,344.49,2550.00,-2679.56,5.00,0.10,10.00,450
0,16721,0.00,0.00,111.55,338.45,2550.00,-361.00,5.00,0.10,10.00,450
-4,11322,-2.46,-217.48,79.43,370.57,2550.00,2836.84,5.00,0.10,10.00,450
-10,16659,-6.16,-369.52,25.10,424.90,2550.00,3261.32,5.00,0.10,10.00,450
-10,16718,-6.16,-368.22,-32.27,482.27,2550.00,3431.72,5.00,0.10,10.00,450
-2,16717,-1.23,-73.65,-59.73,509.73,2550.00,1642.39,5.00,0.10,10.00,450
6,16717,3.69,220.94,-40.28,490.28,2550.00,-1163.09,5.00,0.10,10.00,450
13,16724,8.00,478.51,16.52,433.48,2550.00,-3396.41,5.00,0.10,10.00,450
11,16709,6.77,405.26,78.44,371.56,2550.00,-3706.18,5.00,0.10,10.00,450
3,16713,1.85,110.50,104.54,345.46,2550.00,-1561.30,5.00,0.10,10.00,450
-5,16714,-3.08,-184.15,83.91,366.09,2550.00,1233.96,5.00,0.10,10.00,450
-10,16712,-6.16,-368.35,31.44,418.56,2550.00,3139.85,5.00,0.10,10.00,450
-9,16719,-5.54,-331.37,-24.09,474.09,2550.00,3321.37,5.00,0.10,10.00,450
-2,16720,-1.23,-73.63,-50.06,500.06,2550.00,1553.07,5.00,0.10,10.00,450
6,16704,3.69,221.11,-32.01,482.01,2550.00,-1080.28,5.00,0.10,10.00,450
13,16712,8.00,478.85,23.62,426.38,2550.00,-3328.83,5.00,0.10,10.00,450
11,16717,6.77,405.06,84.52,365.48,2550.00,-3643.03,5.00,0.10,10.00,450
4,16710,2.46,147.36,112.40,337.60,2550.00,-1668.24,5.00,0.10,10.00,450
-3,16695,-1.85,-110.62,98.66,351.34,2550.00,822.71,5.00,0.10,10.00,450
-9,16721,-5.54,-331.33,52.08,397.92,2550.00,2785.62,5.00,0.10,10.00,450
-4,16719,-2.46,-147.28,9.63,440.37,2550.00,2538.84,5.00,0.10,10.00,450
4,16716,2.46,147.30,8.23,441.77,2550.00,84.04,5.00,0.10,10.00,450
6,11264,3.69,327.90,41.62,408.38,2550.00,-2964.61,5.00,0.10,10.00,450
14,16713,8.62,515.66,96.96,353.04,2550.00,-3310.83,5.00,0.10,10.00,450
13,16713,8.00,478.82,155.20,294.80,2550.00,-3484.85,5.00,0.10,10.00,450
5,16716,3.08,184.13,180.80,269.20,2550.00,-1531.70,5.00,0.10,10.00,450
-2,16718,-1.23,-73.64,162.45,287.55,2550.00,1097.85,5.00,0.10,10.00,450
-9,16711,-5.54,-331.53,109.24,340.76,2550.00,3184.40,5.00,0.10,10.00,450
-8,16715,-4.92,-294.63,47.70,402.30,2550.00,3681.28,5.00,0.10,10.00,450
-1,16718,-0.62,-36.82,16.61,433.39,2550.00,1859.91,5.00,0.10,10.00,450
7,16705,4.31,257.95,30.28,419.72,2550.00,-818.52,5.00,0.10,10.00,450
13,16711,8.00,478.88,79.50,370.50,2550.00,-2945.38,5.00,0.10,10.00,450
12,16711,7.39,442.04,134.94,315.06,2550.00,-3317.33,5.00,0.10,10.00,450
4,16692,2.46,147.52,158.16,291.84,2550.00,-1391.02,5.00,0.10,10.00,450
-4,16720,-2.46,-147.27,135.08,314.92,2550.00,1379.96,5.00,0.10,10.00,450
-9,16720,-5.54,-331.35,80.52,369.48,2550.00,3263.52,5.00,0.10,10.00,450
-4,16722,-2.46,-147.25,33.92,416.08,2550.00,2786.64,5.00,0.10,10.00,450
3,16717,1.85,110.47,26.29,423.71,2550.00,456.41,5.00,0.10,10.00,450
7,11273,4.31,382.25,58.32,391.68,2550.00,-2841.44,5.00,0.10,10.00,450
14,16704,8.62,515.93,115.19,334.81,2550.00,-3404.73,5.00,0.10,10.00,450
13,16718,8.00,478.68,170.78,279.22,2550.00,-3325.13,5.00,0.10,10.00,450
5,16716,3.08,184.13,194.10,255.90,2550.00,-1394.96,5.00,0.10,10.00,450
-2,16715,-1.23,-73.66,173.81,276.19,2550.00,1214.26,5.00,0.10,10.00,450
-8,16716,-4.92,-294.61,121.62,328.38,2550.00,3121.87,5.00,0.10,10.00,450
-8,16720,-4.92,-294.54,60.97,389.03,2550.00,3627.17,5.00,0.10,10.00,450
0,16711,0.00,0.00,30.63,419.37,2550.00,1815.84,5.00,0.10,10.00,450
8,16698,4.92,294.93,47.63,402.37,2550.00,-1018.00,5.00,0.10,10.00,450
14,16710,8.62,515.75,99.69,350.31,2550.00,-3115.70,5.00,0.10,10.00,450
13,16717,8.00,478.71,157.53,292.47,2550.00,-3460.04,5.00,0.10,10.00,450
5,16712,3.08,184.17,182.79,267.21,2550.00,-1511.37,5.00,0.10,10.00,450
-3,16693,-1.85,-110.63,161.46,288.54,2550.00,1277.99,5.00,0.10,10.00,450
-8,16721,-4.92,-294.52,108.39,341.61,2550.00,3173.71,5.00,0.10,10.00,450
-3,16720,-1.85,-110.45,63.08,386.92,2550.00,2709.74,5.00,0.10,10.00,450
5,16723,3.08,184.05,59.23,390.77,2550.00,230.34,5.00,0.10,10.00,450
6,11323,3.69,326.19,87.73,362.27,2550.00,-2516.84,5.00,0.10,10.00,450
15,16656,9.23,554.38,139.03,310.97,2550.00,-3079.80,5.00,0.10,10.00,450
14,16723,8.62,515.35,196.60,253.40,2550.00,-3443.06,5.00,0.10,10.00,450
5,16711,3.08,184.18,218.83,231.17,2550.00,-1329.76,5.00,0.10,10.00,450
-3,16716,-1.85,-110.48,192.24,257.76,2550.00,1590.26,5.00,0.10,10.00,450
-9,16717,-5.54,-331.41,132.01,317.99,2550.00,3603.35,5.00,0.10,10.00,450
-7,16716,-4.31,-257.78,69.84,380.16,2550.00,3718.97,5.00,0.10,10.00,450
1,16718,0.62,36.82,43.56,406.44,2550.00,1572.11,5.00,0.10,10.00,450
7,16706,4.31,257.94,58.66,391.34,2550.00,-903.80,5.00,0.10,10.00,450
13,16700,8.00,479.20,103.76,346.24,2550.00,-2700.56,5.00,0.10,10.00,450
13,16715,8.00,478.77,158.35,291.65,2550.00,-3266.01,5.00,0.10,10.00,450
4,16720,2.46,147.27,180.80,269.20,2550.00,-1343.10,5.00,0.10,10.00,450
-3,16711,-1.85,-110.51,157.08,292.92,2550.00,1419.51,5.00,0.10,10.00,450
-9,16714,-5.54,-331.47,101.97,348.03,2550.00,3297.26,5.00,0.10,10.00,450
-9,16695,-5.54,-331.85,38.79,411.21,2550.00,3784.24,5.00,0.10,10.00,450
0,16722,0.00,0.00,8.97,441.03,2550.00,1783.44,5.00,0.10,10.00,450
6,16714,3.69,220.98,23.75,426.25,2550.00,-884.15,5.00,0.10,10.00,450
8,11270,4.92,436.97,68.18,381.82,2550.00,-3942.47,5.00,0.10,10.00,450
10,16709,6.16,368.41,116.86,333.14,2550.00,-2913.26,5.00,0.10,10.00,450
2,16718,1.23,73.64,131.98,318.02,2550.00,-904.44,5.00,0.10,10.00,450
-5,16713,-3.08,-184.16,104.66,345.34,2550.00,1634.34,5.00,0.10,10.00,450
-11,16715,-6.77,-405.11,46.48,403.52,2550.00,3480.70,5.00,0.10,10.00,450
-10,16720,-6.16,-368.17,-16.60,466.60,2550.00,3772.82,5.00,0.10,10.00,450
-2,16721,-1.23,-73.63,-46.34,496.34,2550.00,1778.60,5.00,0.10,10.00,450
6,16713,3.69,221.00,-28.84,478.84,2550.00,-1046.70,5.00,0.10,10.00,450
12,16716,7.39,441.91,23.63,426.37,2550.00,-3138.96,5.00,0.10,10.00,450
10,16713,6.16,368.33,79.16,370.84,2550.00,-3322.90,5.00,0.10,10.00,450
3,16699,1.85,110.59,102.47,347.53,2550.00,-1395.73,5.00,0.10,10.00,450
-4,16720,-2.46,-147.27,84.84,365.16,2550.00,1054.47,5.00,0.10,10.00,450
-11,16715,-6.77,-405.11,32.24,417.76,2550.00,3146.85,5.00,0.10,10.00,450
-9,16716,-5.54,-331.43,-26.09,476.09,2550.00,3489.31,5.00,0.10,10.00,450
-1,16693,-0.62,-36.88,-49.09,499.09,2550.00,1378.07,5.00,0.10,10.00,450
7,16720,4.31,257.72,-25.85,475.85,2550.00,-1390.24,5.00,0.10,10.00,450
12,16722,7.39,441.75,28.85,421.15,2550.00,-3270.86,5.00,0.10,10.00,450
7,16718,4.31,257.75,75.56,374.44,2550.00,-2794.11,5.00,0.10,10.00,450
1,11327,0.62,54.35,87.25,362.75,2550.00,-1031.95,5.00,0.10,10.00,450
-5,16656,-3.08,-184.79,65.01,384.99,2550.00,1334.95,5.00,0.10,10.00,450
-11,16714,-6.77,-405.13,12.58,437.42,2550.00,3137.41,5.00,0.10,10.00,450
-9,16721,-5.54,-331.33,-42.88,492.88,2550.00,3316.24,5.00,0.10,10.00,450
-1,16717,-0.62,-36.82,-63.42,513.42,2550.00,1228.81,5.00,0.10,10.00,450
6,16717,3.69,220.94,-40.75,490.75,2550.00,-1355.67,5.00,0.10,10.00,450
12,16714,7.39,441.96,13.46,436.54,2550.00,-3243.38,5.00,0.10,10.00,450
11,16717,6.77,405.06,73.15,376.85,2550.00,-3571.16,5.00,0.10,10.00,450
4,16708,2.46,147.37,102.69,347.31,2550.00,-1767.82,5.00,0.10,10.00,450
-4,16718,-2.46,-147.29,87.70,362.30,2550.00,896.43,5.00,0.10,10.00,450
-10,16700,-6.16,-368.61,37.34,412.66,2550.00,3015.70,5.00,0.10,10.00,450
-9,16717,-5.54,-331.41,-19.07,469.07,2550.00,3374.64,5.00,0.10,10.00,450
0,16720,0.00,0.00,-40.41,490.41,2550.00,1276.46,5.00,0.10,10.00,450
6,16704,3.69,221.11,-18.42,468.42,2550.00,-1316.91,5.00,0.10,10.00,450
12,16695,7.39,442.47,32.58,417.42,2550.00,-3054.66,5.00,0.10,10.00,450
7,16722,4.31,257.69,78.80,371.20,2550.00,-2763.70,5.00,0.10,10.00,450
0,16717,0.00,0.00,86.05,363.95,2550.00,-434.03,5.00,0.10,10.00,450
-4,11265,-2.46,-218.58,57.57,392.43,2550.00,2527.85,5.00,0.10,10.00,450
-11,16710,-6.77,-405.23,3.76,446.24,2550.00,3220.80,5.00,0.10,10.00,450
-9,16719,-5.54,-331.37,-50.42,500.42,2550.00,3240.21,5.00,0.10,10.00,450
-2,16719,-1.23,-73.64,-72.54,522.54,2550.00,1323.28,5.00,0.10,10.00,450
6,16717,3.69,220.94,-51.23,501.23,2550.00,-1275.04,5.00,0.10,10.00,450
11,16713,6.77,405.16,1.83,448.17,2550.00,-3174.73,5.00,0.10,10.00,450
11,16716,6.77,405.09,60.55,389.45,2550.00,-3512.69,5.00,0.10,10.00,450
3,16711,1.85,110.51,89.25,360.75,2550.00,-1717.13,5.00,0.10,10.00,450
-4,16713,-2.46,-147.33,73.54,376.46,2550.00,940.00,5.00,0.10,10.00,450
-11,16699,-6.77,-405.50,22.55,427.45,2550.00,3053.00,5.00,0.10,10.00,450
-9,16720,-5.54,-331.35,-34.38,484.38,2550.00,3405.24,5.00,0.10,10.00,450
-2,16720,-1.23,-73.63,-58.85,508.85,2550.00,1463.12,5.00,0.10,10.00,450
6,16715,3.69,220.97,-39.53,489.53,2550.00,-1155.70,5.00,0.10,10.00,450
11,16689,6.77,405.74,11.87,438.13,2550.00,-3079.61,5.00,0.10,10.00,450
7,16719,4.31,257.74,58.44,391.56,2550.00,-2785.36,5.00,0.10,10.00,450
-2,16721,-1.23,-73.63,63.31,386.69,2550.00,-291.33,5.00,0.10,10.00,450
-8,16715,-4.92,-294.63,27.26,422.74,2550.00,2156.85,5.00,0.10,10.00,450
-8,11331,-4.92,-434.62,-29.81,479.81,2550.00,5036.46,5.00,0.10,10.00,450
-10,16658,-6.16,-369.54,-84.00,534.00,2550.00,3253.10,5.00,0.10,10.00,450
-3,16721,-1.85,-110.44,-106.68,556.68,2550.00,1356.29,5.00,0.10,10.00,450
5,16719,3.08,184.10,-85.74,535.74,2550.00,-1252.31,5.00,0.10,10.00,450
12,16715,7.39,441.94,-27.65,477.65,2550.00,-3475.56,5.00,0.10,10.00,450
10,16718,6.16,368.22,35.37,414.63,2550.00,-3769.36,5.00,0.10,10.00,450
3,16716,1.85,110.48,65.05,384.95,2550.00,-1775.87,5.00,0.10,10.00,450
-5,16711,-3.08,-184.18,50.19,399.81,2550.00,889.44,5.00,0.10,10.00,450
-11,16717,-6.77,-405.06,-0.04,450.04,2550.00,3004.40,5.00,0.10,10.00,450
-9,16713,-5.54,-331.49,-53.65,503.65,2550.00,3208.03,5.00,0.10,10.00,450
-2,16715,-1.23,-73.66,-75.31,525.31,2550.00,1295.94,5.00,0.10,10.00,450
6,16719,3.69,220.92,-53.60,503.60,2550.00,-1298.90,5.00,0.10,10.00,450
12,16703,7.39,442.26,2.51,447.49,2550.00,-3358.92,5.00,0.10,10.00,450
11,16715,6.77,405.11,63.83,386.17,2550.00,-3668.69,5.00,0.10,10.00,450
3,16711,1.85,110.51,92.05,357.95,2550.00,-1688.60,5.00,0.10,10.00,450
-4,16688,-2.46,-147.55,75.91,374.09,2550.00,966.88,5.00,0.10,10.00,450
-9,16720,-5.54,-331.35,29.96,420.04,2550.00,2748.05,5.00,0.10,10.00,450
-5,16721,-3.08,-184.07,-11.93,461.93,2550.00,2505.71,5.00,0.10,10.00,450
3,16720,1.85,110.45,-15.55,465.55,2550.00,216.35,5.00,0.10,10.00,450
6,11326,3.69,326.11,18.50,431.50,2550.00,-3006.53,5.00,0.10,10.00,450
14,16658,8.62,517.36,77.20,372.80,2550.00,-3524.03,5.00,0.10,10.00,450
12,16713,7.39,441.99,135.77,314.23,2550.00,-3504.39,5.00,0.10,10.00,450
4,16718,2.46,147.29,158.85,291.15,2550.00,-1380.34,5.00,0.10,10.00,450
-3,16714,-1.85,-110.49,138.34,311.66,2550.00,1227.31,5.00,0.10,10.00,450
-9,16717,-5.54,-331.41,85.97,364.03,2550.00,3132.60,5.00,0.10,10.00,450
-8,16717,-4.92,-294.59,27.84,422.16,2550.00,3476.96,5.00,0.10,10.00,450
0,16721,0.00,0.00,2.33,447.67,2550.00,1525.71,5.00,0.10,10.00,450
6,16699,3.69,221.18,18.09,431.91,2550.00,-943.85,5.00,0.10,10.00,450
13,16699,8.00,479.22,66.44,383.56,2550.00,-2895.25,5.00,0.10,10.00,450
12,16718,7.39,441.86,123.80,326.20,2550.00,-3430.70,5.00,0.10,10.00,450
4,16712,2.46,147.34,148.62,301.38,2550.00,-1485.12,5.00,0.10,10.00,450
-3,16693,-1.85,-110.63,129.59,320.41,2550.00,1139.72,5.00,0.10,10.00,450
-9,16721,-5.54,-331.33,78.49,371.51,2550.00,3055.75,5.00,0.10,10.00,450
-4,16721,-2.46,-147.26,32.19,417.81,2550.00,2769.09,5.00,0.10,10.00,450
3,16719,1.85,110.46,24.81,425.19,2550.00,441.37,5.00,0.10,10.00,450
7,11267,4.31,382.45,57.07,392.93,2550.00,-2863.32,5.00,0.10,10.00,450
14,16710,8.62,515.75,114.13,335.87,2550.00,-3414.48,5.00,0.10,10.00,450
13,16719,8.00,478.65,169.86,280.14,2550.00,-3333.28,5.00,0.10,10.00,450
5,16717,3.08,184.12,193.31,256.69,2550.00,-1402.77,5.00,0.10,10.00,450
-2,16715,-1.23,-73.66,173.13,276.87,2550.00,1207.39,5.00,0.10,10.00,450
-9,16715,-5.54,-331.45,118.36,331.64,2550.00,3276.62,5.00,0.10,10.00,450
-7,16719,-4.31,-257.74,58.19,391.81,2550.00,3599.10,5.00,0.10,10.00,450
0,16718,0.00,0.00,30.93,419.07,2550.00,1630.48,5.00,0.10,10.00,450
8,16705,4.92,294.80,47.87,402.13,2550.00,-1014.43,5.00,0.10,10.00,450
13,16697,8.00,479.28,97.24,352.76,2550.00,-2956.44,5.00,0.10,10.00,450
12,16720,7.39,441.81,150.10,299.90,2550.00,-3161.39,5.00,0.10,10.00,450
4,16714,2.46,147.32,171.07,278.93,2550.00,-1254.90,5.00,0.10,10.00,450
-3,16688,-1.85,-110.66,148.76,301.24,2550.00,1336.74,5.00,0.10,10.00,450
-8,16720,-4.92,-294.54,97.54,352.46,2550.00,3063.27,5.00,0.10,10.00,450
-4,16720,-2.46,-147.27,51.14,398.86,2550.00,2775.42,5.00,0.10,10.00,450
4,16722,2.46,147.25,43.67,406.33,2550.00,446.58,5.00,0.10,10.00,450
10,16708,6.16,368.44,74.84,375.16,2550.00,-1865.32,5.00,0.10,10.00,450
10,11274,6.16,546.02,130.48,319.52,2550.00,-4935.78,5.00,0.10,10.00,450
13,16714,8.00,478.79,186.04,263.96,2550.00,-3323.91,5.00,0.10,10.00,450
5,16720,3.08,184.09,207.14,242.86,2550.00,-1261.71,5.00,0.10,10.00,450
-3,16714,-1.85,-110.49,182.25,267.75,2550.00,1488.82,5.00,0.10,10.00,450
-8,16719,-4.92,-294.55,126.16,323.84,2550.00,3355.23,5.00,0.10,10.00,450
-8,16718,-4.92,-294.57,64.85,385.15,2550.00,3667.13,5.00,0.10,10.00,450
0,16714,0.00,0.00,33.94,416.06,2550.00,1849.51,5.00,0.10,10.00,450
8,16704,4.92,294.82,50.44,399.56,2550.00,-988.28,5.00,0.10,10.00,450
14,16704,8.62,515.93,102.10,347.90,2550.00,-3092.55,5.00,0.10,10.00,450
12,16713,7.39,441.99,156.93,293.07,2550.00,-3280.68,5.00,0.10,10.00,450
5,16719,3.08,184.10,179.60,270.40,2550.00,-1355.77,5.00,0.10,10.00,450
-2,16713,-1.23,-73.67,161.42,288.58,2550.00,1087.90,5.00,0.10,10.00,450
-9,16713,-5.54,-331.49,108.35,341.65,2550.00,3174.92,5.00,0.10,10.00,450
-7,16695,-4.31,-258.11,49.61,400.39,2550.00,3518.57,5.00,0.10,10.00,450
0,16721,0.00,0.00,23.58,426.42,2550.00,1556.93,5.00,0.10,10.00,450
7,16716,4.31,257.78,38.90,411.10,2550.00,-916.73,5.00,0.10,10.00,450
8,11267,4.92,437.09,83.81,366.19,2550.00,-3985.68,5.00,0.10,10.00,450
11,16715,6.77,405.11,132.88,317.12,2550.00,-2936.03,5.00,0.10,10.00,450
1,16716,0.62,36.83,145.66,304.34,2550.00,-764.04,5.00,0.10,10.00,450
-4,16711,-2.46,-147.35,116.34,333.66,2550.00,1754.05,5.00,0.10,10.00,450
-11,16719,-6.77,-405.01,59.15,390.85,2550.00,3421.15,5.00,0.10,10.00,450
-10,16721,-6.16,-368.15,-5.77,455.77,2550.00,3882.64,5.00,0.10,10.00,450
-2,16716,-1.23,-73.65,-37.09,487.09,2550.00,1873.65,5.00,0.10,10.00,450
6,16713,3.69,221.00,-20.95,470.95,2550.00,-965.86,5.00,0.10,10.00,450
12,16711,7.39,442.04,30.38,419.62,2550.00,-3071.53,5.00,0.10,10.00,450
11,16705,6.77,405.35,87.63,362.37,2550.00,-3427.45,5.00,0.10,10.00,450
4,16712,2.46,147.34,115.07,334.93,2550.00,-1642.04,5.00,0.10,10.00,450
-4,16719,-2.46,-147.28,98.28,351.72,2550.00,1004.62,5.00,0.10,10.00,450
-11,16718,-6.77,-405.04,43.72,406.28,2550.00,3263.36,5.00,0.10,10.00,450
-9,16711,-5.54,-331.53,-16.29,466.29,2550.00,3590.77,5.00,0.10,10.00,450
0,16695,0.00,0.00,-38.04,488.04,2550.00,1303.26,5.00,0.10,10.00,450
6,16721,3.69,220.89,-16.41,466.41,2550.00,-1293.89,5.00,0.10,10.00,450
12,16717,7.39,441.88,34.24,415.76,2550.00,-3029.58,5.00,0.10,10.00,450
5,11328,3.08,271.71,81.19,368.81,2550.00,-4144.68,5.00,0.10,10.00,450
2,16655,1.23,73.92,94.50,355.50,2550.00,-799.06,5.00,0.10,10.00,450
-5,16714,-3.08,-184.15,72.68,377.32,2550.00,1305.57,5.00,0.10,10.00,450
