EESchema Schematic File Version 4
EELAYER 30 0
EELAYER END
$Descr A3 16535 11693
encoding utf-8
Sheet 1 1
Title "Carte Alimentation"
Date "2021-03-05"
Rev "2.0"
Comp "Blums Prod _ Mougeot Jacquin"
Comment1 ""
Comment2 ""
Comment3 ""
Comment4 ""
$EndDescr
Text GLabel 8800 5100 0    50   Input ~ 0
CAN_H
Text GLabel 8800 5200 0    50   Input ~ 0
CAN_L
$Comp
L power:GND #PWR025
U 1 1 603C38EF
P 8050 5450
F 0 "#PWR025" H 8050 5200 50  0001 C CNN
F 1 "GND" H 8050 5300 50  0000 C CNN
F 2 "" H 8050 5450 50  0001 C CNN
F 3 "" H 8050 5450 50  0001 C CNN
	1    8050 5450
	1    0    0    -1  
$EndComp
$Comp
L power:+3.3V #PWR024
U 1 1 604ED261
P 8050 5150
F 0 "#PWR024" H 8050 5000 50  0001 C CNN
F 1 "+3.3V" H 8065 5323 50  0000 C CNN
F 2 "" H 8050 5150 50  0001 C CNN
F 3 "" H 8050 5150 50  0001 C CNN
	1    8050 5150
	1    0    0    -1  
$EndComp
Text GLabel 9550 4500 1    50   Input ~ 0
LD_CAN_TX
$Comp
L power:GND #PWR033
U 1 1 6066D041
P 9750 5050
F 0 "#PWR033" H 9750 4800 50  0001 C CNN
F 1 "GND" H 9755 4877 50  0000 C CNN
F 2 "" H 9750 5050 50  0001 C CNN
F 3 "" H 9750 5050 50  0001 C CNN
	1    9750 5050
	1    0    0    -1  
$EndComp
$Comp
L Mechanical:MountingHole_Pad H1
U 1 1 6070AABE
P 7900 6100
F 0 "H1" V 7854 6250 50  0000 L CNN
F 1 "MountingHole_Pad" V 7945 6250 50  0000 L CNN
F 2 "MountingHole:MountingHole_2.7mm_M2.5_Pad_Via" H 7900 6100 50  0001 C CNN
F 3 "~" H 7900 6100 50  0001 C CNN
	1    7900 6100
	0    1    1    0   
$EndComp
$Comp
L Mechanical:MountingHole_Pad H2
U 1 1 6070CFFF
P 7900 6300
F 0 "H2" V 7854 6450 50  0000 L CNN
F 1 "MountingHole_Pad" V 7945 6450 50  0000 L CNN
F 2 "MountingHole:MountingHole_2.7mm_M2.5_Pad_Via" H 7900 6300 50  0001 C CNN
F 3 "~" H 7900 6300 50  0001 C CNN
	1    7900 6300
	0    1    1    0   
$EndComp
$Comp
L Mechanical:MountingHole_Pad H3
U 1 1 60713549
P 7900 6500
F 0 "H3" V 7854 6650 50  0000 L CNN
F 1 "MountingHole_Pad" V 7945 6650 50  0000 L CNN
F 2 "MountingHole:MountingHole_2.7mm_M2.5_Pad_Via" H 7900 6500 50  0001 C CNN
F 3 "~" H 7900 6500 50  0001 C CNN
	1    7900 6500
	0    1    1    0   
$EndComp
$Comp
L Mechanical:MountingHole_Pad H4
U 1 1 60719AF0
P 7900 6700
F 0 "H4" V 7854 6850 50  0000 L CNN
F 1 "MountingHole_Pad" V 7945 6850 50  0000 L CNN
F 2 "MountingHole:MountingHole_2.7mm_M2.5_Pad_Via" H 7900 6700 50  0001 C CNN
F 3 "~" H 7900 6700 50  0001 C CNN
	1    7900 6700
	0    1    1    0   
$EndComp
$Comp
L power:GND #PWR039
U 1 1 6071FD69
P 7750 6700
F 0 "#PWR039" H 7750 6450 50  0001 C CNN
F 1 "GND" H 7755 6527 50  0000 C CNN
F 2 "" H 7750 6700 50  0001 C CNN
F 3 "" H 7750 6700 50  0001 C CNN
	1    7750 6700
	1    0    0    -1  
$EndComp
Wire Wire Line
	7750 6100 7800 6100
Wire Wire Line
	7800 6300 7750 6300
Connection ~ 7750 6300
Wire Wire Line
	7750 6300 7750 6100
Wire Wire Line
	7800 6500 7750 6500
Connection ~ 7750 6500
Wire Wire Line
	7750 6500 7750 6300
Wire Wire Line
	7800 6700 7750 6700
Wire Wire Line
	7750 6700 7750 6500
Connection ~ 7750 6700
Text GLabel 8800 5350 0    50   Input ~ 0
CAN_H
Text GLabel 8800 5450 0    50   Input ~ 0
CAN_L
$Comp
L power:GND #PWR0114
U 1 1 60733CA0
P 9550 5050
F 0 "#PWR0114" H 9550 4800 50  0001 C CNN
F 1 "GND" H 9555 4877 50  0000 C CNN
F 2 "" H 9550 5050 50  0001 C CNN
F 3 "" H 9550 5050 50  0001 C CNN
	1    9550 5050
	1    0    0    -1  
$EndComp
Wire Wire Line
	8950 4300 8900 4300
Wire Wire Line
	8900 4200 8950 4200
Wire Wire Line
	8050 4100 8100 4100
Wire Wire Line
	8100 4200 8050 4200
Wire Wire Line
	8050 4450 8050 4400
Wire Wire Line
	8050 4400 8100 4400
Wire Wire Line
	8050 4700 8050 4650
$Comp
L power:GND #PWR0115
U 1 1 60717921
P 8050 4700
F 0 "#PWR0115" H 8050 4450 50  0001 C CNN
F 1 "GND" H 8200 4600 50  0000 C CNN
F 2 "" H 8050 4700 50  0001 C CNN
F 3 "" H 8050 4700 50  0001 C CNN
	1    8050 4700
	1    0    0    -1  
$EndComp
$Comp
L Device:R_Small R5
U 1 1 607156F4
P 8050 4550
F 0 "R5" H 8000 4600 50  0000 R CNN
F 1 "10k" H 8000 4500 50  0000 R CNN
F 2 "Resistor_SMD:R_0603_1608Metric" H 8050 4550 50  0001 C CNN
F 3 "~" H 8050 4550 50  0001 C CNN
F 4 "C25804" H 8050 4550 50  0001 C CNN "LCSC Part #"
	1    8050 4550
	1    0    0    -1  
$EndComp
Text GLabel 8050 4100 0    50   Input ~ 0
CAN_TX
Text GLabel 8050 4200 0    50   Input ~ 0
CAN_RX
NoConn ~ 8100 4300
Text GLabel 9750 4500 1    50   Input ~ 0
LD_CAN_RX
$Comp
L power:+3.3V #PWR026
U 1 1 604EE235
P 8500 3900
F 0 "#PWR026" H 8500 3750 50  0001 C CNN
F 1 "+3.3V" H 8515 4073 50  0000 C CNN
F 2 "" H 8500 3900 50  0001 C CNN
F 3 "" H 8500 3900 50  0001 C CNN
	1    8500 3900
	1    0    0    -1  
$EndComp
$Comp
L power:GND #PWR027
U 1 1 602F9E6A
P 8500 4600
F 0 "#PWR027" H 8500 4350 50  0001 C CNN
F 1 "GND" H 8650 4500 50  0000 C CNN
F 2 "" H 8500 4600 50  0001 C CNN
F 3 "" H 8500 4600 50  0001 C CNN
	1    8500 4600
	1    0    0    -1  
$EndComp
$Comp
L Interface_CAN_LIN:SN65HVD230 U6
U 1 1 603AC1F9
P 8500 4200
F 0 "U6" H 8300 4600 50  0000 C CNN
F 1 "SN65HVD230" H 8100 4500 50  0000 C CNN
F 2 "Package_SO:SOIC-8_3.9x4.9mm_P1.27mm" H 8500 3700 50  0001 C CNN
F 3 "http://www.ti.com/lit/ds/symlink/sn65hvd230.pdf" H 8400 4600 50  0001 C CNN
F 4 "C12084" H 8500 4200 50  0001 C CNN "LCSC Part #"
F 5 "C12084" H 8500 4200 50  0001 C CNN "LCSC Part"
	1    8500 4200
	1    0    0    -1  
$EndComp
Text GLabel 8950 4200 2    50   Input ~ 0
CAN_H
Text GLabel 8950 4300 2    50   Input ~ 0
CAN_L
$Comp
L Connector_Generic:Conn_01x02 J4
U 1 1 607736A1
P 9050 5100
F 0 "J4" H 9050 5300 50  0000 C CNN
F 1 "CAN" H 9050 5200 50  0000 C CNN
F 2 "Connector_JST:JST_XH_B2B-XH-A_1x02_P2.50mm_Vertical" H 9050 5100 50  0001 C CNN
F 3 "~" H 9050 5100 50  0001 C CNN
	1    9050 5100
	1    0    0    -1  
$EndComp
$Comp
L Connector_Generic:Conn_01x02 J5
U 1 1 60775D68
P 9050 5350
F 0 "J5" H 9050 5050 50  0000 C CNN
F 1 "CAN" H 9050 5150 50  0000 C CNN
F 2 "Connector_JST:JST_XH_B2B-XH-A_1x02_P2.50mm_Vertical" H 9050 5350 50  0001 C CNN
F 3 "~" H 9050 5350 50  0001 C CNN
	1    9050 5350
	1    0    0    -1  
$EndComp
Wire Wire Line
	8800 5100 8850 5100
Wire Wire Line
	8850 5200 8800 5200
Wire Wire Line
	8800 5350 8850 5350
Wire Wire Line
	8850 5450 8800 5450
$Comp
L Device:R_Small R7
U 1 1 6079269F
P 9750 4900
F 0 "R7" H 9800 4950 50  0000 L CNN
F 1 "2.2k" H 9800 4850 50  0000 L CNN
F 2 "Resistor_SMD:R_0603_1608Metric" H 9750 4900 50  0001 C CNN
F 3 "~" H 9750 4900 50  0001 C CNN
F 4 "C4190" H 9750 4900 50  0001 C CNN "LCSC Part #"
	1    9750 4900
	1    0    0    -1  
$EndComp
$Comp
L Device:R_Small R6
U 1 1 60794655
P 9550 4900
F 0 "R6" H 9500 4950 50  0000 R CNN
F 1 "2.2k" H 9500 4850 50  0000 R CNN
F 2 "Resistor_SMD:R_0603_1608Metric" H 9550 4900 50  0001 C CNN
F 3 "~" H 9550 4900 50  0001 C CNN
F 4 "C4190" H 9550 4900 50  0001 C CNN "LCSC Part #"
	1    9550 4900
	1    0    0    -1  
$EndComp
$Comp
L Device:LED_Small D5
U 1 1 607A21B7
P 9750 4650
F 0 "D5" V 9796 4580 50  0000 R CNN
F 1 "Yellow" V 9705 4580 50  0000 R CNN
F 2 "LED_SMD:LED_0603_1608Metric" V 9750 4650 50  0001 C CNN
F 3 "~" V 9750 4650 50  0001 C CNN
F 4 "C72038" H 9750 4650 50  0001 C CNN "LCSC Part #"
	1    9750 4650
	0    -1   -1   0   
$EndComp
$Comp
L Device:LED_Small D4
U 1 1 607A0C97
P 9550 4650
F 0 "D4" V 9600 4850 50  0000 R CNN
F 1 "Green" V 9500 4950 50  0000 R CNN
F 2 "LED_SMD:LED_0603_1608Metric" V 9550 4650 50  0001 C CNN
F 3 "~" V 9550 4650 50  0001 C CNN
F 4 "C72043" H 9550 4650 50  0001 C CNN "LCSC Part #"
	1    9550 4650
	0    -1   -1   0   
$EndComp
Wire Notes Line
	8800 6950 7650 6950
Wire Notes Line
	7650 5950 8800 5950
Wire Notes Line
	7650 5950 7650 6950
Wire Notes Line
	8800 5950 8800 6950
Text Notes 7650 5900 0    50   ~ 0
Mounting holes
$Comp
L Regulator_Switching:MCP16301 U4
U 1 1 607CD0C4
P 1400 1150
F 0 "U4" H 1400 1517 50  0000 C CNN
F 1 "MCP16301" H 1400 1426 50  0000 C CNN
F 2 "Package_TO_SOT_SMD:SOT-23-6" H 1450 800 50  0001 L CNN
F 3 "http://ww1.microchip.com/downloads/en/DeviceDoc/20005004D.pdf" H 1100 1500 50  0001 C CNN
	1    1400 1150
	1    0    0    -1  
$EndComp
$Comp
L Device:C_Small C10
U 1 1 607CE183
P 700 1200
F 0 "C10" H 792 1246 50  0000 L CNN
F 1 "10u" H 792 1155 50  0000 L CNN
F 2 "Capacitor_SMD:C_1206_3216Metric" H 700 1200 50  0001 C CNN
F 3 "~" H 700 1200 50  0001 C CNN
F 4 "C13585" H 700 1200 50  0001 C CNN "LCSC Part #"
	1    700  1200
	1    0    0    -1  
$EndComp
$Comp
L power:GND #PWR0116
U 1 1 607CF4B8
P 700 1350
F 0 "#PWR0116" H 700 1100 50  0001 C CNN
F 1 "GND" H 705 1177 50  0000 C CNN
F 2 "" H 700 1350 50  0001 C CNN
F 3 "" H 700 1350 50  0001 C CNN
	1    700  1350
	1    0    0    -1  
$EndComp
$Comp
L power:GND #PWR0117
U 1 1 607D0736
P 1400 1600
F 0 "#PWR0117" H 1400 1350 50  0001 C CNN
F 1 "GND" H 1405 1427 50  0000 C CNN
F 2 "" H 1400 1600 50  0001 C CNN
F 3 "" H 1400 1600 50  0001 C CNN
	1    1400 1600
	1    0    0    -1  
$EndComp
Wire Wire Line
	700  1350 700  1300
Wire Wire Line
	700  1050 950  1050
Wire Wire Line
	700  1100 700  1050
Wire Wire Line
	950  1050 950  1150
Wire Wire Line
	950  1150 1000 1150
Connection ~ 950  1050
Wire Wire Line
	950  1050 1000 1050
Wire Wire Line
	1400 1550 1400 1600
$Comp
L Device:R_Small R2
U 1 1 607E396B
P 2150 1950
F 0 "R2" H 2100 2000 50  0000 R CNN
F 1 "31.2k" H 2100 1900 50  0000 R CNN
F 2 "Resistor_SMD:R_0603_1608Metric" H 2150 1950 50  0001 C CNN
F 3 "~" H 2150 1950 50  0001 C CNN
	1    2150 1950
	1    0    0    -1  
$EndComp
$Comp
L Device:R_Small R3
U 1 1 607E5845
P 2150 2250
F 0 "R3" H 2100 2300 50  0000 R CNN
F 1 "10k" H 2100 2200 50  0000 R CNN
F 2 "Resistor_SMD:R_0603_1608Metric" H 2150 2250 50  0001 C CNN
F 3 "~" H 2150 2250 50  0001 C CNN
F 4 "C25804" H 2150 2250 50  0001 C CNN "LCSC Part #"
	1    2150 2250
	1    0    0    -1  
$EndComp
Text GLabel 1850 1350 2    50   Input ~ 0
BUCK_Vfb
Text GLabel 1850 1050 2    50   Input ~ 0
BUCK_BOOST
Text GLabel 1850 1150 2    50   Input ~ 0
BUCK_SW
Text GLabel 2200 2100 2    50   Input ~ 0
BUCK_Vfb
$Comp
L power:GND #PWR0118
U 1 1 607E70D2
P 2150 2400
F 0 "#PWR0118" H 2150 2150 50  0001 C CNN
F 1 "GND" H 2155 2227 50  0000 C CNN
F 2 "" H 2150 2400 50  0001 C CNN
F 3 "" H 2150 2400 50  0001 C CNN
	1    2150 2400
	1    0    0    -1  
$EndComp
$Comp
L power:+3.3V #PWR0119
U 1 1 607E7779
P 2150 1800
F 0 "#PWR0119" H 2150 1650 50  0001 C CNN
F 1 "+3.3V" H 2100 1950 50  0000 C CNN
F 2 "" H 2150 1800 50  0001 C CNN
F 3 "" H 2150 1800 50  0001 C CNN
	1    2150 1800
	1    0    0    -1  
$EndComp
Wire Wire Line
	2150 1800 2150 1850
Wire Wire Line
	2150 2050 2150 2100
Wire Wire Line
	2150 2350 2150 2400
Wire Wire Line
	2200 2100 2150 2100
Connection ~ 2150 2100
Wire Wire Line
	2150 2100 2150 2150
Text GLabel 1150 2550 0    50   Input ~ 0
BUCK_SW
Text GLabel 1150 2150 0    50   Input ~ 0
BUCK_BOOST
$Comp
L Device:D_Small D2
U 1 1 607FFFEB
P 1450 2150
F 0 "D2" H 1400 2400 50  0000 C CNN
F 1 "1N4148" H 1300 2300 50  0000 C CNN
F 2 "Diode_SMD:D_SOD-323F" V 1450 2150 50  0001 C CNN
F 3 "~" V 1450 2150 50  0001 C CNN
F 4 "C2128" H 1450 2150 50  0001 C CNN "LCSC Part #"
	1    1450 2150
	1    0    0    -1  
$EndComp
Wire Wire Line
	1150 2150 1250 2150
Wire Wire Line
	1250 2650 1250 2550
Wire Wire Line
	1250 2250 1250 2150
Wire Wire Line
	1150 2550 1250 2550
Connection ~ 1250 2550
$Comp
L Device:L_Small L1
U 1 1 6081FF46
P 1450 2550
F 0 "L1" V 1400 2400 50  0000 C CNN
F 1 "15uH" V 1300 2350 50  0000 C CNN
F 2 "Polybot_power_supply:SRR5028-221Y" H 1450 2550 50  0001 C CNN
F 3 "~" H 1450 2550 50  0001 C CNN
	1    1450 2550
	0    -1   -1   0   
$EndComp
$Comp
L Device:C_Small C11
U 1 1 607F8780
P 1250 2350
F 0 "C11" H 1342 2396 50  0000 L CNN
F 1 "100n" H 1342 2305 50  0000 L CNN
F 2 "Capacitor_SMD:C_0603_1608Metric" H 1250 2350 50  0001 C CNN
F 3 "~" H 1250 2350 50  0001 C CNN
F 4 "C14663" H 1250 2350 50  0001 C CNN "LCSC Part #"
	1    1250 2350
	1    0    0    -1  
$EndComp
$Comp
L power:+3.3V #PWR0120
U 1 1 60823483
P 1650 2050
F 0 "#PWR0120" H 1650 1900 50  0001 C CNN
F 1 "+3.3V" H 1650 2250 50  0000 C CNN
F 2 "" H 1650 2050 50  0001 C CNN
F 3 "" H 1650 2050 50  0001 C CNN
	1    1650 2050
	1    0    0    -1  
$EndComp
Wire Wire Line
	1250 2550 1350 2550
Wire Wire Line
	1650 2150 1550 2150
Wire Wire Line
	1350 2150 1250 2150
Connection ~ 1650 2150
Wire Wire Line
	1650 2150 1650 2050
Connection ~ 1250 2150
Wire Wire Line
	1250 2950 1250 2850
$Comp
L power:GND #PWR0121
U 1 1 60809C65
P 1250 2950
F 0 "#PWR0121" H 1250 2700 50  0001 C CNN
F 1 "GND" H 1255 2777 50  0000 C CNN
F 2 "" H 1250 2950 50  0001 C CNN
F 3 "" H 1250 2950 50  0001 C CNN
	1    1250 2950
	1    0    0    -1  
$EndComp
$Comp
L Device:D_Schottky_Small D1
U 1 1 607F72FA
P 1250 2750
F 0 "D1" V 1204 2820 50  0000 L CNN
F 1 "40V" V 1295 2820 50  0000 L CNN
F 2 "Diode_SMD:D_SOD-123" V 1250 2750 50  0001 C CNN
F 3 "~" V 1250 2750 50  0001 C CNN
F 4 "C8598" H 1250 2750 50  0001 C CNN "LCSC Part #"
	1    1250 2750
	0    1    1    0   
$EndComp
Wire Wire Line
	1250 2450 1250 2550
Wire Wire Line
	1550 2550 1650 2550
Wire Wire Line
	1650 2150 1650 2550
$Comp
L Device:C_Small C12
U 1 1 6085A729
P 2500 1200
F 0 "C12" H 2592 1246 50  0000 L CNN
F 1 "10u" H 2592 1155 50  0000 L CNN
F 2 "Capacitor_SMD:C_0603_1608Metric" H 2500 1200 50  0001 C CNN
F 3 "~" H 2500 1200 50  0001 C CNN
F 4 "C19702" H 2500 1200 50  0001 C CNN "LCSC Part #"
	1    2500 1200
	1    0    0    -1  
$EndComp
$Comp
L Device:C_Small C13
U 1 1 6085AF16
P 2850 1200
F 0 "C13" H 2942 1246 50  0000 L CNN
F 1 "10u" H 2942 1155 50  0000 L CNN
F 2 "Capacitor_SMD:C_0603_1608Metric" H 2850 1200 50  0001 C CNN
F 3 "~" H 2850 1200 50  0001 C CNN
F 4 "C19702" H 2850 1200 50  0001 C CNN "LCSC Part #"
	1    2850 1200
	1    0    0    -1  
$EndComp
$Comp
L power:GND #PWR0122
U 1 1 60874E5A
P 2500 1400
F 0 "#PWR0122" H 2500 1150 50  0001 C CNN
F 1 "GND" H 2505 1227 50  0000 C CNN
F 2 "" H 2500 1400 50  0001 C CNN
F 3 "" H 2500 1400 50  0001 C CNN
	1    2500 1400
	1    0    0    -1  
$EndComp
$Comp
L power:+3.3V #PWR0123
U 1 1 6087572C
P 2500 1000
F 0 "#PWR0123" H 2500 850 50  0001 C CNN
F 1 "+3.3V" H 2500 1200 50  0000 C CNN
F 2 "" H 2500 1000 50  0001 C CNN
F 3 "" H 2500 1000 50  0001 C CNN
	1    2500 1000
	1    0    0    -1  
$EndComp
Wire Wire Line
	2500 1100 2500 1050
Connection ~ 2500 1050
Wire Wire Line
	2500 1050 2500 1000
Wire Wire Line
	1850 1050 1800 1050
Wire Wire Line
	1800 1150 1850 1150
Wire Wire Line
	1850 1350 1800 1350
Wire Wire Line
	2500 1350 2500 1300
Wire Wire Line
	2500 1400 2500 1350
Connection ~ 2500 1350
Wire Wire Line
	2850 1350 2850 1300
Wire Wire Line
	2500 1050 2850 1050
Wire Wire Line
	2500 1350 2850 1350
Wire Wire Line
	2850 1100 2850 1050
Wire Notes Line
	550  700  3150 700 
Wire Notes Line
	3150 700  3150 3200
Wire Notes Line
	3150 3200 550  3200
Wire Notes Line
	550  3200 550  700 
Text Notes 550  650  0    50   ~ 0
Voltage Regulator
Wire Wire Line
	9550 4500 9550 4550
Wire Wire Line
	9550 5000 9550 5050
Wire Wire Line
	9550 4750 9550 4800
Wire Wire Line
	9750 5050 9750 5000
Wire Wire Line
	9750 4800 9750 4750
Wire Wire Line
	9750 4550 9750 4500
$Comp
L power:GND #PWR0124
U 1 1 6091C27D
P 2750 2350
F 0 "#PWR0124" H 2750 2100 50  0001 C CNN
F 1 "GND" H 2755 2177 50  0000 C CNN
F 2 "" H 2750 2350 50  0001 C CNN
F 3 "" H 2750 2350 50  0001 C CNN
	1    2750 2350
	1    0    0    -1  
$EndComp
$Comp
L Device:R_Small R4
U 1 1 6091C284
P 2750 2200
F 0 "R4" H 2800 2250 50  0000 L CNN
F 1 "2.2k" H 2800 2150 50  0000 L CNN
F 2 "Resistor_SMD:R_0603_1608Metric" H 2750 2200 50  0001 C CNN
F 3 "~" H 2750 2200 50  0001 C CNN
F 4 "C4190" H 2750 2200 50  0001 C CNN "LCSC Part #"
	1    2750 2200
	1    0    0    -1  
$EndComp
$Comp
L Device:LED_Small D3
U 1 1 6091C28A
P 2750 1950
F 0 "D3" V 2796 1880 50  0000 R CNN
F 1 "Green" V 2705 1880 50  0000 R CNN
F 2 "LED_SMD:LED_0603_1608Metric" V 2750 1950 50  0001 C CNN
F 3 "~" V 2750 1950 50  0001 C CNN
F 4 "C72043" H 2750 1950 50  0001 C CNN "LCSC Part #"
	1    2750 1950
	0    -1   -1   0   
$EndComp
Wire Wire Line
	2750 2350 2750 2300
Wire Wire Line
	2750 2100 2750 2050
Wire Wire Line
	2750 1850 2750 1800
$Comp
L power:+3.3V #PWR0125
U 1 1 6093DF00
P 2750 1800
F 0 "#PWR0125" H 2750 1650 50  0001 C CNN
F 1 "+3.3V" H 2700 1950 50  0000 C CNN
F 2 "" H 2750 1800 50  0001 C CNN
F 3 "" H 2750 1800 50  0001 C CNN
	1    2750 1800
	1    0    0    -1  
$EndComp
$Comp
L power:+BATT #PWR01
U 1 1 609039C5
P 700 1000
F 0 "#PWR01" H 700 850 50  0001 C CNN
F 1 "+BATT" H 715 1173 50  0000 C CNN
F 2 "" H 700 1000 50  0001 C CNN
F 3 "" H 700 1000 50  0001 C CNN
	1    700  1000
	1    0    0    -1  
$EndComp
Wire Wire Line
	700  1000 700  1050
Connection ~ 700  1050
$Comp
L Connector_Generic:Conn_01x02 J1
U 1 1 606BEE19
P 800 4800
F 0 "J1" V 900 4800 50  0000 R CNN
F 1 "BAT_IN" V 1000 4800 50  0000 R CNN
F 2 "Polybot_power_supply:AMASS_XT60-F_1x02_P7.20mm_Vertical" H 800 4800 50  0001 C CNN
F 3 "~" H 800 4800 50  0001 C CNN
	1    800  4800
	0    -1   1    0   
$EndComp
$Comp
L power:GND #PWR0102
U 1 1 606CAA7F
P 650 4800
F 0 "#PWR0102" H 650 4550 50  0001 C CNN
F 1 "GND" H 655 4627 50  0000 C CNN
F 2 "" H 650 4800 50  0001 C CNN
F 3 "" H 650 4800 50  0001 C CNN
	1    650  4800
	1    0    0    -1  
$EndComp
Wire Wire Line
	800  4550 800  4600
$Comp
L power:+BATT #PWR0103
U 1 1 606CF6DC
P 900 4500
F 0 "#PWR0103" H 900 4350 50  0001 C CNN
F 1 "+BATT" H 915 4673 50  0000 C CNN
F 2 "" H 900 4500 50  0001 C CNN
F 3 "" H 900 4500 50  0001 C CNN
	1    900  4500
	1    0    0    -1  
$EndComp
Wire Wire Line
	650  4800 650  4550
Wire Wire Line
	650  4550 800  4550
Wire Wire Line
	900  4600 900  4550
$Comp
L Connector_Generic:Conn_01x02 J2
U 1 1 606D8167
P 1350 4800
F 0 "J2" V 1450 4750 50  0000 C CNN
F 1 "STOP_BUT" V 1550 4750 50  0000 C CNN
F 2 "Polybot_power_supply:AMASS_XT60-F_1x02_P7.20mm_Vertical" H 1350 4800 50  0001 C CNN
F 3 "~" H 1350 4800 50  0001 C CNN
	1    1350 4800
	0    -1   1    0   
$EndComp
Wire Wire Line
	900  4550 1350 4550
Wire Wire Line
	1350 4550 1350 4600
Connection ~ 900  4550
Wire Wire Line
	900  4550 900  4500
$Comp
L Connector_Generic:Conn_01x02 J3
U 1 1 606DC8F3
P 3050 6400
F 0 "J3" H 3250 6300 50  0000 R CNN
F 1 "MOT" H 3300 6400 50  0000 R CNN
F 2 "Polybot_power_supply:AMASS_XT60-F_1x02_P7.20mm_Vertical" H 3050 6400 50  0001 C CNN
F 3 "~" H 3050 6400 50  0001 C CNN
	1    3050 6400
	1    0    0    1   
$EndComp
$Comp
L power:GND #PWR0104
U 1 1 606E1230
P 2800 6450
F 0 "#PWR0104" H 2800 6200 50  0001 C CNN
F 1 "GND" H 2805 6277 50  0000 C CNN
F 2 "" H 2800 6450 50  0001 C CNN
F 3 "" H 2800 6450 50  0001 C CNN
	1    2800 6450
	1    0    0    -1  
$EndComp
$Comp
L Polybot_power_supply:JCK5012S12 U1
U 1 1 6061C1FA
P 3700 5050
F 0 "U1" H 3700 5917 50  0000 C CNN
F 1 "JCK5012S12" H 3700 5826 50  0000 C CNN
F 2 "Polybot_power_supply:JCK5012S12" H 3700 5050 50  0001 C CNN
F 3 "" H 3700 5050 50  0001 C CNN
	1    3700 5050
	1    0    0    -1  
$EndComp
$Comp
L power:GND #PWR0126
U 1 1 6061DF90
P 3150 4900
F 0 "#PWR0126" H 3150 4650 50  0001 C CNN
F 1 "GND" H 3155 4727 50  0000 C CNN
F 2 "" H 3150 4900 50  0001 C CNN
F 3 "" H 3150 4900 50  0001 C CNN
	1    3150 4900
	1    0    0    -1  
$EndComp
$Comp
L power:GND #PWR0127
U 1 1 6061E978
P 3150 5900
F 0 "#PWR0127" H 3150 5650 50  0001 C CNN
F 1 "GND" H 3155 5727 50  0000 C CNN
F 2 "" H 3150 5900 50  0001 C CNN
F 3 "" H 3150 5900 50  0001 C CNN
	1    3150 5900
	1    0    0    -1  
$EndComp
$Comp
L power:GND #PWR0128
U 1 1 60629151
P 4250 5900
F 0 "#PWR0128" H 4250 5650 50  0001 C CNN
F 1 "GND" H 4255 5727 50  0000 C CNN
F 2 "" H 4250 5900 50  0001 C CNN
F 3 "" H 4250 5900 50  0001 C CNN
	1    4250 5900
	1    0    0    -1  
$EndComp
$Comp
L power:GND #PWR0129
U 1 1 606298B7
P 4250 4900
F 0 "#PWR0129" H 4250 4650 50  0001 C CNN
F 1 "GND" H 4255 4727 50  0000 C CNN
F 2 "" H 4250 4900 50  0001 C CNN
F 3 "" H 4250 4900 50  0001 C CNN
	1    4250 4900
	1    0    0    -1  
$EndComp
$Comp
L power:+12V #PWR0130
U 1 1 6062A7FE
P 4350 4650
F 0 "#PWR0130" H 4350 4500 50  0001 C CNN
F 1 "+12V" H 4365 4823 50  0000 C CNN
F 2 "" H 4350 4650 50  0001 C CNN
F 3 "" H 4350 4650 50  0001 C CNN
	1    4350 4650
	1    0    0    -1  
$EndComp
$Comp
L power:+5V #PWR0131
U 1 1 6062BE51
P 4350 5650
F 0 "#PWR0131" H 4350 5500 50  0001 C CNN
F 1 "+5V" H 4365 5823 50  0000 C CNN
F 2 "" H 4350 5650 50  0001 C CNN
F 3 "" H 4350 5650 50  0001 C CNN
	1    4350 5650
	1    0    0    -1  
$EndComp
$Comp
L Polybot_power_supply:JCK2012S05 U2
U 1 1 6061D051
P 3700 6100
F 0 "U2" H 3700 7017 50  0000 C CNN
F 1 "JCK2012S05" H 3700 6926 50  0000 C CNN
F 2 "Polybot_power_supply:JCK2012S05" H 3700 6100 50  0001 C CNN
F 3 "" H 3700 6100 50  0001 C CNN
	1    3700 6100
	1    0    0    -1  
$EndComp
Wire Wire Line
	3150 4900 3150 4850
Wire Wire Line
	3150 4850 3200 4850
Wire Wire Line
	4200 4850 4250 4850
Wire Wire Line
	4250 4850 4250 4900
Wire Wire Line
	4200 4650 4350 4650
Wire Wire Line
	4350 5650 4200 5650
Wire Wire Line
	4200 5850 4250 5850
Wire Wire Line
	4250 5850 4250 5900
Wire Wire Line
	3200 5850 3150 5850
Wire Wire Line
	3150 5850 3150 5900
Wire Wire Line
	2500 4450 2800 4450
NoConn ~ 3200 5650
NoConn ~ 4200 5450
NoConn ~ 4200 4450
NoConn ~ 3200 4650
Wire Wire Line
	2800 6450 2800 6400
Wire Wire Line
	2800 6400 2850 6400
Wire Wire Line
	2850 6300 2800 6300
Wire Wire Line
	1450 4600 1450 4550
Wire Wire Line
	1450 4550 1900 4550
$Comp
L power:+3.3V #PWR0132
U 1 1 607C1CD7
P 2550 4900
F 0 "#PWR0132" H 2550 4750 50  0001 C CNN
F 1 "+3.3V" H 2550 5050 50  0000 C CNN
F 2 "" H 2550 4900 50  0001 C CNN
F 3 "" H 2550 4900 50  0001 C CNN
	1    2550 4900
	1    0    0    -1  
$EndComp
Text GLabel 2200 5600 2    50   Input ~ 0
RELAY_VDC
$Comp
L Polybot_power_supply:RM50-3011-85-1003 K1
U 1 1 60AB63BA
P 2200 4750
F 0 "K1" V 2650 4750 50  0000 C CNN
F 1 "RM50-3011-85-1003" V 2750 4750 50  0000 C CNN
F 2 "Polybot_power_supply:Relay_RM50-3011-85-1003" H 3470 4720 50  0001 C CNN
F 3 "http://gfinder.findernet.com/assets/Series/355/S32EN.pdf" H 2200 4750 50  0001 C CNN
	1    2200 4750
	0    1    -1   0   
$EndComp
Wire Wire Line
	1850 4950 1900 4950
Wire Wire Line
	2500 4950 2550 4950
$Comp
L power:GND #PWR0133
U 1 1 60873884
P 1850 5850
F 0 "#PWR0133" H 1850 5600 50  0001 C CNN
F 1 "GND" H 1855 5677 50  0000 C CNN
F 2 "" H 1850 5850 50  0001 C CNN
F 3 "" H 1850 5850 50  0001 C CNN
	1    1850 5850
	-1   0    0    -1  
$EndComp
Wire Wire Line
	1850 5850 1850 5800
Wire Wire Line
	2150 5600 2200 5600
Text GLabel 5100 5700 2    50   Input ~ 0
RELAY_VRPi
NoConn ~ 2500 4600
$Comp
L Polybot_power_supply:DC-DC_Variable U5
U 1 1 6092FA7E
P 6100 4850
F 0 "U5" H 6100 5517 50  0000 C CNN
F 1 "DC-DC_Variable" H 6100 5426 50  0000 C CNN
F 2 "Polybot_power_supply:LM2596_buck_module" H 6100 4850 50  0001 C CNN
F 3 "" H 6100 4850 50  0001 C CNN
	1    6100 4850
	1    0    0    -1  
$EndComp
$Comp
L power:GND #PWR05
U 1 1 6094E64E
P 5650 4700
F 0 "#PWR05" H 5650 4450 50  0001 C CNN
F 1 "GND" H 5655 4527 50  0000 C CNN
F 2 "" H 5650 4700 50  0001 C CNN
F 3 "" H 5650 4700 50  0001 C CNN
	1    5650 4700
	1    0    0    -1  
$EndComp
$Comp
L power:GND #PWR06
U 1 1 6094ED36
P 6550 4700
F 0 "#PWR06" H 6550 4450 50  0001 C CNN
F 1 "GND" H 6555 4527 50  0000 C CNN
F 2 "" H 6550 4700 50  0001 C CNN
F 3 "" H 6550 4700 50  0001 C CNN
	1    6550 4700
	1    0    0    -1  
$EndComp
$Comp
L Connector_Generic:Conn_01x02 J6
U 1 1 60950290
P 7100 4450
F 0 "J6" H 7300 4350 50  0000 R CNN
F 1 "VOUT_RPi" H 7550 4450 50  0000 R CNN
F 2 "Connector_JST:JST_XH_B2B-XH-A_1x02_P2.50mm_Vertical" H 7100 4450 50  0001 C CNN
F 3 "~" H 7100 4450 50  0001 C CNN
	1    7100 4450
	1    0    0    -1  
$EndComp
$Comp
L power:GND #PWR09
U 1 1 6095DD16
P 6900 4700
F 0 "#PWR09" H 6900 4450 50  0001 C CNN
F 1 "GND" H 6905 4527 50  0000 C CNN
F 2 "" H 6900 4700 50  0001 C CNN
F 3 "" H 6900 4700 50  0001 C CNN
	1    6900 4700
	1    0    0    -1  
$EndComp
Wire Wire Line
	6900 4700 6900 4550
Wire Wire Line
	6500 4650 6550 4650
Wire Wire Line
	6550 4650 6550 4700
Wire Wire Line
	5650 4700 5650 4650
Wire Wire Line
	5650 4650 5700 4650
$Comp
L Device:Fuse_Small F1
U 1 1 609D8C16
P 3000 4450
F 0 "F1" H 3000 4635 50  0000 C CNN
F 1 "4A" H 3000 4544 50  0000 C CNN
F 2 "Polybot_power_supply:1808_fuse_holder" H 3000 4450 50  0001 C CNN
F 3 "~" H 3000 4450 50  0001 C CNN
	1    3000 4450
	1    0    0    -1  
$EndComp
Wire Wire Line
	2800 4450 2800 5450
$Comp
L Device:Fuse_Small F2
U 1 1 609F9F6C
P 3000 5450
F 0 "F2" H 3000 5635 50  0000 C CNN
F 1 "4A" H 3000 5544 50  0000 C CNN
F 2 "Polybot_power_supply:1808_fuse_holder" H 3000 5450 50  0001 C CNN
F 3 "~" H 3000 5450 50  0001 C CNN
	1    3000 5450
	1    0    0    -1  
$EndComp
Wire Wire Line
	2800 5450 2900 5450
Connection ~ 2800 5450
Wire Wire Line
	2800 5450 2800 6300
Wire Wire Line
	2800 4450 2900 4450
Connection ~ 2800 4450
Wire Wire Line
	3100 4450 3200 4450
Wire Wire Line
	3200 5450 3100 5450
$Comp
L Device:Fuse_Small F3
U 1 1 60A86E31
P 6700 4450
F 0 "F3" H 6700 4635 50  0000 C CNN
F 1 "4A" H 6700 4544 50  0000 C CNN
F 2 "Polybot_power_supply:1808_fuse_holder" H 6700 4450 50  0001 C CNN
F 3 "~" H 6700 4450 50  0001 C CNN
	1    6700 4450
	1    0    0    -1  
$EndComp
Wire Wire Line
	6500 4450 6600 4450
Wire Wire Line
	6800 4450 6900 4450
$Comp
L Diode:SM4007 D7
U 1 1 60B1566B
P 2200 5250
F 0 "D7" H 2200 5050 50  0000 C CNN
F 1 "SM4007" H 2200 5150 50  0000 C CNN
F 2 "Diode_SMD:D_SOD-123F" H 2200 5075 50  0001 C CNN
F 3 "http://cdn-reichelt.de/documents/datenblatt/A400/SMD1N400%23DIO.pdf" H 2200 5250 50  0001 C CNN
F 4 "C64898" H 2200 5250 50  0001 C CNN "LCSC Part #"
	1    2200 5250
	-1   0    0    -1  
$EndComp
Wire Wire Line
	2550 4950 2550 5250
Wire Wire Line
	2350 5250 2550 5250
Wire Wire Line
	1850 5250 1850 5400
Wire Wire Line
	2050 5250 1850 5250
Wire Wire Line
	1850 5250 1850 4950
$Comp
L power:+3.3V #PWR03
U 1 1 60B91FE3
P 5450 4950
F 0 "#PWR03" H 5450 4800 50  0001 C CNN
F 1 "+3.3V" H 5450 5100 50  0000 C CNN
F 2 "" H 5450 4950 50  0001 C CNN
F 3 "" H 5450 4950 50  0001 C CNN
	1    5450 4950
	1    0    0    -1  
$EndComp
$Comp
L Polybot_power_supply:RM50-3011-85-1003 K2
U 1 1 60B91FEA
P 5100 4750
F 0 "K2" V 5550 4550 50  0000 L CNN
F 1 "RM50-3011-85-1003" V 5650 4550 50  0000 L CNN
F 2 "Polybot_power_supply:Relay_RM50-3011-85-1003" H 6370 4720 50  0001 C CNN
F 3 "http://gfinder.findernet.com/assets/Series/355/S32EN.pdf" H 5100 4750 50  0001 C CNN
	1    5100 4750
	0    1    -1   0   
$EndComp
Wire Wire Line
	4750 4950 4800 4950
Wire Wire Line
	5400 4950 5450 4950
$Comp
L power:GND #PWR04
U 1 1 60B91FF3
P 4750 5950
F 0 "#PWR04" H 4750 5700 50  0001 C CNN
F 1 "GND" H 4755 5777 50  0000 C CNN
F 2 "" H 4750 5950 50  0001 C CNN
F 3 "" H 4750 5950 50  0001 C CNN
	1    4750 5950
	-1   0    0    -1  
$EndComp
Wire Wire Line
	4750 5950 4750 5900
Wire Wire Line
	5050 5700 5100 5700
NoConn ~ 5400 4600
$Comp
L Diode:SM4007 D8
U 1 1 60B91FFC
P 5100 5300
F 0 "D8" H 5100 5400 50  0000 C CNN
F 1 "SM4007" H 5100 5500 50  0000 C CNN
F 2 "Diode_SMD:D_SOD-123F" H 5100 5125 50  0001 C CNN
F 3 "http://cdn-reichelt.de/documents/datenblatt/A400/SMD1N400%23DIO.pdf" H 5100 5300 50  0001 C CNN
F 4 "C64898" H 5100 5300 50  0001 C CNN "LCSC Part #"
	1    5100 5300
	-1   0    0    1   
$EndComp
$Comp
L power:+BATT #PWR02
U 1 1 60BB97EC
P 4700 4500
F 0 "#PWR02" H 4700 4350 50  0001 C CNN
F 1 "+BATT" H 4715 4673 50  0000 C CNN
F 2 "" H 4700 4500 50  0001 C CNN
F 3 "" H 4700 4500 50  0001 C CNN
	1    4700 4500
	1    0    0    -1  
$EndComp
Wire Wire Line
	4700 4500 4700 4550
Wire Wire Line
	4700 4550 4800 4550
Wire Wire Line
	5400 4450 5700 4450
$Comp
L Diode:SM4007 D6
U 1 1 60C0D637
P 2200 3950
F 0 "D6" H 2200 4150 50  0000 C CNN
F 1 "SM4007" H 2200 4050 50  0000 C CNN
F 2 "Diode_SMD:D_SOD-123F" H 2200 3775 50  0001 C CNN
F 3 "http://cdn-reichelt.de/documents/datenblatt/A400/SMD1N400%23DIO.pdf" H 2200 3950 50  0001 C CNN
F 4 "C64898" H 2200 3950 50  0001 C CNN "LCSC Part #"
	1    2200 3950
	1    0    0    -1  
$EndComp
Wire Wire Line
	2350 3950 2800 3950
Wire Wire Line
	2800 3950 2800 4450
Wire Wire Line
	2050 3950 1350 3950
Wire Wire Line
	1350 3950 1350 4550
Connection ~ 1350 4550
Wire Notes Line
	550  6700 550  3650
Wire Notes Line
	550  3650 7600 3650
Wire Notes Line
	10100 3650 10100 5750
Wire Notes Line
	7650 3650 10100 3650
Wire Notes Line
	7650 5750 7650 3650
Wire Notes Line
	10100 5750 7650 5750
Text Notes 3200 650  0    50   ~ 0
Microcontroller
Wire Notes Line
	8500 700  8500 3450
Wire Notes Line
	3200 700  8500 700 
Wire Notes Line
	3200 3450 3200 700 
Wire Notes Line
	8500 3450 3200 3450
Wire Wire Line
	5100 1550 5150 1550
Text GLabel 5150 1550 2    50   Input ~ 0
BUZ_TIM2_4
Text GLabel 5150 1350 2    50   Input ~ 0
VBAT_ADC1_2
NoConn ~ 5100 1250
NoConn ~ 5100 1450
NoConn ~ 5100 1650
NoConn ~ 5100 2750
NoConn ~ 4000 2750
NoConn ~ 4000 2650
NoConn ~ 4000 2450
Wire Wire Line
	5150 1850 5100 1850
Wire Wire Line
	5150 1950 5100 1950
Wire Wire Line
	5150 2050 5100 2050
Wire Wire Line
	5150 2150 5100 2150
Wire Wire Line
	5150 2250 5100 2250
Wire Wire Line
	5150 2350 5100 2350
Wire Wire Line
	5150 2450 5100 2450
Wire Wire Line
	5150 2550 5100 2550
Wire Wire Line
	5150 2650 5100 2650
Wire Wire Line
	3950 2550 4000 2550
Wire Wire Line
	3950 2350 4000 2350
Wire Wire Line
	3950 2250 4000 2250
Wire Wire Line
	4000 2150 3950 2150
Wire Wire Line
	3950 1950 4000 1950
Wire Wire Line
	4000 1850 3950 1850
Wire Wire Line
	4000 1250 3950 1250
Wire Wire Line
	3900 1450 4000 1450
$Comp
L power:+3.3V #PWR07
U 1 1 606D4E9F
P 5900 2350
F 0 "#PWR07" H 5900 2200 50  0001 C CNN
F 1 "+3.3V" H 5915 2523 50  0000 C CNN
F 2 "" H 5900 2350 50  0001 C CNN
F 3 "" H 5900 2350 50  0001 C CNN
	1    5900 2350
	1    0    0    -1  
$EndComp
Wire Wire Line
	5900 2350 5900 2400
Wire Wire Line
	5900 2400 5950 2400
Text GLabel 6450 2400 2    49   Input ~ 0
SWDIO
Text GLabel 5150 2050 2    50   Input ~ 0
RELAY_VDC
Text GLabel 3950 2550 0    50   Input ~ 0
RELAY_VRPi
Text GLabel 3950 2250 0    49   Input ~ 0
LD_40_20_TIM3_4
Text GLabel 3950 2150 0    49   Input ~ 0
LD_60_40_TIM3_3
Text GLabel 5150 1950 2    49   Input ~ 0
LD_80_60_TIM3_2
Connection ~ 7850 2250
Connection ~ 8250 2400
Wire Wire Line
	7950 2400 7850 2400
Wire Wire Line
	7850 2400 7850 2250
Wire Wire Line
	8250 2400 8150 2400
Wire Wire Line
	8250 2250 8250 2400
Wire Wire Line
	7750 2250 7850 2250
Text GLabel 7750 2250 0    50   Input ~ 0
NRST
$Comp
L power:GND #PWR0113
U 1 1 606B44BB
P 8250 2400
F 0 "#PWR0113" H 8250 2150 50  0001 C CNN
F 1 "GND" H 8255 2227 50  0000 C CNN
F 2 "" H 8250 2400 50  0001 C CNN
F 3 "" H 8250 2400 50  0001 C CNN
	1    8250 2400
	1    0    0    -1  
$EndComp
$Comp
L Device:C_Small C8
U 1 1 606B257C
P 8050 2400
F 0 "C8" V 7900 2400 50  0000 C CNN
F 1 "100n" V 7800 2400 50  0000 C CNN
F 2 "Capacitor_SMD:C_0603_1608Metric" H 8050 2400 50  0001 C CNN
F 3 "~" H 8050 2400 50  0001 C CNN
F 4 "C14663" H 8050 2400 50  0001 C CNN "LCSC Part #"
	1    8050 2400
	0    -1   -1   0   
$EndComp
$Comp
L Switch:SW_Push SW1
U 1 1 606B07F8
P 8050 2250
F 0 "SW1" H 8050 2535 50  0000 C CNN
F 1 "SW_Push" H 8050 2444 50  0000 C CNN
F 2 "Button_Switch_THT:SW_PUSH_6mm_H4.3mm" H 8050 2450 50  0001 C CNN
F 3 "~" H 8050 2450 50  0001 C CNN
	1    8050 2250
	1    0    0    -1  
$EndComp
Wire Wire Line
	6950 1900 6950 2000
Connection ~ 6750 1800
Wire Wire Line
	6550 1800 6750 1800
Connection ~ 7250 1800
Wire Wire Line
	7700 1800 7850 1800
Wire Wire Line
	7250 1800 7500 1800
Text GLabel 7850 1800 2    50   Input ~ 0
HSE_OUT
Text GLabel 6550 1800 0    50   Input ~ 0
HSE_IN
Wire Wire Line
	6850 1800 6750 1800
Wire Wire Line
	7250 1800 7050 1800
Connection ~ 7100 2000
Wire Wire Line
	7100 2000 7250 2000
Wire Wire Line
	6950 2000 6750 2000
Connection ~ 6950 2000
Wire Wire Line
	6950 2000 6950 2050
Wire Wire Line
	7100 2000 6950 2000
Wire Wire Line
	7100 1650 7100 2000
Wire Wire Line
	6950 1650 7100 1650
Wire Wire Line
	6950 1700 6950 1650
$Comp
L power:GND #PWR0112
U 1 1 60679C5A
P 6950 2050
F 0 "#PWR0112" H 6950 1800 50  0001 C CNN
F 1 "GND" H 6955 1877 50  0000 C CNN
F 2 "" H 6950 2050 50  0001 C CNN
F 3 "" H 6950 2050 50  0001 C CNN
	1    6950 2050
	1    0    0    -1  
$EndComp
$Comp
L Device:C_Small C6
U 1 1 6067836D
P 7250 1900
F 0 "C6" H 7342 1946 50  0000 L CNN
F 1 "12p" H 7342 1855 50  0000 L CNN
F 2 "Capacitor_SMD:C_0603_1608Metric" H 7250 1900 50  0001 C CNN
F 3 "~" H 7250 1900 50  0001 C CNN
F 4 "C38523" H 7250 1900 50  0001 C CNN "LCSC Part #"
	1    7250 1900
	1    0    0    -1  
$EndComp
$Comp
L Device:C_Small C3
U 1 1 60676896
P 6750 1900
F 0 "C3" H 6650 1900 50  0000 R CNN
F 1 "12p" H 6650 1800 50  0000 R CNN
F 2 "Capacitor_SMD:C_0603_1608Metric" H 6750 1900 50  0001 C CNN
F 3 "~" H 6750 1900 50  0001 C CNN
F 4 "C38523" H 6750 1900 50  0001 C CNN "LCSC Part #"
	1    6750 1900
	1    0    0    -1  
$EndComp
$Comp
L Device:Crystal_GND24_Small HSE1
U 1 1 60675164
P 6950 1800
F 0 "HSE1" H 6650 2050 50  0000 L CNN
F 1 "16MHz" H 6650 1950 50  0000 L CNN
F 2 "Crystal:Crystal_SMD_3225-4Pin_3.2x2.5mm" H 6950 1800 50  0001 C CNN
F 3 "~" H 6950 1800 50  0001 C CNN
F 4 "C13738" H 6950 1800 50  0001 C CNN "LCSC Part #"
	1    6950 1800
	1    0    0    -1  
$EndComp
Connection ~ 8250 1050
Wire Wire Line
	7900 1350 7900 1300
Connection ~ 7900 1350
Wire Wire Line
	8250 1100 8250 1050
Wire Wire Line
	8250 1350 8250 1300
Wire Wire Line
	7900 1350 8250 1350
Wire Wire Line
	7900 1050 8250 1050
Connection ~ 7900 1050
Wire Wire Line
	7900 1100 7900 1050
Wire Wire Line
	7900 1400 7900 1350
$Comp
L power:GND #PWR0111
U 1 1 606689DE
P 7900 1400
F 0 "#PWR0111" H 7900 1150 50  0001 C CNN
F 1 "GND" H 7750 1350 50  0000 C CNN
F 2 "" H 7900 1400 50  0001 C CNN
F 3 "" H 7900 1400 50  0001 C CNN
	1    7900 1400
	1    0    0    -1  
$EndComp
Wire Wire Line
	8250 1050 8250 1000
Wire Wire Line
	7750 1050 7900 1050
$Comp
L Device:Ferrite_Bead_Small FB1
U 1 1 6065A841
P 7650 1050
F 0 "FB1" V 7800 1050 50  0000 C CNN
F 1 "100 @ 100 MHz" V 7500 1100 50  0000 C CNN
F 2 "Inductor_SMD:L_0805_2012Metric" V 7580 1050 50  0001 C CNN
F 3 "~" H 7650 1050 50  0001 C CNN
F 4 "C1015" H 7650 1050 50  0001 C CNN "LCSC Part #"
F 5 "C1015" H 7650 1050 50  0001 C CNN "LCSC Part"
	1    7650 1050
	0    1    1    0   
$EndComp
Wire Wire Line
	6550 1050 6950 1050
Connection ~ 6550 1050
$Comp
L Device:C_Small C9
U 1 1 6065DEC3
P 8250 1200
F 0 "C9" H 8342 1246 50  0000 L CNN
F 1 "1u" H 8342 1155 50  0000 L CNN
F 2 "Capacitor_SMD:C_0603_1608Metric" H 8250 1200 50  0001 C CNN
F 3 "~" H 8250 1200 50  0001 C CNN
F 4 "C15849" H 8250 1200 50  0001 C CNN "LCSC Part #"
	1    8250 1200
	1    0    0    -1  
$EndComp
$Comp
L Device:C_Small C7
U 1 1 6065CC04
P 7900 1200
F 0 "C7" H 7992 1246 50  0000 L CNN
F 1 "10n" H 7992 1155 50  0000 L CNN
F 2 "Capacitor_SMD:C_0603_1608Metric" H 7900 1200 50  0001 C CNN
F 3 "~" H 7900 1200 50  0001 C CNN
F 4 "C57112" H 7900 1200 50  0001 C CNN "LCSC Part #"
	1    7900 1200
	1    0    0    -1  
$EndComp
Wire Wire Line
	6550 1350 6950 1350
Connection ~ 6550 1350
Wire Wire Line
	6550 1300 6550 1350
Wire Wire Line
	6550 1050 6550 1100
Wire Wire Line
	6150 1050 6150 1100
Connection ~ 6150 1050
Wire Wire Line
	6950 1050 6950 1100
Wire Wire Line
	6150 1050 6550 1050
Wire Wire Line
	6150 1000 6150 1050
Wire Wire Line
	6150 1350 6150 1400
Connection ~ 6150 1350
Wire Wire Line
	6950 1350 6950 1300
Wire Wire Line
	6150 1350 6550 1350
Wire Wire Line
	6150 1300 6150 1350
$Comp
L power:GND #PWR0110
U 1 1 6063348D
P 6150 1400
F 0 "#PWR0110" H 6150 1150 50  0001 C CNN
F 1 "GND" H 6000 1350 50  0000 C CNN
F 2 "" H 6150 1400 50  0001 C CNN
F 3 "" H 6150 1400 50  0001 C CNN
	1    6150 1400
	1    0    0    -1  
$EndComp
$Comp
L power:+3.3V #PWR0109
U 1 1 60632A4A
P 6150 1000
F 0 "#PWR0109" H 6150 850 50  0001 C CNN
F 1 "+3.3V" H 6100 1150 50  0000 C CNN
F 2 "" H 6150 1000 50  0001 C CNN
F 3 "" H 6150 1000 50  0001 C CNN
	1    6150 1000
	1    0    0    -1  
$EndComp
$Comp
L Device:C_Small C5
U 1 1 606320E9
P 6950 1200
F 0 "C5" H 7042 1246 50  0000 L CNN
F 1 "4.7u" H 7042 1155 50  0000 L CNN
F 2 "Capacitor_SMD:C_0603_1608Metric" H 6950 1200 50  0001 C CNN
F 3 "~" H 6950 1200 50  0001 C CNN
F 4 "C19666" H 6950 1200 50  0001 C CNN "LCSC Part #"
	1    6950 1200
	1    0    0    -1  
$EndComp
$Comp
L Device:C_Small C2
U 1 1 606316D9
P 6550 1200
F 0 "C2" H 6642 1246 50  0000 L CNN
F 1 "100n" H 6642 1155 50  0000 L CNN
F 2 "Capacitor_SMD:C_0603_1608Metric" H 6550 1200 50  0001 C CNN
F 3 "~" H 6550 1200 50  0001 C CNN
F 4 "C14663" H 6550 1200 50  0001 C CNN "LCSC Part #"
	1    6550 1200
	1    0    0    -1  
$EndComp
$Comp
L Device:C_Small C1
U 1 1 6062E9C5
P 6150 1200
F 0 "C1" H 6242 1246 50  0000 L CNN
F 1 "100n" H 6242 1155 50  0000 L CNN
F 2 "Capacitor_SMD:C_0603_1608Metric" H 6150 1200 50  0001 C CNN
F 3 "~" H 6150 1200 50  0001 C CNN
F 4 "C14663" H 6150 1200 50  0001 C CNN "LCSC Part #"
	1    6150 1200
	1    0    0    -1  
$EndComp
Wire Wire Line
	4500 3000 4500 2950
Connection ~ 4500 3000
Wire Wire Line
	4600 3000 4600 2950
Wire Wire Line
	4500 3000 4600 3000
Wire Wire Line
	4500 3050 4500 3000
$Comp
L power:GND #PWR0108
U 1 1 60624F23
P 4500 3050
F 0 "#PWR0108" H 4500 2800 50  0001 C CNN
F 1 "GND" H 4505 2877 50  0000 C CNN
F 2 "" H 4500 3050 50  0001 C CNN
F 3 "" H 4500 3050 50  0001 C CNN
	1    4500 3050
	1    0    0    -1  
$EndComp
Wire Wire Line
	4700 1050 4700 950 
Connection ~ 4500 1000
Wire Wire Line
	4500 1000 4500 1050
Wire Wire Line
	4600 1000 4600 1050
Wire Wire Line
	4500 1000 4600 1000
Wire Wire Line
	4500 950  4500 1000
$Comp
L power:+3.3VA #PWR0107
U 1 1 60617015
P 4700 950
F 0 "#PWR0107" H 4700 800 50  0001 C CNN
F 1 "+3.3VA" H 4750 1100 50  0000 C CNN
F 2 "" H 4700 950 50  0001 C CNN
F 3 "" H 4700 950 50  0001 C CNN
	1    4700 950 
	1    0    0    -1  
$EndComp
$Comp
L power:+3.3V #PWR0106
U 1 1 60616354
P 4500 950
F 0 "#PWR0106" H 4500 800 50  0001 C CNN
F 1 "+3.3V" H 4450 1100 50  0000 C CNN
F 2 "" H 4500 950 50  0001 C CNN
F 3 "" H 4500 950 50  0001 C CNN
	1    4500 950 
	1    0    0    -1  
$EndComp
Text GLabel 3950 1250 0    50   Input ~ 0
NRST
Text GLabel 3950 1950 0    50   Input ~ 0
HSE_OUT
Text GLabel 3950 1850 0    50   Input ~ 0
HSE_IN
$Comp
L power:GND #PWR0105
U 1 1 60614CDB
P 3900 1650
F 0 "#PWR0105" H 3900 1400 50  0001 C CNN
F 1 "GND" H 3750 1600 50  0000 C CNN
F 2 "" H 3900 1650 50  0001 C CNN
F 3 "" H 3900 1650 50  0001 C CNN
	1    3900 1650
	1    0    0    -1  
$EndComp
$Comp
L Device:R_Small R1
U 1 1 60612E8F
P 3900 1550
F 0 "R1" H 3850 1600 50  0000 R CNN
F 1 "10k" H 3850 1500 50  0000 R CNN
F 2 "Resistor_SMD:R_0603_1608Metric" H 3900 1550 50  0001 C CNN
F 3 "~" H 3900 1550 50  0001 C CNN
F 4 "C25804" H 3900 1550 50  0001 C CNN "LCSC Part #"
	1    3900 1550
	1    0    0    -1  
$EndComp
$Comp
L MCU_ST_STM32F3:STM32F334K8Tx U3
U 1 1 60610406
P 4600 1950
F 0 "U3" H 4900 950 50  0000 C CNN
F 1 "STM32F334K8Tx" H 5150 850 50  0000 C CNN
F 2 "Package_QFP:LQFP-32_7x7mm_P0.8mm" H 4100 1050 50  0001 R CNN
F 3 "http://www.st.com/st-web-ui/static/active/en/resource/technical/document/datasheet/DM00097745.pdf" H 4600 1950 50  0001 C CNN
	1    4600 1950
	1    0    0    -1  
$EndComp
Text GLabel 5150 1850 2    49   Input ~ 0
LD_100_80_TIM3_1
Text GLabel 3950 2350 0    50   Input ~ 0
SWO
$Comp
L power:+3.3V #PWR016
U 1 1 60416231
P 7200 1050
F 0 "#PWR016" H 7200 900 50  0001 C CNN
F 1 "+3.3V" H 7215 1223 50  0000 C CNN
F 2 "" H 7200 1050 50  0001 C CNN
F 3 "" H 7200 1050 50  0001 C CNN
	1    7200 1050
	1    0    0    -1  
$EndComp
$Comp
L power:+3.3VA #PWR019
U 1 1 60419657
P 8250 1000
F 0 "#PWR019" H 8250 850 50  0001 C CNN
F 1 "+3.3VA" H 8265 1173 50  0000 C CNN
F 2 "" H 8250 1000 50  0001 C CNN
F 3 "" H 8250 1000 50  0001 C CNN
	1    8250 1000
	1    0    0    -1  
$EndComp
Wire Wire Line
	7200 1050 7550 1050
Text GLabel 5150 2450 2    50   Input ~ 0
CAN_TX
Text GLabel 5150 2350 2    50   Input ~ 0
CAN_RX
Text GLabel 5150 2550 2    50   Input ~ 0
SWDIO
Text GLabel 5150 2650 2    50   Input ~ 0
SWCLK
Text GLabel 5150 2150 2    50   Input ~ 0
LD_CAN_TX
Text GLabel 5150 2250 2    50   Input ~ 0
LD_CAN_RX
Wire Notes Line
	7600 3650 7600 6700
Wire Notes Line
	550  6700 7600 6700
$Comp
L Device:C_Small C14
U 1 1 606301E3
P 8050 5300
F 0 "C14" H 8142 5346 50  0000 L CNN
F 1 "100n" H 8142 5255 50  0000 L CNN
F 2 "Capacitor_SMD:C_0603_1608Metric" H 8050 5300 50  0001 C CNN
F 3 "~" H 8050 5300 50  0001 C CNN
F 4 "C14663" H 8050 5300 50  0001 C CNN "LCSC Part #"
	1    8050 5300
	1    0    0    -1  
$EndComp
Wire Wire Line
	8050 5150 8050 5200
Wire Wire Line
	8050 5400 8050 5450
$Comp
L power:GND #PWR015
U 1 1 606F444E
P 8850 2050
F 0 "#PWR015" H 8850 1800 50  0001 C CNN
F 1 "GND" H 8855 1877 50  0000 C CNN
F 2 "" H 8850 2050 50  0001 C CNN
F 3 "" H 8850 2050 50  0001 C CNN
	1    8850 2050
	1    0    0    -1  
$EndComp
$Comp
L Device:R_Small R8
U 1 1 606F445B
P 8850 1900
F 0 "R8" H 8800 1950 50  0000 R CNN
F 1 "220R" H 8800 1850 50  0000 R CNN
F 2 "Resistor_SMD:R_0603_1608Metric" H 8850 1900 50  0001 C CNN
F 3 "~" H 8850 1900 50  0001 C CNN
F 4 "C22962" H 8850 1900 50  0001 C CNN "LCSC Part #"
	1    8850 1900
	1    0    0    -1  
$EndComp
$Comp
L Device:LED_Small D9
U 1 1 606F4467
P 8850 1650
F 0 "D9" V 8900 1850 50  0000 R CNN
F 1 "Red" V 8800 1900 50  0000 R CNN
F 2 "LED_SMD:LED_0805_2012Metric" V 8850 1650 50  0001 C CNN
F 3 "~" V 8850 1650 50  0001 C CNN
F 4 "C84256" H 8850 1650 50  0001 C CNN "LCSC Part #"
	1    8850 1650
	0    -1   -1   0   
$EndComp
Wire Wire Line
	8850 1500 8850 1550
Wire Wire Line
	8850 2000 8850 2050
Wire Wire Line
	8850 1750 8850 1800
$Comp
L power:GND #PWR017
U 1 1 6070CC81
P 9200 2050
F 0 "#PWR017" H 9200 1800 50  0001 C CNN
F 1 "GND" H 9205 1877 50  0000 C CNN
F 2 "" H 9200 2050 50  0001 C CNN
F 3 "" H 9200 2050 50  0001 C CNN
	1    9200 2050
	1    0    0    -1  
$EndComp
$Comp
L Device:R_Small R9
U 1 1 6070CC87
P 9200 1900
F 0 "R9" H 9150 1950 50  0000 R CNN
F 1 "220R" H 9150 1850 50  0000 R CNN
F 2 "Resistor_SMD:R_0603_1608Metric" H 9200 1900 50  0001 C CNN
F 3 "~" H 9200 1900 50  0001 C CNN
F 4 "C22962" H 9200 1900 50  0001 C CNN "LCSC Part #"
	1    9200 1900
	1    0    0    -1  
$EndComp
$Comp
L Device:LED_Small D10
U 1 1 6070CC8D
P 9200 1650
F 0 "D10" V 9250 1850 50  0000 R CNN
F 1 "Red" V 9150 1900 50  0000 R CNN
F 2 "LED_SMD:LED_0805_2012Metric" V 9200 1650 50  0001 C CNN
F 3 "~" V 9200 1650 50  0001 C CNN
F 4 "C84256" H 9200 1650 50  0001 C CNN "LCSC Part #"
	1    9200 1650
	0    -1   -1   0   
$EndComp
Wire Wire Line
	9200 1500 9200 1550
Wire Wire Line
	9200 2000 9200 2050
Wire Wire Line
	9200 1750 9200 1800
$Comp
L power:GND #PWR018
U 1 1 607191D6
P 9550 2050
F 0 "#PWR018" H 9550 1800 50  0001 C CNN
F 1 "GND" H 9555 1877 50  0000 C CNN
F 2 "" H 9550 2050 50  0001 C CNN
F 3 "" H 9550 2050 50  0001 C CNN
	1    9550 2050
	1    0    0    -1  
$EndComp
$Comp
L Device:R_Small R11
U 1 1 607191DC
P 9550 1900
F 0 "R11" H 9500 1950 50  0000 R CNN
F 1 "220R" H 9500 1850 50  0000 R CNN
F 2 "Resistor_SMD:R_0603_1608Metric" H 9550 1900 50  0001 C CNN
F 3 "~" H 9550 1900 50  0001 C CNN
F 4 "C22962" H 9550 1900 50  0001 C CNN "LCSC Part #"
	1    9550 1900
	1    0    0    -1  
$EndComp
$Comp
L Device:LED_Small D11
U 1 1 607191E2
P 9550 1650
F 0 "D11" V 9600 1850 50  0000 R CNN
F 1 "Red" V 9500 1900 50  0000 R CNN
F 2 "LED_SMD:LED_0805_2012Metric" V 9550 1650 50  0001 C CNN
F 3 "~" V 9550 1650 50  0001 C CNN
F 4 "C84256" H 9550 1650 50  0001 C CNN "LCSC Part #"
	1    9550 1650
	0    -1   -1   0   
$EndComp
Wire Wire Line
	9550 1500 9550 1550
Wire Wire Line
	9550 2000 9550 2050
Wire Wire Line
	9550 1750 9550 1800
$Comp
L power:GND #PWR022
U 1 1 607259A1
P 9900 2050
F 0 "#PWR022" H 9900 1800 50  0001 C CNN
F 1 "GND" H 9905 1877 50  0000 C CNN
F 2 "" H 9900 2050 50  0001 C CNN
F 3 "" H 9900 2050 50  0001 C CNN
	1    9900 2050
	1    0    0    -1  
$EndComp
$Comp
L Device:R_Small R12
U 1 1 607259A7
P 9900 1900
F 0 "R12" H 9850 1950 50  0000 R CNN
F 1 "220R" H 9850 1850 50  0000 R CNN
F 2 "Resistor_SMD:R_0603_1608Metric" H 9900 1900 50  0001 C CNN
F 3 "~" H 9900 1900 50  0001 C CNN
F 4 "C22962" H 9900 1900 50  0001 C CNN "LCSC Part #"
	1    9900 1900
	1    0    0    -1  
$EndComp
$Comp
L Device:LED_Small D12
U 1 1 607259AD
P 9900 1650
F 0 "D12" V 9950 1850 50  0000 R CNN
F 1 "Red" V 9850 1900 50  0000 R CNN
F 2 "LED_SMD:LED_0805_2012Metric" V 9900 1650 50  0001 C CNN
F 3 "~" V 9900 1650 50  0001 C CNN
F 4 "C84256" H 9900 1650 50  0001 C CNN "LCSC Part #"
	1    9900 1650
	0    -1   -1   0   
$EndComp
Wire Wire Line
	9900 1500 9900 1550
Wire Wire Line
	9900 2000 9900 2050
Wire Wire Line
	9900 1750 9900 1800
Text GLabel 8850 1500 1    49   Input ~ 0
LD_100_80_TIM3_1
Text GLabel 9200 1500 1    49   Input ~ 0
LD_80_60_TIM3_2
Text GLabel 9550 1500 1    49   Input ~ 0
LD_60_40_TIM3_3
Text GLabel 9900 1500 1    49   Input ~ 0
LD_40_20_TIM3_4
$Comp
L power:GND #PWR021
U 1 1 60734327
P 9050 3350
F 0 "#PWR021" H 9050 3100 50  0001 C CNN
F 1 "GND" H 9055 3177 50  0000 C CNN
F 2 "" H 9050 3350 50  0001 C CNN
F 3 "" H 9050 3350 50  0001 C CNN
	1    9050 3350
	1    0    0    -1  
$EndComp
$Comp
L Device:Buzzer BZ1
U 1 1 60735F43
P 8900 2750
F 0 "BZ1" H 8600 2800 50  0000 C CNN
F 1 "Buzzer" H 8550 2700 50  0000 C CNN
F 2 "Buzzer_Beeper:MagneticBuzzer_PUI_AT-0927-TT-6-R" V 8875 2850 50  0001 C CNN
F 3 "~" V 8875 2850 50  0001 C CNN
	1    8900 2750
	-1   0    0    -1  
$EndComp
Text GLabel 9400 3100 2    50   Input ~ 0
BUZ_TIM2_4
Wire Notes Line
	10000 700  10000 3600
Wire Notes Line
	10000 3600 8550 3600
Wire Notes Line
	8550 3600 8550 700 
Wire Notes Line
	8550 700  10000 700 
Text Notes 8550 650  0    50   ~ 0
Alarm
Text Notes 7650 3600 0    50   ~ 0
CAN
Text Notes 550  3600 0    50   ~ 0
Power Section
$Comp
L Connector:Screw_Terminal_01x02 J7
U 1 1 60825D80
P 10450 1000
F 0 "J7" H 10530 992 50  0000 L CNN
F 1 "12V" H 10530 901 50  0000 L CNN
F 2 "TerminalBlock_Phoenix:TerminalBlock_Phoenix_MKDS-1,5-2-5.08_1x02_P5.08mm_Horizontal" H 10450 1000 50  0001 C CNN
F 3 "~" H 10450 1000 50  0001 C CNN
	1    10450 1000
	1    0    0    -1  
$EndComp
$Comp
L power:GND #PWR028
U 1 1 608295C7
P 10200 1150
F 0 "#PWR028" H 10200 900 50  0001 C CNN
F 1 "GND" H 10205 977 50  0000 C CNN
F 2 "" H 10200 1150 50  0001 C CNN
F 3 "" H 10200 1150 50  0001 C CNN
	1    10200 1150
	1    0    0    -1  
$EndComp
Wire Wire Line
	10200 950  10200 1000
Wire Wire Line
	10200 1000 10250 1000
Wire Wire Line
	10200 1150 10200 1100
Wire Wire Line
	10200 1100 10250 1100
$Comp
L power:+12V #PWR023
U 1 1 608440B8
P 10200 950
F 0 "#PWR023" H 10200 800 50  0001 C CNN
F 1 "+12V" H 10215 1123 50  0000 C CNN
F 2 "" H 10200 950 50  0001 C CNN
F 3 "" H 10200 950 50  0001 C CNN
	1    10200 950 
	1    0    0    -1  
$EndComp
$Comp
L Connector:Screw_Terminal_01x02 J9
U 1 1 60848E88
P 11000 1000
F 0 "J9" H 11080 992 50  0000 L CNN
F 1 "12V" H 11080 901 50  0000 L CNN
F 2 "TerminalBlock_Phoenix:TerminalBlock_Phoenix_MKDS-1,5-2-5.08_1x02_P5.08mm_Horizontal" H 11000 1000 50  0001 C CNN
F 3 "~" H 11000 1000 50  0001 C CNN
	1    11000 1000
	1    0    0    -1  
$EndComp
$Comp
L power:GND #PWR032
U 1 1 60848E8E
P 10750 1150
F 0 "#PWR032" H 10750 900 50  0001 C CNN
F 1 "GND" H 10755 977 50  0000 C CNN
F 2 "" H 10750 1150 50  0001 C CNN
F 3 "" H 10750 1150 50  0001 C CNN
	1    10750 1150
	1    0    0    -1  
$EndComp
Wire Wire Line
	10750 950  10750 1000
Wire Wire Line
	10750 1000 10800 1000
Wire Wire Line
	10750 1150 10750 1100
Wire Wire Line
	10750 1100 10800 1100
$Comp
L power:+12V #PWR031
U 1 1 60848E98
P 10750 950
F 0 "#PWR031" H 10750 800 50  0001 C CNN
F 1 "+12V" H 10765 1123 50  0000 C CNN
F 2 "" H 10750 950 50  0001 C CNN
F 3 "" H 10750 950 50  0001 C CNN
	1    10750 950 
	1    0    0    -1  
$EndComp
$Comp
L Connector:Screw_Terminal_01x02 J11
U 1 1 6085711F
P 11550 1000
F 0 "J11" H 11630 992 50  0000 L CNN
F 1 "12V" H 11630 901 50  0000 L CNN
F 2 "TerminalBlock_Phoenix:TerminalBlock_Phoenix_MKDS-1,5-2-5.08_1x02_P5.08mm_Horizontal" H 11550 1000 50  0001 C CNN
F 3 "~" H 11550 1000 50  0001 C CNN
	1    11550 1000
	1    0    0    -1  
$EndComp
$Comp
L power:GND #PWR037
U 1 1 60857125
P 11300 1150
F 0 "#PWR037" H 11300 900 50  0001 C CNN
F 1 "GND" H 11305 977 50  0000 C CNN
F 2 "" H 11300 1150 50  0001 C CNN
F 3 "" H 11300 1150 50  0001 C CNN
	1    11300 1150
	1    0    0    -1  
$EndComp
Wire Wire Line
	11300 950  11300 1000
Wire Wire Line
	11300 1000 11350 1000
Wire Wire Line
	11300 1150 11300 1100
Wire Wire Line
	11300 1100 11350 1100
$Comp
L power:+12V #PWR036
U 1 1 6085712F
P 11300 950
F 0 "#PWR036" H 11300 800 50  0001 C CNN
F 1 "+12V" H 11315 1123 50  0000 C CNN
F 2 "" H 11300 950 50  0001 C CNN
F 3 "" H 11300 950 50  0001 C CNN
	1    11300 950 
	1    0    0    -1  
$EndComp
$Comp
L Connector:Screw_Terminal_01x02 J8
U 1 1 6086530A
P 10450 1750
F 0 "J8" H 10530 1742 50  0000 L CNN
F 1 "5V" H 10530 1651 50  0000 L CNN
F 2 "TerminalBlock_Phoenix:TerminalBlock_Phoenix_MKDS-1,5-2-5.08_1x02_P5.08mm_Horizontal" H 10450 1750 50  0001 C CNN
F 3 "~" H 10450 1750 50  0001 C CNN
	1    10450 1750
	1    0    0    -1  
$EndComp
$Comp
L power:GND #PWR030
U 1 1 60865310
P 10200 1900
F 0 "#PWR030" H 10200 1650 50  0001 C CNN
F 1 "GND" H 10205 1727 50  0000 C CNN
F 2 "" H 10200 1900 50  0001 C CNN
F 3 "" H 10200 1900 50  0001 C CNN
	1    10200 1900
	1    0    0    -1  
$EndComp
Wire Wire Line
	10200 1700 10200 1750
Wire Wire Line
	10200 1750 10250 1750
Wire Wire Line
	10200 1900 10200 1850
Wire Wire Line
	10200 1850 10250 1850
$Comp
L power:+5V #PWR029
U 1 1 60872ABF
P 10200 1700
F 0 "#PWR029" H 10200 1550 50  0001 C CNN
F 1 "+5V" H 10215 1873 50  0000 C CNN
F 2 "" H 10200 1700 50  0001 C CNN
F 3 "" H 10200 1700 50  0001 C CNN
	1    10200 1700
	1    0    0    -1  
$EndComp
$Comp
L Connector:Screw_Terminal_01x02 J10
U 1 1 60875939
P 11000 1750
F 0 "J10" H 11080 1742 50  0000 L CNN
F 1 "5V" H 11080 1651 50  0000 L CNN
F 2 "TerminalBlock_Phoenix:TerminalBlock_Phoenix_MKDS-1,5-2-5.08_1x02_P5.08mm_Horizontal" H 11000 1750 50  0001 C CNN
F 3 "~" H 11000 1750 50  0001 C CNN
	1    11000 1750
	1    0    0    -1  
$EndComp
$Comp
L power:GND #PWR035
U 1 1 6087593F
P 10750 1900
F 0 "#PWR035" H 10750 1650 50  0001 C CNN
F 1 "GND" H 10755 1727 50  0000 C CNN
F 2 "" H 10750 1900 50  0001 C CNN
F 3 "" H 10750 1900 50  0001 C CNN
	1    10750 1900
	1    0    0    -1  
$EndComp
Wire Wire Line
	10750 1700 10750 1750
Wire Wire Line
	10750 1750 10800 1750
Wire Wire Line
	10750 1900 10750 1850
Wire Wire Line
	10750 1850 10800 1850
$Comp
L power:+5V #PWR034
U 1 1 60875949
P 10750 1700
F 0 "#PWR034" H 10750 1550 50  0001 C CNN
F 1 "+5V" H 10765 1873 50  0000 C CNN
F 2 "" H 10750 1700 50  0001 C CNN
F 3 "" H 10750 1700 50  0001 C CNN
	1    10750 1700
	1    0    0    -1  
$EndComp
$Comp
L Connector:Screw_Terminal_01x02 J12
U 1 1 60884AB3
P 11550 1750
F 0 "J12" H 11630 1742 50  0000 L CNN
F 1 "5V" H 11630 1651 50  0000 L CNN
F 2 "TerminalBlock_Phoenix:TerminalBlock_Phoenix_MKDS-1,5-2-5.08_1x02_P5.08mm_Horizontal" H 11550 1750 50  0001 C CNN
F 3 "~" H 11550 1750 50  0001 C CNN
	1    11550 1750
	1    0    0    -1  
$EndComp
$Comp
L power:GND #PWR040
U 1 1 60884AB9
P 11300 1900
F 0 "#PWR040" H 11300 1650 50  0001 C CNN
F 1 "GND" H 11305 1727 50  0000 C CNN
F 2 "" H 11300 1900 50  0001 C CNN
F 3 "" H 11300 1900 50  0001 C CNN
	1    11300 1900
	1    0    0    -1  
$EndComp
Wire Wire Line
	11300 1700 11300 1750
Wire Wire Line
	11300 1750 11350 1750
Wire Wire Line
	11300 1900 11300 1850
Wire Wire Line
	11300 1850 11350 1850
$Comp
L power:+5V #PWR038
U 1 1 60884AC3
P 11300 1700
F 0 "#PWR038" H 11300 1550 50  0001 C CNN
F 1 "+5V" H 11315 1873 50  0000 C CNN
F 2 "" H 11300 1700 50  0001 C CNN
F 3 "" H 11300 1700 50  0001 C CNN
	1    11300 1700
	1    0    0    -1  
$EndComp
Text Notes 10050 650  0    50   ~ 0
Power Outputs
$Comp
L Connector:TestPoint_2Pole TP1
U 1 1 608ECAB9
P 1100 5450
F 0 "TP1" H 1100 5645 50  0000 C CNN
F 1 "BATT TEST POINT" H 1100 5554 50  0000 C CNN
F 2 "TestPoint:TestPoint_2Pads_Pitch5.08mm_Drill1.3mm" H 1100 5450 50  0001 C CNN
F 3 "~" H 1100 5450 50  0001 C CNN
	1    1100 5450
	1    0    0    -1  
$EndComp
$Comp
L power:GND #PWR010
U 1 1 608EDCB0
P 850 5500
F 0 "#PWR010" H 850 5250 50  0001 C CNN
F 1 "GND" H 855 5327 50  0000 C CNN
F 2 "" H 850 5500 50  0001 C CNN
F 3 "" H 850 5500 50  0001 C CNN
	1    850  5500
	1    0    0    -1  
$EndComp
$Comp
L power:+BATT #PWR011
U 1 1 608EE47A
P 1500 5400
F 0 "#PWR011" H 1500 5250 50  0001 C CNN
F 1 "+BATT" H 1515 5573 50  0000 C CNN
F 2 "" H 1500 5400 50  0001 C CNN
F 3 "" H 1500 5400 50  0001 C CNN
	1    1500 5400
	1    0    0    -1  
$EndComp
Wire Wire Line
	850  5500 850  5450
Wire Wire Line
	850  5450 900  5450
Wire Wire Line
	1500 5450 1500 5400
Wire Wire Line
	1300 5450 1500 5450
$Comp
L Connector:TestPoint_2Pole TP2
U 1 1 6093F84E
P 2350 2900
F 0 "TP2" H 2350 3095 50  0000 C CNN
F 1 "3V3 TEST POINT" H 2350 3004 50  0000 C CNN
F 2 "TestPoint:TestPoint_2Pads_Pitch2.54mm_Drill0.8mm" H 2350 2900 50  0001 C CNN
F 3 "~" H 2350 2900 50  0001 C CNN
	1    2350 2900
	1    0    0    -1  
$EndComp
$Comp
L power:GND #PWR013
U 1 1 6093F854
P 2100 2950
F 0 "#PWR013" H 2100 2700 50  0001 C CNN
F 1 "GND" H 2105 2777 50  0000 C CNN
F 2 "" H 2100 2950 50  0001 C CNN
F 3 "" H 2100 2950 50  0001 C CNN
	1    2100 2950
	1    0    0    -1  
$EndComp
Wire Wire Line
	2100 2950 2100 2900
Wire Wire Line
	2100 2900 2150 2900
Wire Wire Line
	2750 2900 2750 2850
Wire Wire Line
	2550 2900 2750 2900
$Comp
L power:+3.3V #PWR014
U 1 1 6095F487
P 2750 2850
F 0 "#PWR014" H 2750 2700 50  0001 C CNN
F 1 "+3.3V" H 2700 3000 50  0000 C CNN
F 2 "" H 2750 2850 50  0001 C CNN
F 3 "" H 2750 2850 50  0001 C CNN
	1    2750 2850
	1    0    0    -1  
$EndComp
$Comp
L power:GND #PWR042
U 1 1 609655CA
P 12000 1700
F 0 "#PWR042" H 12000 1450 50  0001 C CNN
F 1 "GND" H 12005 1527 50  0000 C CNN
F 2 "" H 12000 1700 50  0001 C CNN
F 3 "" H 12000 1700 50  0001 C CNN
	1    12000 1700
	1    0    0    -1  
$EndComp
$Comp
L Device:R_Small R13
U 1 1 609655D0
P 12000 1550
F 0 "R13" H 11950 1600 50  0000 R CNN
F 1 "470R" H 11950 1500 50  0000 R CNN
F 2 "Resistor_SMD:R_0603_1608Metric" H 12000 1550 50  0001 C CNN
F 3 "~" H 12000 1550 50  0001 C CNN
F 4 "C23179" H 12000 1550 50  0001 C CNN "LCSC Part #"
	1    12000 1550
	1    0    0    -1  
$EndComp
$Comp
L Device:LED_Small D13
U 1 1 609655D6
P 12000 1300
F 0 "D13" V 12050 1500 50  0000 R CNN
F 1 "Green" V 11950 1600 50  0000 R CNN
F 2 "LED_SMD:LED_0603_1608Metric" V 12000 1300 50  0001 C CNN
F 3 "~" V 12000 1300 50  0001 C CNN
F 4 "C72043" H 12000 1300 50  0001 C CNN "LCSC Part #"
	1    12000 1300
	0    -1   -1   0   
$EndComp
Wire Wire Line
	12000 1150 12000 1200
Wire Wire Line
	12000 1650 12000 1700
Wire Wire Line
	12000 1400 12000 1450
$Comp
L power:GND #PWR044
U 1 1 609655DF
P 12400 1700
F 0 "#PWR044" H 12400 1450 50  0001 C CNN
F 1 "GND" H 12405 1527 50  0000 C CNN
F 2 "" H 12400 1700 50  0001 C CNN
F 3 "" H 12400 1700 50  0001 C CNN
	1    12400 1700
	1    0    0    -1  
$EndComp
$Comp
L Device:LED_Small D14
U 1 1 609655EB
P 12400 1300
F 0 "D14" V 12450 1500 50  0000 R CNN
F 1 "Green" V 12350 1600 50  0000 R CNN
F 2 "LED_SMD:LED_0603_1608Metric" V 12400 1300 50  0001 C CNN
F 3 "~" V 12400 1300 50  0001 C CNN
F 4 "C72043" H 12400 1300 50  0001 C CNN "LCSC Part #"
	1    12400 1300
	0    -1   -1   0   
$EndComp
Wire Wire Line
	12400 1150 12400 1200
Wire Wire Line
	12400 1650 12400 1700
Wire Wire Line
	12400 1400 12400 1450
$Comp
L power:+5V #PWR041
U 1 1 60985AEE
P 12000 1150
F 0 "#PWR041" H 12000 1000 50  0001 C CNN
F 1 "+5V" H 12015 1323 50  0000 C CNN
F 2 "" H 12000 1150 50  0001 C CNN
F 3 "" H 12000 1150 50  0001 C CNN
	1    12000 1150
	1    0    0    -1  
$EndComp
$Comp
L power:+12V #PWR043
U 1 1 6098640E
P 12400 1150
F 0 "#PWR043" H 12400 1000 50  0001 C CNN
F 1 "+12V" H 12415 1323 50  0000 C CNN
F 2 "" H 12400 1150 50  0001 C CNN
F 3 "" H 12400 1150 50  0001 C CNN
	1    12400 1150
	1    0    0    -1  
$EndComp
$Comp
L Device:R_Small R14
U 1 1 609A9ABE
P 12400 1550
F 0 "R14" H 12450 1600 50  0000 L CNN
F 1 "2.2k" H 12450 1500 50  0000 L CNN
F 2 "Resistor_SMD:R_0603_1608Metric" H 12400 1550 50  0001 C CNN
F 3 "~" H 12400 1550 50  0001 C CNN
F 4 "C4190" H 12400 1550 50  0001 C CNN "LCSC Part #"
	1    12400 1550
	-1   0    0    1   
$EndComp
Wire Notes Line
	10050 700  12650 700 
Wire Wire Line
	5100 1350 5150 1350
$Comp
L Device:R_Small R15
U 1 1 609FC8A0
P 7500 2750
F 0 "R15" H 7450 2800 50  0000 R CNN
F 1 "10k" H 7450 2700 50  0000 R CNN
F 2 "Resistor_SMD:R_0603_1608Metric" H 7500 2750 50  0001 C CNN
F 3 "~" H 7500 2750 50  0001 C CNN
F 4 "C25804" H 7500 2750 50  0001 C CNN "LCSC Part #"
	1    7500 2750
	1    0    0    -1  
$EndComp
$Comp
L Device:R_Small R16
U 1 1 609FC8A6
P 7500 3050
F 0 "R16" H 7450 3100 50  0000 R CNN
F 1 "1K" H 7450 3000 50  0000 R CNN
F 2 "Resistor_SMD:R_0603_1608Metric" H 7500 3050 50  0001 C CNN
F 3 "~" H 7500 3050 50  0001 C CNN
F 4 "C21190" H 7500 3050 50  0001 C CNN "LCSC Part #"
	1    7500 3050
	1    0    0    -1  
$EndComp
$Comp
L power:GND #PWR0101
U 1 1 609FC8AD
P 7500 3200
F 0 "#PWR0101" H 7500 2950 50  0001 C CNN
F 1 "GND" H 7505 3027 50  0000 C CNN
F 2 "" H 7500 3200 50  0001 C CNN
F 3 "" H 7500 3200 50  0001 C CNN
	1    7500 3200
	1    0    0    -1  
$EndComp
Wire Wire Line
	7500 2600 7500 2650
Wire Wire Line
	7500 2850 7500 2900
Wire Wire Line
	7500 3150 7500 3200
Wire Wire Line
	7550 2900 7500 2900
Connection ~ 7500 2900
Wire Wire Line
	7500 2900 7500 2950
Text GLabel 7550 2900 2    50   Input ~ 0
VBAT_ADC1_2
$Comp
L power:+BATT #PWR0134
U 1 1 60A0D9E3
P 7500 2600
F 0 "#PWR0134" H 7500 2450 50  0001 C CNN
F 1 "+BATT" H 7515 2773 50  0000 C CNN
F 2 "" H 7500 2600 50  0001 C CNN
F 3 "" H 7500 2600 50  0001 C CNN
	1    7500 2600
	1    0    0    -1  
$EndComp
NoConn ~ 6450 2700
NoConn ~ 5950 2700
Text GLabel 6550 2800 2    49   Input ~ 0
NRST
$Comp
L power:GND #PWR012
U 1 1 606F4A06
P 6500 3100
F 0 "#PWR012" H 6500 2850 50  0001 C CNN
F 1 "GND" H 6505 2927 50  0000 C CNN
F 2 "" H 6500 3100 50  0001 C CNN
F 3 "" H 6500 3100 50  0001 C CNN
	1    6500 3100
	1    0    0    -1  
$EndComp
Text GLabel 6450 2600 2    49   Input ~ 0
SWO
Text GLabel 6450 2500 2    49   Input ~ 0
SWCLK
Connection ~ 5900 2600
Wire Wire Line
	5900 2500 5950 2500
Wire Wire Line
	5900 2600 5900 2500
Connection ~ 5900 2800
Wire Wire Line
	5900 2600 5950 2600
Wire Wire Line
	5900 2800 5900 2600
Wire Wire Line
	5900 2800 5950 2800
Wire Wire Line
	5900 2850 5900 2800
$Comp
L power:GND #PWR08
U 1 1 606DBA7A
P 5900 2850
F 0 "#PWR08" H 5900 2600 50  0001 C CNN
F 1 "GND" H 5905 2677 50  0000 C CNN
F 2 "" H 5900 2850 50  0001 C CNN
F 3 "" H 5900 2850 50  0001 C CNN
	1    5900 2850
	1    0    0    -1  
$EndComp
$Comp
L Connector_Generic:Conn_02x05_Odd_Even JLink1
U 1 1 606D1691
P 6150 2600
F 0 "JLink1" H 6200 3017 50  0000 C CNN
F 1 "SWD" H 6200 2926 50  0000 C CNN
F 2 "Connector_PinHeader_1.27mm:PinHeader_2x05_P1.27mm_Vertical" H 6150 2600 50  0001 C CNN
F 3 "~" H 6150 2600 50  0001 C CNN
	1    6150 2600
	1    0    0    -1  
$EndComp
Wire Wire Line
	6450 2800 6500 2800
$Comp
L Device:C_Small C4
U 1 1 60978D75
P 6500 2950
F 0 "C4" H 6592 2996 50  0000 L CNN
F 1 "100n" H 6592 2905 50  0000 L CNN
F 2 "Capacitor_SMD:C_0603_1608Metric" H 6500 2950 50  0001 C CNN
F 3 "~" H 6500 2950 50  0001 C CNN
F 4 "C14663" H 6500 2950 50  0001 C CNN "LCSC Part #"
	1    6500 2950
	1    0    0    -1  
$EndComp
Wire Wire Line
	6500 2800 6500 2850
Wire Wire Line
	6500 3050 6500 3100
Connection ~ 6500 2800
Wire Wire Line
	6500 2800 6550 2800
$Comp
L Device:C_Small C15
U 1 1 60A5F364
P 7200 3050
F 0 "C15" H 6950 3100 50  0000 L CNN
F 1 "10u" H 6950 3000 50  0000 L CNN
F 2 "Capacitor_SMD:C_0603_1608Metric" H 7200 3050 50  0001 C CNN
F 3 "~" H 7200 3050 50  0001 C CNN
F 4 "C19702" H 7200 3050 50  0001 C CNN "LCSC Part #"
	1    7200 3050
	1    0    0    -1  
$EndComp
$Comp
L power:GND #PWR045
U 1 1 60A71643
P 7200 3200
F 0 "#PWR045" H 7200 2950 50  0001 C CNN
F 1 "GND" H 7205 3027 50  0000 C CNN
F 2 "" H 7200 3200 50  0001 C CNN
F 3 "" H 7200 3200 50  0001 C CNN
	1    7200 3200
	1    0    0    -1  
$EndComp
Wire Wire Line
	7500 2900 7200 2900
Wire Wire Line
	7200 2900 7200 2950
Wire Wire Line
	7200 3150 7200 3200
$Comp
L Device:R_Small R17
U 1 1 60A9FFD2
P 7600 1800
F 0 "R17" V 7500 1850 50  0000 R CNN
F 1 "47R" V 7400 1850 50  0000 R CNN
F 2 "Resistor_SMD:R_0603_1608Metric" H 7600 1800 50  0001 C CNN
F 3 "~" H 7600 1800 50  0001 C CNN
F 4 "C23182" H 7600 1800 50  0001 C CNN "LCSC Part #"
	1    7600 1800
	0    1    1    0   
$EndComp
Text GLabel 5150 1750 2    50   Input ~ 0
RPi_off
Wire Wire Line
	5100 1750 5150 1750
Text GLabel 10500 2300 0    50   Input ~ 0
RPi_off
$Comp
L Connector_Generic:Conn_01x01 J13
U 1 1 6074461A
P 10750 2300
F 0 "J13" H 10830 2342 50  0000 L CNN
F 1 "RPi_off" H 10830 2251 50  0000 L CNN
F 2 "Connector_PinHeader_2.54mm:PinHeader_1x01_P2.54mm_Vertical" H 10750 2300 50  0001 C CNN
F 3 "~" H 10750 2300 50  0001 C CNN
	1    10750 2300
	1    0    0    -1  
$EndComp
Wire Wire Line
	10550 2300 10500 2300
Wire Notes Line
	10050 2450 12650 2450
Wire Notes Line
	10050 700  10050 2450
$Comp
L power:GND #PWR046
U 1 1 60774A58
P 6800 5550
F 0 "#PWR046" H 6800 5300 50  0001 C CNN
F 1 "GND" H 6805 5377 50  0000 C CNN
F 2 "" H 6800 5550 50  0001 C CNN
F 3 "" H 6800 5550 50  0001 C CNN
	1    6800 5550
	1    0    0    -1  
$EndComp
$Comp
L Device:R_Small R18
U 1 1 60774A5F
P 6800 5400
F 0 "R18" H 6750 5450 50  0000 R CNN
F 1 "470R" H 6750 5350 50  0000 R CNN
F 2 "Resistor_SMD:R_0603_1608Metric" H 6800 5400 50  0001 C CNN
F 3 "~" H 6800 5400 50  0001 C CNN
F 4 "C23179" H 6800 5400 50  0001 C CNN "LCSC Part #"
	1    6800 5400
	1    0    0    -1  
$EndComp
$Comp
L Device:LED_Small D15
U 1 1 60774A66
P 6800 5150
F 0 "D15" V 6850 5350 50  0000 R CNN
F 1 "Green" V 6750 5450 50  0000 R CNN
F 2 "LED_SMD:LED_0603_1608Metric" V 6800 5150 50  0001 C CNN
F 3 "~" V 6800 5150 50  0001 C CNN
F 4 "C72043" H 6800 5150 50  0001 C CNN "LCSC Part #"
	1    6800 5150
	0    -1   -1   0   
$EndComp
Wire Wire Line
	6800 5500 6800 5550
Wire Wire Line
	6800 5250 6800 5300
Wire Wire Line
	6800 4450 6800 5050
Connection ~ 6800 4450
Wire Notes Line
	12650 2450 12650 700 
$Comp
L Transistor_FET:2N7002 Q1
U 1 1 60B79E9A
P 1950 5600
F 0 "Q1" H 2154 5646 50  0000 L CNN
F 1 "2N7002" H 2154 5555 50  0000 L CNN
F 2 "Package_TO_SOT_SMD:SOT-23" H 2150 5525 50  0001 L CIN
F 3 "https://www.fairchildsemi.com/datasheets/2N/2N7002.pdf" H 1950 5600 50  0001 L CNN
F 4 "C8545" H 1950 5600 50  0001 C CNN "LCSC Part #"
	1    1950 5600
	-1   0    0    -1  
$EndComp
$Comp
L Transistor_FET:2N7002 Q2
U 1 1 60B82F42
P 4850 5700
F 0 "Q2" H 5054 5746 50  0000 L CNN
F 1 "2N7002" H 5054 5655 50  0000 L CNN
F 2 "Package_TO_SOT_SMD:SOT-23" H 5050 5625 50  0001 L CIN
F 3 "https://www.fairchildsemi.com/datasheets/2N/2N7002.pdf" H 4850 5700 50  0001 L CNN
F 4 "C8545" H 4850 5700 50  0001 C CNN "LCSC Part #"
	1    4850 5700
	-1   0    0    -1  
$EndComp
$Comp
L Transistor_FET:2N7002 Q3
U 1 1 60BC4830
P 9150 3100
F 0 "Q3" H 9400 3250 50  0000 L CNN
F 1 "2N7002" H 9350 3150 50  0000 L CNN
F 2 "Package_TO_SOT_SMD:SOT-23" H 9350 3025 50  0001 L CIN
F 3 "https://www.fairchildsemi.com/datasheets/2N/2N7002.pdf" H 9150 3100 50  0001 L CNN
F 4 "C8545" H 9150 3100 50  0001 C CNN "LCSC Part #"
	1    9150 3100
	-1   0    0    -1  
$EndComp
$Comp
L power:+3.3V #PWR0135
U 1 1 60C33CE0
P 9050 2600
F 0 "#PWR0135" H 9050 2450 50  0001 C CNN
F 1 "+3.3V" H 9065 2773 50  0000 C CNN
F 2 "" H 9050 2600 50  0001 C CNN
F 3 "" H 9050 2600 50  0001 C CNN
	1    9050 2600
	1    0    0    -1  
$EndComp
Wire Wire Line
	9000 2650 9050 2650
Wire Wire Line
	9050 2650 9050 2600
Wire Wire Line
	9000 2850 9050 2850
Wire Wire Line
	9050 2850 9050 2900
Wire Wire Line
	9050 3300 9050 3350
Wire Wire Line
	9350 3100 9400 3100
Wire Wire Line
	4750 4950 4750 5300
Wire Wire Line
	4750 5300 4950 5300
Connection ~ 4750 5300
Wire Wire Line
	4750 5300 4750 5500
Wire Wire Line
	5250 5300 5450 5300
Wire Wire Line
	5450 5300 5450 4950
Connection ~ 5450 4950
Wire Wire Line
	2550 4900 2550 4950
Connection ~ 2550 4950
Connection ~ 1850 5250
$EndSCHEMATC
