(kicad_sch (version 20230121) (generator eeschema)

  (uuid e91ac64b-ee2a-40ae-a8d2-5b0b86ef0dd6)

  (paper "A4")

  (lib_symbols
  )


  (sheet (at 83.82 20.32) (size 60.96 29.21) (fields_autoplaced)
    (stroke (width 0.1524) (type solid))
    (fill (color 0 0 0 0.0000))
    (uuid 6a512f79-7c15-4c63-a035-0e2417b9ef56)
    (property "Sheetname" "tension" (at 83.82 19.6084 0)
      (effects (font (size 1.27 1.27)) (justify left bottom))
    )
    (property "Sheetfile" "untitled2.kicad_sch" (at 83.82 50.1146 0)
      (effects (font (size 1.27 1.27)) (justify left top))
    )
    (instances
      (project "monitoring"
        (path "/e91ac64b-ee2a-40ae-a8d2-5b0b86ef0dd6" (page "3"))
      )
    )
  )

  (sheet (at 16.51 20.32) (size 55.88 29.21) (fields_autoplaced)
    (stroke (width 0.1524) (type solid))
    (fill (color 0 0 0 0.0000))
    (uuid c54e1fb0-9dc1-4cc2-8d41-cd963f36ae2f)
    (property "Sheetname" "courant" (at 16.51 19.6084 0)
      (effects (font (size 1.27 1.27)) (justify left bottom))
    )
    (property "Sheetfile" "untitled.kicad_sch" (at 16.51 50.1146 0)
      (effects (font (size 1.27 1.27)) (justify left top))
    )
    (instances
      (project "monitoring"
        (path "/e91ac64b-ee2a-40ae-a8d2-5b0b86ef0dd6" (page "2"))
      )
    )
  )

  (sheet_instances
    (path "/" (page "1"))
  )
)
