{
    "name": "hermes",
    "version": "0.2.0",
    "build": {
        "srcDir": "src",
        "includeDir": "include",
        "flags": [
            "-DHERMES_PERIPHERAL_STATIC=1",
            "-DHERMES_OBJECT_SLOT=1"
        ]
    }
}