<svg version="1.1" id="logo" xmlns="http://www.w3.org/2000/svg" xmlns:xlink="http://www.w3.org/1999/xlink" x="0px" y="0px"
 viewBox="0 0 211.1 195.6" style="enable-background:new 0 0 211.1 195.6;" xml:space="preserve">

 <defs>
	 <style type="text/css">
		.st0{fill:none;stroke:#D9A743;stroke-width:2;stroke-miterlimit:5;}
		
		.st0 {
			stroke-dasharray: 1600;
			stroke-dashoffset: 0;
			-webkit-animation: dash 5s linear forwards;
			-o-animation: dash 5s linear forwards;
			-moz-animation: dash 5s linear forwards;
			animation: dash 5s linear forwards;
		}
		
		#logo {
			cursor:pointer;
		}
		
		#logo:hover .st0 {
			fill:#D9A743;
			transition: .8s;
		}

		@-webkit-keyframes dash {
			from {
				stroke-dashoffset: 1600;
			}
			to {
				stroke-dashoffset: 0;
			}
		}
	</style>
</defs>

<path class="st0" d="M204.8,10.2c0.3,5.9-0.2,15.6-6.2,24c-8.9,12.5-24.7,15.5-37.3,17.8
					c-24.8,4.6-40.4-1.1-44.4,6.7c-2.2,4.3,0.5,9.8,1.7,12.3c5.2,10.5,15.1,9.4,24.5,17.9c10.4,9.4,3.2,15.1,15.1,33
					c4.9,7.4,8.2,9.5,22.1,28.4c3.8,5.1,7.5,10.3,6.2,16.1c-0.8,3.4-3.7,8.9-8.3,10.3c-1.3,0.4-2.7,0.4-4.6,1.5
					c-2.3,1.3-3.1,2.8-4.3,3.9c-3.5,3.4-9.8,2.3-13.1,1.8c-6.7-1.1-7.9-3.8-14.2-6.3c-8.1-3.2-8.7,0.2-23.4-2.1
					c-9.5-1.5-14.3-2.3-19.8-4.8c-4.2-1.9-6.1-2.5-9.6-2.9c-6.7-0.7-11.7,1.5-15.2,2.8c-5.7,2.1-14.1,4.2-25.8,3.9
					c5.9-0.8,13.8-2.6,22.6-6.6c6.5-3,11.6-6.4,15.5-9.5c0,0.2-0.1,0.7,0.1,1.2c0.2,0.6,0.6,0.9,0.8,1c0.6-0.8,1.3-1.6,1.9-2.4
					c1.4,3.1,2.5,3.9,3.3,3.8c1.2,0,1.9-1.6,2.9-1.4c0.7,0.2,1.1,1.2,1.4,2.1c0.4-0.4,0.7-0.8,1.1-1.1c0.3,0.5,0.6,0.9,0.8,1.4
					c3.4-2.6,6.4-3.6,8.4-4.1c6.1-1.3,9.2,1,18.4,0.4c2.8-0.2,7.1-0.5,7.7-2.5c0.6-2.1-3.2-5-3.7-5.4c1.2,0.3,3,0.6,5.3,0.3
					c0.6-0.1,6.2-0.8,6.9-3.4c0.4-1.6-1.3-2.7-0.6-3.9c0.5-0.8,1.5-0.7,2.8-1.2c2.4-0.9,4.5-3.6,4.4-5.6c-0.1-2.6-3.6-2.7-9.9-8
					c-4.5-3.8-3.6-4.4-7.3-6.9c-2.6-1.7-5.1-2.7-5.4-4.9c-0.2-1.2,0.4-1.6,0.4-3.7c0,0,0-2-0.9-4.4c-1.3-3.2-4.7-6.3-10.6-10.8
					c-5.3-4-7.8-6.3-9.1-8.8c-3.6-6.3-0.9-10.5-4.9-13.8c-3.4-2.8-8.4-2.3-8.9-2.2c-4.2,0.5-4.6,2.8-7.8,2.7
					c-3.8-0.1-4.2-3.3-8.9-4.2c-3.4-0.7-4.2,0.7-7.6,0.2c-3.5-0.6-5.7-2.5-8.3-4.7c0,0-5.7-4.9-15.7-11.2
					c-7.6-4.7-14.5-6.6-19.5-7.9c-6.8-1.8-12.7-2.5-17.3-2.7c11.3-1.4,20.1-0.3,26.1,1C47,50.5,53,56.5,70.3,61.3
					c9,2.5,16.5,3.3,20.9,3.6c-0.8-2.2-4.3-12.9,1.4-21.4c2.8-4,6.8-6.3,11.8-8c17-5.7,26.3,2.2,48.7,2.8
					c9.7,0.2,32.4,0.8,44.7-13.8C202,19.5,203.9,14.1,204.8,10.2z"/>
			
</svg>
