module postgres_api

go 1.13

require (
	github.com/dgrijalva/jwt-go v3.2.0+incompatible
	github.com/jinzhu/gorm v1.9.12
	github.com/joho/godotenv v1.3.0 // indirect
	github.com/kr/fs v0.1.0 // indirect
	github.com/labstack/echo v3.3.10+incompatible
	github.com/labstack/echo/v4 v4.1.14
	github.com/spf13/viper v1.6.2
	github.com/tools/godep v0.0.0-20180126220526-ce0bfadeb516 // indirect
	golang.org/x/crypto v0.0.0-20191227163750-53104e6ec876
	google.golang.org/genproto v0.0.0-20200227132054-3f1135a288c9
)
