,0,1,2,y
0,3.4197134178279875,-8.828140717450134,2.17147550666971,0
1,-1.5391633507444196,0.031127635829068086,1.554318496978636,2
2,-0.48330988525829977,-2.432851855448764,4.067052293454681,2
3,3.860043794902678,-9.776563215709459,3.16021114797345,0
4,-3.1717256873322146,7.705895723232792,-0.7976408355609088,1
5,-3.255194408119081,7.428255178182198,1.2425156417753913,1
6,-3.922803962643415,9.001982484730163,0.30976549995909064,1
7,-1.4567063430889073,0.7361583085315195,-2.12114976281366,2
8,3.5928166413910714,-9.35321345815166,3.0625972784146858,0
9,-3.649928632617964,8.388347253762523,-0.6814837143957079,1
10,-3.2714606035709197,7.233366185891409,1.4543814270162392,1
11,-2.941467520581889,6.571493247823233,1.4855289218147025,1
12,4.803887392946214,-10.912456318995893,0.8007577132354682,0
13,2.4913294751853345,-7.146674588844422,3.805461321403706,0
14,-3.8158707492494064,8.307105642714065,0.9507403957857017,1
15,3.1309700969642176,-8.808373490794429,3.836323379019033,0
16,-2.7365151074325604,6.314855069418762,0.6358701314867994,1
17,2.833571853949729,-7.2411754468739655,2.273618605836965,0
18,-2.976368687214981,6.895590198834965,1.3419007292247862,1
19,-0.42839958180333326,-2.039501669463498,2.7221496414509034,2
20,-0.7211633988757868,-0.9108936305067318,-0.8271564492098702,2
21,2.4839332458361065,-7.480647051694046,4.8803915371731135,0
22,1.803633187159083,-5.67860435558628,2.1919345752267883,0
23,-3.1793143182996753,7.153453734873105,-0.11104013198550847,1
24,-0.858633664400938,-0.7825625813220011,0.567742229886993,2
25,3.132298699797735,-8.392156812911956,3.6648700668875573,0
26,-0.7129385167772175,-1.4421084364550905,0.30195573829008426,2
27,1.9427183679240638,-6.2038282437822225,3.928973947636379,0
28,-3.1469903156345014,6.7659235692744355,2.5868555405583287,1
29,-0.2707718801563816,-2.724115171469883,2.8431155646686705,2
30,-2.4820953777214583,6.159464178083683,1.6986053053361858,1
31,-2.5837578898601623,6.225511886840044,-0.1928826962230583,1
32,-3.135098131424317,7.126786760070622,-0.09664338325338809,1
33,2.5865633748328922,-7.184976964182064,2.261134319238739,0
34,2.5312541946177336,-7.104551127154355,2.742525582661086,0
35,2.4833542696750346,-6.78337976577351,1.9052464899919732,0
36,-0.303754885716198,-1.9336612773026212,1.17898946300574,2
37,-3.593040021643204,8.208205988548627,-0.12536891363073344,1
38,-1.004103725230112,-1.0208097280463904,3.315759017912906,2
39,-0.15241121151936476,-2.4022493230548183,0.6430886152960178,2
40,2.2242835059189754,-5.594366488844352,-0.6429724471281972,0
41,3.7013296969532226,-9.224158982468966,2.084519947656664,0
42,-0.8653069562277274,-0.8203329215593606,0.5300179284035913,2
43,-0.8046489232840642,-1.1674154317859367,1.0367250269245307,2
44,-1.9457875563677733,4.7720634506480035,1.3548999202092298,1
45,0.2294873362789208,-2.4005465680758236,-0.7058205728611682,2
46,-3.63304507945368,8.280969996045993,-0.38608305591498093,1
47,3.2240110467571084,-8.761302458105515,3.2839512113157454,0
48,-3.4563539433660875,7.33700551171119,2.512130450091358,1
49,-0.601294609737369,-1.737973404335132,2.470488366864412,2
50,-3.9413090460857583,8.301674949621376,1.606476888097387,1
51,3.1963719505397847,-7.783104656224782,0.9676268384022649,0
52,-0.7036180447362484,-1.1657829755369795,1.7317021714265166,2
53,1.1860850001931154,-5.090033037293181,2.6233641335056017,2
54,-2.3540085116588685,5.81242914797688,0.4535517530817968,1
55,3.0128696382058133,-8.627563932100754,4.639266045818319,0
56,4.627579068828656,-11.318920921095144,4.922113997578683,0
57,-3.249931192716848,7.625439162667559,-0.11980365273092776,1
58,3.261690735831843,-8.211179882184355,1.3532320306299916,0
59,-1.4443863884105563,0.011079080835693506,2.3483652399182127,2
60,-3.625251563627353,8.143867426271045,1.0345568282079862,1
61,3.7879430051222465,-9.333481873722294,0.9159067214697318,0
62,-3.036118431084033,6.627942270349383,0.8352931767116358,1
63,2.9835037004937797,-7.856460557417058,2.107215068216875,0
64,2.4414969070719206,-6.632231306337629,1.4425679385546255,0
65,-0.032936426906428694,-2.8114499885442603,1.5471027047341,2
66,-2.2750128835109673,4.687431412787267,3.381477092984116,1
67,-2.1953298076209387,5.030895480183875,1.9086810630640572,1
68,-0.6889622686256105,-1.1223753277703625,0.9334336605536884,2
69,-3.657393700372783,7.730129171797424,1.8970394224207723,1
70,-2.6962475037276667,6.679300315954158,-0.16290737622753954,1
71,-0.6342968074560267,-1.2033628386299537,1.4893133045837796,2
72,3.1088774890598443,-8.518900844574638,2.490850544157757,0
73,-3.5565557417874585,8.207858090802828,0.9005164078727776,1
74,-1.1323923053263336,-0.014752159148107052,-1.6216923612479606,2
75,2.9363320672455386,-8.244365470353713,3.4778696170074976,0
76,-0.38050171002332284,-1.837709112867606,2.068602195020519,2
77,-0.02923033661543028,-2.5896786796399462,0.7364439301339845,2
78,3.1453765734778605,-8.305028912716018,3.609966986842339,0
79,-3.1130592025450476,6.939833037545018,0.05477763627080469,1
80,-0.26291257796561246,-1.9838560297532788,1.1830380362124395,2
81,3.271942844587579,-8.32614852881066,2.119336186837334,0
82,-0.931581029157287,-1.0734052801558631,2.5245594375283353,2
83,2.8086174237242068,-7.742061293422167,2.9213583243757504,0
84,-0.8965523960611201,-1.2895169761050373,2.9255930466899396,2
85,-0.4101571631759309,-1.6922248803196365,1.3626458602467566,2
86,-3.3019425416236152,7.164060359590075,1.8135718251990047,1
87,2.6675609887656724,-7.28810894700348,3.802779912736144,0
88,-3.167632519711953,6.979105287758596,0.1158828540792197,1
89,3.2041080601430445,-8.648500802483985,4.468157816004277,0
90,-4.200478853272772,8.963256158526873,1.062777301590068,1
91,2.836604679133007,-7.730962271075179,3.970450472414118,0
92,-1.5246391139378557,0.6470485002738999,-0.20810892546786336,2
93,0.0671933396626836,-3.2483840587377197,3.493684123197623,2
94,-0.5972961793926373,-1.3342271904636491,2.467516126047538,2
95,-2.8168044070681484,6.214397307685951,2.3494635463064735,1
96,2.7658835806420825,-8.075252840747643,3.479667385083033,0
97,2.2828919406741672,-5.756552578903254,0.11588185291483713,0
98,-2.013584652057173,1.4043030252291047,0.024470026653380977,2
99,0.11771113454345128,-3.5294049589775884,3.007892148551226,2
