%YAML 1.1
%TAG !u! tag:unity3d.com,2011:
--- !u!319 &31900000
AvatarMask:
  m_ObjectHideFlags: 0
  m_CorrespondingSourceObject: {fileID: 0}
  m_PrefabInstance: {fileID: 0}
  m_PrefabAsset: {fileID: 0}
  m_Name: OneHandPistol
  m_Mask: 00000000000000000000000000000000000000000100000001000000010000000100000000000000000000000000000000000000
  m_Elements:
  - m_Path: 
    m_Weight: 1
  - m_Path: rp_nathan_animated_003_walking_CTRL
    m_Weight: 1
  - m_Path: rp_nathan_animated_003_walking_CTRL/rp_nathan_animated_003_walking_root
    m_Weight: 1
  - m_Path: rp_nathan_animated_003_walking_CTRL/rp_nathan_animated_003_walking_root/rp_nathan_animated_003_walking_hip
    m_Weight: 1
  - m_Path: rp_nathan_animated_003_walking_CTRL/rp_nathan_animated_003_walking_root/rp_nathan_animated_003_walking_hip/rp_nathan_animated_003_walking_spine_01
    m_Weight: 0
  - m_Path: rp_nathan_animated_003_walking_CTRL/rp_nathan_animated_003_walking_root/rp_nathan_animated_003_walking_hip/rp_nathan_animated_003_walking_spine_01/rp_nathan_animated_003_walking_spine_02
    m_Weight: 0
  - m_Path: rp_nathan_animated_003_walking_CTRL/rp_nathan_animated_003_walking_root/rp_nathan_animated_003_walking_hip/rp_nathan_animated_003_walking_spine_01/rp_nathan_animated_003_walking_spine_02/rp_nathan_animated_003_walking_spine_03
    m_Weight: 0
  - m_Path: rp_nathan_animated_003_walking_CTRL/rp_nathan_animated_003_walking_root/rp_nathan_animated_003_walking_hip/rp_nathan_animated_003_walking_spine_01/rp_nathan_animated_003_walking_spine_02/rp_nathan_animated_003_walking_spine_03/rp_nathan_animated_003_walking_neck
    m_Weight: 1
  - m_Path: rp_nathan_animated_003_walking_CTRL/rp_nathan_animated_003_walking_root/rp_nathan_animated_003_walking_hip/rp_nathan_animated_003_walking_spine_01/rp_nathan_animated_003_walking_spine_02/rp_nathan_animated_003_walking_spine_03/rp_nathan_animated_003_walking_neck/rp_nathan_animated_003_walking_head
    m_Weight: 1
  - m_Path: rp_nathan_animated_003_walking_CTRL/rp_nathan_animated_003_walking_root/rp_nathan_animated_003_walking_hip/rp_nathan_animated_003_walking_spine_01/rp_nathan_animated_003_walking_spine_02/rp_nathan_animated_003_walking_spine_03/rp_nathan_animated_003_walking_neck/rp_nathan_animated_003_walking_head/rp_nathan_animated_003_walking_eye_l
    m_Weight: 0
  - m_Path: rp_nathan_animated_003_walking_CTRL/rp_nathan_animated_003_walking_root/rp_nathan_animated_003_walking_hip/rp_nathan_animated_003_walking_spine_01/rp_nathan_animated_003_walking_spine_02/rp_nathan_animated_003_walking_spine_03/rp_nathan_animated_003_walking_neck/rp_nathan_animated_003_walking_head/rp_nathan_animated_003_walking_eye_l/rp_nathan_animated_003_walking_eye_end_l
    m_Weight: 0
  - m_Path: rp_nathan_animated_003_walking_CTRL/rp_nathan_animated_003_walking_root/rp_nathan_animated_003_walking_hip/rp_nathan_animated_003_walking_spine_01/rp_nathan_animated_003_walking_spine_02/rp_nathan_animated_003_walking_spine_03/rp_nathan_animated_003_walking_neck/rp_nathan_animated_003_walking_head/rp_nathan_animated_003_walking_eye_r
    m_Weight: 0
  - m_Path: rp_nathan_animated_003_walking_CTRL/rp_nathan_animated_003_walking_root/rp_nathan_animated_003_walking_hip/rp_nathan_animated_003_walking_spine_01/rp_nathan_animated_003_walking_spine_02/rp_nathan_animated_003_walking_spine_03/rp_nathan_animated_003_walking_neck/rp_nathan_animated_003_walking_head/rp_nathan_animated_003_walking_eye_r/rp_nathan_animated_003_walking_eye_end_r
    m_Weight: 0
  - m_Path: rp_nathan_animated_003_walking_CTRL/rp_nathan_animated_003_walking_root/rp_nathan_animated_003_walking_hip/rp_nathan_animated_003_walking_spine_01/rp_nathan_animated_003_walking_spine_02/rp_nathan_animated_003_walking_spine_03/rp_nathan_animated_003_walking_neck/rp_nathan_animated_003_walking_head/rp_nathan_animated_003_walking_eyebrow_l
    m_Weight: 0
  - m_Path: rp_nathan_animated_003_walking_CTRL/rp_nathan_animated_003_walking_root/rp_nathan_animated_003_walking_hip/rp_nathan_animated_003_walking_spine_01/rp_nathan_animated_003_walking_spine_02/rp_nathan_animated_003_walking_spine_03/rp_nathan_animated_003_walking_neck/rp_nathan_animated_003_walking_head/rp_nathan_animated_003_walking_eyebrow_r
    m_Weight: 0
  - m_Path: rp_nathan_animated_003_walking_CTRL/rp_nathan_animated_003_walking_root/rp_nathan_animated_003_walking_hip/rp_nathan_animated_003_walking_spine_01/rp_nathan_animated_003_walking_spine_02/rp_nathan_animated_003_walking_spine_03/rp_nathan_animated_003_walking_neck/rp_nathan_animated_003_walking_head/rp_nathan_animated_003_walking_eyelid_l
    m_Weight: 0
  - m_Path: rp_nathan_animated_003_walking_CTRL/rp_nathan_animated_003_walking_root/rp_nathan_animated_003_walking_hip/rp_nathan_animated_003_walking_spine_01/rp_nathan_animated_003_walking_spine_02/rp_nathan_animated_003_walking_spine_03/rp_nathan_animated_003_walking_neck/rp_nathan_animated_003_walking_head/rp_nathan_animated_003_walking_eyelid_l/rp_nathan_animated_003_walking_eyelid_end_l
    m_Weight: 0
  - m_Path: rp_nathan_animated_003_walking_CTRL/rp_nathan_animated_003_walking_root/rp_nathan_animated_003_walking_hip/rp_nathan_animated_003_walking_spine_01/rp_nathan_animated_003_walking_spine_02/rp_nathan_animated_003_walking_spine_03/rp_nathan_animated_003_walking_neck/rp_nathan_animated_003_walking_head/rp_nathan_animated_003_walking_eyelid_r
    m_Weight: 0
  - m_Path: rp_nathan_animated_003_walking_CTRL/rp_nathan_animated_003_walking_root/rp_nathan_animated_003_walking_hip/rp_nathan_animated_003_walking_spine_01/rp_nathan_animated_003_walking_spine_02/rp_nathan_animated_003_walking_spine_03/rp_nathan_animated_003_walking_neck/rp_nathan_animated_003_walking_head/rp_nathan_animated_003_walking_eyelid_r/rp_nathan_animated_003_walking_eyelid_end_r
    m_Weight: 0
  - m_Path: rp_nathan_animated_003_walking_CTRL/rp_nathan_animated_003_walking_root/rp_nathan_animated_003_walking_hip/rp_nathan_animated_003_walking_spine_01/rp_nathan_animated_003_walking_spine_02/rp_nathan_animated_003_walking_spine_03/rp_nathan_animated_003_walking_neck/rp_nathan_animated_003_walking_head/rp_nathan_animated_003_walking_head_end
    m_Weight: 0
  - m_Path: rp_nathan_animated_003_walking_CTRL/rp_nathan_animated_003_walking_root/rp_nathan_animated_003_walking_hip/rp_nathan_animated_003_walking_spine_01/rp_nathan_animated_003_walking_spine_02/rp_nathan_animated_003_walking_spine_03/rp_nathan_animated_003_walking_neck/rp_nathan_animated_003_walking_head/rp_nathan_animated_003_walking_jaw
    m_Weight: 0
  - m_Path: rp_nathan_animated_003_walking_CTRL/rp_nathan_animated_003_walking_root/rp_nathan_animated_003_walking_hip/rp_nathan_animated_003_walking_spine_01/rp_nathan_animated_003_walking_spine_02/rp_nathan_animated_003_walking_spine_03/rp_nathan_animated_003_walking_neck/rp_nathan_animated_003_walking_head/rp_nathan_animated_003_walking_jaw/rp_nathan_animated_003_walking_jaw_end
    m_Weight: 0
  - m_Path: rp_nathan_animated_003_walking_CTRL/rp_nathan_animated_003_walking_root/rp_nathan_animated_003_walking_hip/rp_nathan_animated_003_walking_spine_01/rp_nathan_animated_003_walking_spine_02/rp_nathan_animated_003_walking_spine_03/rp_nathan_animated_003_walking_neck/rp_nathan_animated_003_walking_head/rp_nathan_animated_003_walking_mouth_l
    m_Weight: 0
  - m_Path: rp_nathan_animated_003_walking_CTRL/rp_nathan_animated_003_walking_root/rp_nathan_animated_003_walking_hip/rp_nathan_animated_003_walking_spine_01/rp_nathan_animated_003_walking_spine_02/rp_nathan_animated_003_walking_spine_03/rp_nathan_animated_003_walking_neck/rp_nathan_animated_003_walking_head/rp_nathan_animated_003_walking_mouth_r
    m_Weight: 0
  - m_Path: rp_nathan_animated_003_walking_CTRL/rp_nathan_animated_003_walking_root/rp_nathan_animated_003_walking_hip/rp_nathan_animated_003_walking_spine_01/rp_nathan_animated_003_walking_spine_02/rp_nathan_animated_003_walking_spine_03/rp_nathan_animated_003_walking_shoulder_l
    m_Weight: 0
  - m_Path: rp_nathan_animated_003_walking_CTRL/rp_nathan_animated_003_walking_root/rp_nathan_animated_003_walking_hip/rp_nathan_animated_003_walking_spine_01/rp_nathan_animated_003_walking_spine_02/rp_nathan_animated_003_walking_spine_03/rp_nathan_animated_003_walking_shoulder_l/rp_nathan_animated_003_walking_upperarm_l
    m_Weight: 0
  - m_Path: rp_nathan_animated_003_walking_CTRL/rp_nathan_animated_003_walking_root/rp_nathan_animated_003_walking_hip/rp_nathan_animated_003_walking_spine_01/rp_nathan_animated_003_walking_spine_02/rp_nathan_animated_003_walking_spine_03/rp_nathan_animated_003_walking_shoulder_l/rp_nathan_animated_003_walking_upperarm_l/rp_nathan_animated_003_walking_lowerarm_l
    m_Weight: 0
  - m_Path: rp_nathan_animated_003_walking_CTRL/rp_nathan_animated_003_walking_root/rp_nathan_animated_003_walking_hip/rp_nathan_animated_003_walking_spine_01/rp_nathan_animated_003_walking_spine_02/rp_nathan_animated_003_walking_spine_03/rp_nathan_animated_003_walking_shoulder_l/rp_nathan_animated_003_walking_upperarm_l/rp_nathan_animated_003_walking_lowerarm_l/rp_nathan_animated_003_walking_hand_l
    m_Weight: 0
  - m_Path: rp_nathan_animated_003_walking_CTRL/rp_nathan_animated_003_walking_root/rp_nathan_animated_003_walking_hip/rp_nathan_animated_003_walking_spine_01/rp_nathan_animated_003_walking_spine_02/rp_nathan_animated_003_walking_spine_03/rp_nathan_animated_003_walking_shoulder_l/rp_nathan_animated_003_walking_upperarm_l/rp_nathan_animated_003_walking_lowerarm_l/rp_nathan_animated_003_walking_hand_l/rp_nathan_animated_003_walking_index_01_l
    m_Weight: 0
  - m_Path: rp_nathan_animated_003_walking_CTRL/rp_nathan_animated_003_walking_root/rp_nathan_animated_003_walking_hip/rp_nathan_animated_003_walking_spine_01/rp_nathan_animated_003_walking_spine_02/rp_nathan_animated_003_walking_spine_03/rp_nathan_animated_003_walking_shoulder_l/rp_nathan_animated_003_walking_upperarm_l/rp_nathan_animated_003_walking_lowerarm_l/rp_nathan_animated_003_walking_hand_l/rp_nathan_animated_003_walking_index_01_l/rp_nathan_animated_003_walking_index_02_l
    m_Weight: 0
  - m_Path: rp_nathan_animated_003_walking_CTRL/rp_nathan_animated_003_walking_root/rp_nathan_animated_003_walking_hip/rp_nathan_animated_003_walking_spine_01/rp_nathan_animated_003_walking_spine_02/rp_nathan_animated_003_walking_spine_03/rp_nathan_animated_003_walking_shoulder_l/rp_nathan_animated_003_walking_upperarm_l/rp_nathan_animated_003_walking_lowerarm_l/rp_nathan_animated_003_walking_hand_l/rp_nathan_animated_003_walking_index_01_l/rp_nathan_animated_003_walking_index_02_l/rp_nathan_animated_003_walking_index_03_l
    m_Weight: 0
  - m_Path: rp_nathan_animated_003_walking_CTRL/rp_nathan_animated_003_walking_root/rp_nathan_animated_003_walking_hip/rp_nathan_animated_003_walking_spine_01/rp_nathan_animated_003_walking_spine_02/rp_nathan_animated_003_walking_spine_03/rp_nathan_animated_003_walking_shoulder_l/rp_nathan_animated_003_walking_upperarm_l/rp_nathan_animated_003_walking_lowerarm_l/rp_nathan_animated_003_walking_hand_l/rp_nathan_animated_003_walking_index_01_l/rp_nathan_animated_003_walking_index_02_l/rp_nathan_animated_003_walking_index_03_l/rp_nathan_animated_003_walking_index_end_l
    m_Weight: 0
  - m_Path: rp_nathan_animated_003_walking_CTRL/rp_nathan_animated_003_walking_root/rp_nathan_animated_003_walking_hip/rp_nathan_animated_003_walking_spine_01/rp_nathan_animated_003_walking_spine_02/rp_nathan_animated_003_walking_spine_03/rp_nathan_animated_003_walking_shoulder_l/rp_nathan_animated_003_walking_upperarm_l/rp_nathan_animated_003_walking_lowerarm_l/rp_nathan_animated_003_walking_hand_l/rp_nathan_animated_003_walking_middle_01_l
    m_Weight: 0
  - m_Path: rp_nathan_animated_003_walking_CTRL/rp_nathan_animated_003_walking_root/rp_nathan_animated_003_walking_hip/rp_nathan_animated_003_walking_spine_01/rp_nathan_animated_003_walking_spine_02/rp_nathan_animated_003_walking_spine_03/rp_nathan_animated_003_walking_shoulder_l/rp_nathan_animated_003_walking_upperarm_l/rp_nathan_animated_003_walking_lowerarm_l/rp_nathan_animated_003_walking_hand_l/rp_nathan_animated_003_walking_middle_01_l/rp_nathan_animated_003_walking_middle_02_l
    m_Weight: 0
  - m_Path: rp_nathan_animated_003_walking_CTRL/rp_nathan_animated_003_walking_root/rp_nathan_animated_003_walking_hip/rp_nathan_animated_003_walking_spine_01/rp_nathan_animated_003_walking_spine_02/rp_nathan_animated_003_walking_spine_03/rp_nathan_animated_003_walking_shoulder_l/rp_nathan_animated_003_walking_upperarm_l/rp_nathan_animated_003_walking_lowerarm_l/rp_nathan_animated_003_walking_hand_l/rp_nathan_animated_003_walking_middle_01_l/rp_nathan_animated_003_walking_middle_02_l/rp_nathan_animated_003_walking_middle_03_l
    m_Weight: 0
  - m_Path: rp_nathan_animated_003_walking_CTRL/rp_nathan_animated_003_walking_root/rp_nathan_animated_003_walking_hip/rp_nathan_animated_003_walking_spine_01/rp_nathan_animated_003_walking_spine_02/rp_nathan_animated_003_walking_spine_03/rp_nathan_animated_003_walking_shoulder_l/rp_nathan_animated_003_walking_upperarm_l/rp_nathan_animated_003_walking_lowerarm_l/rp_nathan_animated_003_walking_hand_l/rp_nathan_animated_003_walking_middle_01_l/rp_nathan_animated_003_walking_middle_02_l/rp_nathan_animated_003_walking_middle_03_l/rp_nathan_animated_003_walking_middle_end_l
    m_Weight: 0
  - m_Path: rp_nathan_animated_003_walking_CTRL/rp_nathan_animated_003_walking_root/rp_nathan_animated_003_walking_hip/rp_nathan_animated_003_walking_spine_01/rp_nathan_animated_003_walking_spine_02/rp_nathan_animated_003_walking_spine_03/rp_nathan_animated_003_walking_shoulder_l/rp_nathan_animated_003_walking_upperarm_l/rp_nathan_animated_003_walking_lowerarm_l/rp_nathan_animated_003_walking_hand_l/rp_nathan_animated_003_walking_pinky_01_l
    m_Weight: 0
  - m_Path: rp_nathan_animated_003_walking_CTRL/rp_nathan_animated_003_walking_root/rp_nathan_animated_003_walking_hip/rp_nathan_animated_003_walking_spine_01/rp_nathan_animated_003_walking_spine_02/rp_nathan_animated_003_walking_spine_03/rp_nathan_animated_003_walking_shoulder_l/rp_nathan_animated_003_walking_upperarm_l/rp_nathan_animated_003_walking_lowerarm_l/rp_nathan_animated_003_walking_hand_l/rp_nathan_animated_003_walking_pinky_01_l/rp_nathan_animated_003_walking_pinky_02_l
    m_Weight: 0
  - m_Path: rp_nathan_animated_003_walking_CTRL/rp_nathan_animated_003_walking_root/rp_nathan_animated_003_walking_hip/rp_nathan_animated_003_walking_spine_01/rp_nathan_animated_003_walking_spine_02/rp_nathan_animated_003_walking_spine_03/rp_nathan_animated_003_walking_shoulder_l/rp_nathan_animated_003_walking_upperarm_l/rp_nathan_animated_003_walking_lowerarm_l/rp_nathan_animated_003_walking_hand_l/rp_nathan_animated_003_walking_pinky_01_l/rp_nathan_animated_003_walking_pinky_02_l/rp_nathan_animated_003_walking_pinky_03_l
    m_Weight: 0
  - m_Path: rp_nathan_animated_003_walking_CTRL/rp_nathan_animated_003_walking_root/rp_nathan_animated_003_walking_hip/rp_nathan_animated_003_walking_spine_01/rp_nathan_animated_003_walking_spine_02/rp_nathan_animated_003_walking_spine_03/rp_nathan_animated_003_walking_shoulder_l/rp_nathan_animated_003_walking_upperarm_l/rp_nathan_animated_003_walking_lowerarm_l/rp_nathan_animated_003_walking_hand_l/rp_nathan_animated_003_walking_pinky_01_l/rp_nathan_animated_003_walking_pinky_02_l/rp_nathan_animated_003_walking_pinky_03_l/rp_nathan_animated_003_walking_pinky_end_l
    m_Weight: 0
  - m_Path: rp_nathan_animated_003_walking_CTRL/rp_nathan_animated_003_walking_root/rp_nathan_animated_003_walking_hip/rp_nathan_animated_003_walking_spine_01/rp_nathan_animated_003_walking_spine_02/rp_nathan_animated_003_walking_spine_03/rp_nathan_animated_003_walking_shoulder_l/rp_nathan_animated_003_walking_upperarm_l/rp_nathan_animated_003_walking_lowerarm_l/rp_nathan_animated_003_walking_hand_l/rp_nathan_animated_003_walking_ring_01_l
    m_Weight: 0
  - m_Path: rp_nathan_animated_003_walking_CTRL/rp_nathan_animated_003_walking_root/rp_nathan_animated_003_walking_hip/rp_nathan_animated_003_walking_spine_01/rp_nathan_animated_003_walking_spine_02/rp_nathan_animated_003_walking_spine_03/rp_nathan_animated_003_walking_shoulder_l/rp_nathan_animated_003_walking_upperarm_l/rp_nathan_animated_003_walking_lowerarm_l/rp_nathan_animated_003_walking_hand_l/rp_nathan_animated_003_walking_ring_01_l/rp_nathan_animated_003_walking_ring_02_l
    m_Weight: 0
  - m_Path: rp_nathan_animated_003_walking_CTRL/rp_nathan_animated_003_walking_root/rp_nathan_animated_003_walking_hip/rp_nathan_animated_003_walking_spine_01/rp_nathan_animated_003_walking_spine_02/rp_nathan_animated_003_walking_spine_03/rp_nathan_animated_003_walking_shoulder_l/rp_nathan_animated_003_walking_upperarm_l/rp_nathan_animated_003_walking_lowerarm_l/rp_nathan_animated_003_walking_hand_l/rp_nathan_animated_003_walking_ring_01_l/rp_nathan_animated_003_walking_ring_02_l/rp_nathan_animated_003_walking_ring_03_l
    m_Weight: 0
  - m_Path: rp_nathan_animated_003_walking_CTRL/rp_nathan_animated_003_walking_root/rp_nathan_animated_003_walking_hip/rp_nathan_animated_003_walking_spine_01/rp_nathan_animated_003_walking_spine_02/rp_nathan_animated_003_walking_spine_03/rp_nathan_animated_003_walking_shoulder_l/rp_nathan_animated_003_walking_upperarm_l/rp_nathan_animated_003_walking_lowerarm_l/rp_nathan_animated_003_walking_hand_l/rp_nathan_animated_003_walking_ring_01_l/rp_nathan_animated_003_walking_ring_02_l/rp_nathan_animated_003_walking_ring_03_l/rp_nathan_animated_003_walking_ring_end_l
    m_Weight: 0
  - m_Path: rp_nathan_animated_003_walking_CTRL/rp_nathan_animated_003_walking_root/rp_nathan_animated_003_walking_hip/rp_nathan_animated_003_walking_spine_01/rp_nathan_animated_003_walking_spine_02/rp_nathan_animated_003_walking_spine_03/rp_nathan_animated_003_walking_shoulder_l/rp_nathan_animated_003_walking_upperarm_l/rp_nathan_animated_003_walking_lowerarm_l/rp_nathan_animated_003_walking_hand_l/rp_nathan_animated_003_walking_thumb_01_l
    m_Weight: 0
  - m_Path: rp_nathan_animated_003_walking_CTRL/rp_nathan_animated_003_walking_root/rp_nathan_animated_003_walking_hip/rp_nathan_animated_003_walking_spine_01/rp_nathan_animated_003_walking_spine_02/rp_nathan_animated_003_walking_spine_03/rp_nathan_animated_003_walking_shoulder_l/rp_nathan_animated_003_walking_upperarm_l/rp_nathan_animated_003_walking_lowerarm_l/rp_nathan_animated_003_walking_hand_l/rp_nathan_animated_003_walking_thumb_01_l/rp_nathan_animated_003_walking_thumb_02_l
    m_Weight: 0
  - m_Path: rp_nathan_animated_003_walking_CTRL/rp_nathan_animated_003_walking_root/rp_nathan_animated_003_walking_hip/rp_nathan_animated_003_walking_spine_01/rp_nathan_animated_003_walking_spine_02/rp_nathan_animated_003_walking_spine_03/rp_nathan_animated_003_walking_shoulder_l/rp_nathan_animated_003_walking_upperarm_l/rp_nathan_animated_003_walking_lowerarm_l/rp_nathan_animated_003_walking_hand_l/rp_nathan_animated_003_walking_thumb_01_l/rp_nathan_animated_003_walking_thumb_02_l/rp_nathan_animated_003_walking_thumb_03_l
    m_Weight: 0
  - m_Path: rp_nathan_animated_003_walking_CTRL/rp_nathan_animated_003_walking_root/rp_nathan_animated_003_walking_hip/rp_nathan_animated_003_walking_spine_01/rp_nathan_animated_003_walking_spine_02/rp_nathan_animated_003_walking_spine_03/rp_nathan_animated_003_walking_shoulder_l/rp_nathan_animated_003_walking_upperarm_l/rp_nathan_animated_003_walking_lowerarm_l/rp_nathan_animated_003_walking_hand_l/rp_nathan_animated_003_walking_thumb_01_l/rp_nathan_animated_003_walking_thumb_02_l/rp_nathan_animated_003_walking_thumb_03_l/rp_nathan_animated_003_walking_thumb_end_l
    m_Weight: 0
  - m_Path: rp_nathan_animated_003_walking_CTRL/rp_nathan_animated_003_walking_root/rp_nathan_animated_003_walking_hip/rp_nathan_animated_003_walking_spine_01/rp_nathan_animated_003_walking_spine_02/rp_nathan_animated_003_walking_spine_03/rp_nathan_animated_003_walking_shoulder_l/rp_nathan_animated_003_walking_upperarm_l/rp_nathan_animated_003_walking_lowerarm_l/rp_nathan_animated_003_walking_lowerarm_twist_l
    m_Weight: 0
  - m_Path: rp_nathan_animated_003_walking_CTRL/rp_nathan_animated_003_walking_root/rp_nathan_animated_003_walking_hip/rp_nathan_animated_003_walking_spine_01/rp_nathan_animated_003_walking_spine_02/rp_nathan_animated_003_walking_spine_03/rp_nathan_animated_003_walking_shoulder_l/rp_nathan_animated_003_walking_upperarm_l/rp_nathan_animated_003_walking_upperarm_twist_l
    m_Weight: 0
  - m_Path: rp_nathan_animated_003_walking_CTRL/rp_nathan_animated_003_walking_root/rp_nathan_animated_003_walking_hip/rp_nathan_animated_003_walking_spine_01/rp_nathan_animated_003_walking_spine_02/rp_nathan_animated_003_walking_spine_03/rp_nathan_animated_003_walking_shoulder_r
    m_Weight: 1
  - m_Path: rp_nathan_animated_003_walking_CTRL/rp_nathan_animated_003_walking_root/rp_nathan_animated_003_walking_hip/rp_nathan_animated_003_walking_spine_01/rp_nathan_animated_003_walking_spine_02/rp_nathan_animated_003_walking_spine_03/rp_nathan_animated_003_walking_shoulder_r/rp_nathan_animated_003_walking_upperarm_r
    m_Weight: 1
  - m_Path: rp_nathan_animated_003_walking_CTRL/rp_nathan_animated_003_walking_root/rp_nathan_animated_003_walking_hip/rp_nathan_animated_003_walking_spine_01/rp_nathan_animated_003_walking_spine_02/rp_nathan_animated_003_walking_spine_03/rp_nathan_animated_003_walking_shoulder_r/rp_nathan_animated_003_walking_upperarm_r/rp_nathan_animated_003_walking_lowerarm_r
    m_Weight: 1
  - m_Path: rp_nathan_animated_003_walking_CTRL/rp_nathan_animated_003_walking_root/rp_nathan_animated_003_walking_hip/rp_nathan_animated_003_walking_spine_01/rp_nathan_animated_003_walking_spine_02/rp_nathan_animated_003_walking_spine_03/rp_nathan_animated_003_walking_shoulder_r/rp_nathan_animated_003_walking_upperarm_r/rp_nathan_animated_003_walking_lowerarm_r/rp_nathan_animated_003_walking_hand_r
    m_Weight: 1
  - m_Path: rp_nathan_animated_003_walking_CTRL/rp_nathan_animated_003_walking_root/rp_nathan_animated_003_walking_hip/rp_nathan_animated_003_walking_spine_01/rp_nathan_animated_003_walking_spine_02/rp_nathan_animated_003_walking_spine_03/rp_nathan_animated_003_walking_shoulder_r/rp_nathan_animated_003_walking_upperarm_r/rp_nathan_animated_003_walking_lowerarm_r/rp_nathan_animated_003_walking_hand_r/rp_nathan_animated_003_walking_index_01_r
    m_Weight: 1
  - m_Path: rp_nathan_animated_003_walking_CTRL/rp_nathan_animated_003_walking_root/rp_nathan_animated_003_walking_hip/rp_nathan_animated_003_walking_spine_01/rp_nathan_animated_003_walking_spine_02/rp_nathan_animated_003_walking_spine_03/rp_nathan_animated_003_walking_shoulder_r/rp_nathan_animated_003_walking_upperarm_r/rp_nathan_animated_003_walking_lowerarm_r/rp_nathan_animated_003_walking_hand_r/rp_nathan_animated_003_walking_index_01_r/rp_nathan_animated_003_walking_index_02_r
    m_Weight: 1
  - m_Path: rp_nathan_animated_003_walking_CTRL/rp_nathan_animated_003_walking_root/rp_nathan_animated_003_walking_hip/rp_nathan_animated_003_walking_spine_01/rp_nathan_animated_003_walking_spine_02/rp_nathan_animated_003_walking_spine_03/rp_nathan_animated_003_walking_shoulder_r/rp_nathan_animated_003_walking_upperarm_r/rp_nathan_animated_003_walking_lowerarm_r/rp_nathan_animated_003_walking_hand_r/rp_nathan_animated_003_walking_index_01_r/rp_nathan_animated_003_walking_index_02_r/rp_nathan_animated_003_walking_index_03_r
    m_Weight: 1
  - m_Path: rp_nathan_animated_003_walking_CTRL/rp_nathan_animated_003_walking_root/rp_nathan_animated_003_walking_hip/rp_nathan_animated_003_walking_spine_01/rp_nathan_animated_003_walking_spine_02/rp_nathan_animated_003_walking_spine_03/rp_nathan_animated_003_walking_shoulder_r/rp_nathan_animated_003_walking_upperarm_r/rp_nathan_animated_003_walking_lowerarm_r/rp_nathan_animated_003_walking_hand_r/rp_nathan_animated_003_walking_index_01_r/rp_nathan_animated_003_walking_index_02_r/rp_nathan_animated_003_walking_index_03_r/rp_nathan_animated_003_walking_index_end_r
    m_Weight: 1
  - m_Path: rp_nathan_animated_003_walking_CTRL/rp_nathan_animated_003_walking_root/rp_nathan_animated_003_walking_hip/rp_nathan_animated_003_walking_spine_01/rp_nathan_animated_003_walking_spine_02/rp_nathan_animated_003_walking_spine_03/rp_nathan_animated_003_walking_shoulder_r/rp_nathan_animated_003_walking_upperarm_r/rp_nathan_animated_003_walking_lowerarm_r/rp_nathan_animated_003_walking_hand_r/rp_nathan_animated_003_walking_middle_01_r
    m_Weight: 1
  - m_Path: rp_nathan_animated_003_walking_CTRL/rp_nathan_animated_003_walking_root/rp_nathan_animated_003_walking_hip/rp_nathan_animated_003_walking_spine_01/rp_nathan_animated_003_walking_spine_02/rp_nathan_animated_003_walking_spine_03/rp_nathan_animated_003_walking_shoulder_r/rp_nathan_animated_003_walking_upperarm_r/rp_nathan_animated_003_walking_lowerarm_r/rp_nathan_animated_003_walking_hand_r/rp_nathan_animated_003_walking_middle_01_r/rp_nathan_animated_003_walking_middle_02_r
    m_Weight: 1
  - m_Path: rp_nathan_animated_003_walking_CTRL/rp_nathan_animated_003_walking_root/rp_nathan_animated_003_walking_hip/rp_nathan_animated_003_walking_spine_01/rp_nathan_animated_003_walking_spine_02/rp_nathan_animated_003_walking_spine_03/rp_nathan_animated_003_walking_shoulder_r/rp_nathan_animated_003_walking_upperarm_r/rp_nathan_animated_003_walking_lowerarm_r/rp_nathan_animated_003_walking_hand_r/rp_nathan_animated_003_walking_middle_01_r/rp_nathan_animated_003_walking_middle_02_r/rp_nathan_animated_003_walking_middle_03_r
    m_Weight: 1
  - m_Path: rp_nathan_animated_003_walking_CTRL/rp_nathan_animated_003_walking_root/rp_nathan_animated_003_walking_hip/rp_nathan_animated_003_walking_spine_01/rp_nathan_animated_003_walking_spine_02/rp_nathan_animated_003_walking_spine_03/rp_nathan_animated_003_walking_shoulder_r/rp_nathan_animated_003_walking_upperarm_r/rp_nathan_animated_003_walking_lowerarm_r/rp_nathan_animated_003_walking_hand_r/rp_nathan_animated_003_walking_middle_01_r/rp_nathan_animated_003_walking_middle_02_r/rp_nathan_animated_003_walking_middle_03_r/rp_nathan_animated_003_walking_middle_end_r
    m_Weight: 1
  - m_Path: rp_nathan_animated_003_walking_CTRL/rp_nathan_animated_003_walking_root/rp_nathan_animated_003_walking_hip/rp_nathan_animated_003_walking_spine_01/rp_nathan_animated_003_walking_spine_02/rp_nathan_animated_003_walking_spine_03/rp_nathan_animated_003_walking_shoulder_r/rp_nathan_animated_003_walking_upperarm_r/rp_nathan_animated_003_walking_lowerarm_r/rp_nathan_animated_003_walking_hand_r/rp_nathan_animated_003_walking_pinky_01_r
    m_Weight: 1
  - m_Path: rp_nathan_animated_003_walking_CTRL/rp_nathan_animated_003_walking_root/rp_nathan_animated_003_walking_hip/rp_nathan_animated_003_walking_spine_01/rp_nathan_animated_003_walking_spine_02/rp_nathan_animated_003_walking_spine_03/rp_nathan_animated_003_walking_shoulder_r/rp_nathan_animated_003_walking_upperarm_r/rp_nathan_animated_003_walking_lowerarm_r/rp_nathan_animated_003_walking_hand_r/rp_nathan_animated_003_walking_pinky_01_r/rp_nathan_animated_003_walking_pinky_02_r
    m_Weight: 1
  - m_Path: rp_nathan_animated_003_walking_CTRL/rp_nathan_animated_003_walking_root/rp_nathan_animated_003_walking_hip/rp_nathan_animated_003_walking_spine_01/rp_nathan_animated_003_walking_spine_02/rp_nathan_animated_003_walking_spine_03/rp_nathan_animated_003_walking_shoulder_r/rp_nathan_animated_003_walking_upperarm_r/rp_nathan_animated_003_walking_lowerarm_r/rp_nathan_animated_003_walking_hand_r/rp_nathan_animated_003_walking_pinky_01_r/rp_nathan_animated_003_walking_pinky_02_r/rp_nathan_animated_003_walking_pinky_03_r
    m_Weight: 1
  - m_Path: rp_nathan_animated_003_walking_CTRL/rp_nathan_animated_003_walking_root/rp_nathan_animated_003_walking_hip/rp_nathan_animated_003_walking_spine_01/rp_nathan_animated_003_walking_spine_02/rp_nathan_animated_003_walking_spine_03/rp_nathan_animated_003_walking_shoulder_r/rp_nathan_animated_003_walking_upperarm_r/rp_nathan_animated_003_walking_lowerarm_r/rp_nathan_animated_003_walking_hand_r/rp_nathan_animated_003_walking_pinky_01_r/rp_nathan_animated_003_walking_pinky_02_r/rp_nathan_animated_003_walking_pinky_03_r/rp_nathan_animated_003_walking_pinky_end_r
    m_Weight: 1
  - m_Path: rp_nathan_animated_003_walking_CTRL/rp_nathan_animated_003_walking_root/rp_nathan_animated_003_walking_hip/rp_nathan_animated_003_walking_spine_01/rp_nathan_animated_003_walking_spine_02/rp_nathan_animated_003_walking_spine_03/rp_nathan_animated_003_walking_shoulder_r/rp_nathan_animated_003_walking_upperarm_r/rp_nathan_animated_003_walking_lowerarm_r/rp_nathan_animated_003_walking_hand_r/rp_nathan_animated_003_walking_ring_01_r
    m_Weight: 1
  - m_Path: rp_nathan_animated_003_walking_CTRL/rp_nathan_animated_003_walking_root/rp_nathan_animated_003_walking_hip/rp_nathan_animated_003_walking_spine_01/rp_nathan_animated_003_walking_spine_02/rp_nathan_animated_003_walking_spine_03/rp_nathan_animated_003_walking_shoulder_r/rp_nathan_animated_003_walking_upperarm_r/rp_nathan_animated_003_walking_lowerarm_r/rp_nathan_animated_003_walking_hand_r/rp_nathan_animated_003_walking_ring_01_r/rp_nathan_animated_003_walking_ring_02_r
    m_Weight: 1
  - m_Path: rp_nathan_animated_003_walking_CTRL/rp_nathan_animated_003_walking_root/rp_nathan_animated_003_walking_hip/rp_nathan_animated_003_walking_spine_01/rp_nathan_animated_003_walking_spine_02/rp_nathan_animated_003_walking_spine_03/rp_nathan_animated_003_walking_shoulder_r/rp_nathan_animated_003_walking_upperarm_r/rp_nathan_animated_003_walking_lowerarm_r/rp_nathan_animated_003_walking_hand_r/rp_nathan_animated_003_walking_ring_01_r/rp_nathan_animated_003_walking_ring_02_r/rp_nathan_animated_003_walking_ring_03_r
    m_Weight: 1
  - m_Path: rp_nathan_animated_003_walking_CTRL/rp_nathan_animated_003_walking_root/rp_nathan_animated_003_walking_hip/rp_nathan_animated_003_walking_spine_01/rp_nathan_animated_003_walking_spine_02/rp_nathan_animated_003_walking_spine_03/rp_nathan_animated_003_walking_shoulder_r/rp_nathan_animated_003_walking_upperarm_r/rp_nathan_animated_003_walking_lowerarm_r/rp_nathan_animated_003_walking_hand_r/rp_nathan_animated_003_walking_ring_01_r/rp_nathan_animated_003_walking_ring_02_r/rp_nathan_animated_003_walking_ring_03_r/rp_nathan_animated_003_walking_ring_end_r
    m_Weight: 1
  - m_Path: rp_nathan_animated_003_walking_CTRL/rp_nathan_animated_003_walking_root/rp_nathan_animated_003_walking_hip/rp_nathan_animated_003_walking_spine_01/rp_nathan_animated_003_walking_spine_02/rp_nathan_animated_003_walking_spine_03/rp_nathan_animated_003_walking_shoulder_r/rp_nathan_animated_003_walking_upperarm_r/rp_nathan_animated_003_walking_lowerarm_r/rp_nathan_animated_003_walking_hand_r/rp_nathan_animated_003_walking_thumb_01_r
    m_Weight: 1
  - m_Path: rp_nathan_animated_003_walking_CTRL/rp_nathan_animated_003_walking_root/rp_nathan_animated_003_walking_hip/rp_nathan_animated_003_walking_spine_01/rp_nathan_animated_003_walking_spine_02/rp_nathan_animated_003_walking_spine_03/rp_nathan_animated_003_walking_shoulder_r/rp_nathan_animated_003_walking_upperarm_r/rp_nathan_animated_003_walking_lowerarm_r/rp_nathan_animated_003_walking_hand_r/rp_nathan_animated_003_walking_thumb_01_r/rp_nathan_animated_003_walking_thumb_02_r
    m_Weight: 1
  - m_Path: rp_nathan_animated_003_walking_CTRL/rp_nathan_animated_003_walking_root/rp_nathan_animated_003_walking_hip/rp_nathan_animated_003_walking_spine_01/rp_nathan_animated_003_walking_spine_02/rp_nathan_animated_003_walking_spine_03/rp_nathan_animated_003_walking_shoulder_r/rp_nathan_animated_003_walking_upperarm_r/rp_nathan_animated_003_walking_lowerarm_r/rp_nathan_animated_003_walking_hand_r/rp_nathan_animated_003_walking_thumb_01_r/rp_nathan_animated_003_walking_thumb_02_r/rp_nathan_animated_003_walking_thumb_03_r
    m_Weight: 1
  - m_Path: rp_nathan_animated_003_walking_CTRL/rp_nathan_animated_003_walking_root/rp_nathan_animated_003_walking_hip/rp_nathan_animated_003_walking_spine_01/rp_nathan_animated_003_walking_spine_02/rp_nathan_animated_003_walking_spine_03/rp_nathan_animated_003_walking_shoulder_r/rp_nathan_animated_003_walking_upperarm_r/rp_nathan_animated_003_walking_lowerarm_r/rp_nathan_animated_003_walking_hand_r/rp_nathan_animated_003_walking_thumb_01_r/rp_nathan_animated_003_walking_thumb_02_r/rp_nathan_animated_003_walking_thumb_03_r/rp_nathan_animated_003_walking_thumb_end_r
    m_Weight: 1
  - m_Path: rp_nathan_animated_003_walking_CTRL/rp_nathan_animated_003_walking_root/rp_nathan_animated_003_walking_hip/rp_nathan_animated_003_walking_spine_01/rp_nathan_animated_003_walking_spine_02/rp_nathan_animated_003_walking_spine_03/rp_nathan_animated_003_walking_shoulder_r/rp_nathan_animated_003_walking_upperarm_r/rp_nathan_animated_003_walking_lowerarm_r/rp_nathan_animated_003_walking_lowerarm_twist_r
    m_Weight: 1
  - m_Path: rp_nathan_animated_003_walking_CTRL/rp_nathan_animated_003_walking_root/rp_nathan_animated_003_walking_hip/rp_nathan_animated_003_walking_spine_01/rp_nathan_animated_003_walking_spine_02/rp_nathan_animated_003_walking_spine_03/rp_nathan_animated_003_walking_shoulder_r/rp_nathan_animated_003_walking_upperarm_r/rp_nathan_animated_003_walking_upperarm_twist_r
    m_Weight: 1
  - m_Path: rp_nathan_animated_003_walking_CTRL/rp_nathan_animated_003_walking_root/rp_nathan_animated_003_walking_hip/rp_nathan_animated_003_walking_upperleg_l
    m_Weight: 0
  - m_Path: rp_nathan_animated_003_walking_CTRL/rp_nathan_animated_003_walking_root/rp_nathan_animated_003_walking_hip/rp_nathan_animated_003_walking_upperleg_l/rp_nathan_animated_003_walking_lowerleg_l
    m_Weight: 0
  - m_Path: rp_nathan_animated_003_walking_CTRL/rp_nathan_animated_003_walking_root/rp_nathan_animated_003_walking_hip/rp_nathan_animated_003_walking_upperleg_l/rp_nathan_animated_003_walking_lowerleg_l/rp_nathan_animated_003_walking_foot_l
    m_Weight: 0
  - m_Path: rp_nathan_animated_003_walking_CTRL/rp_nathan_animated_003_walking_root/rp_nathan_animated_003_walking_hip/rp_nathan_animated_003_walking_upperleg_l/rp_nathan_animated_003_walking_lowerleg_l/rp_nathan_animated_003_walking_foot_l/rp_nathan_animated_003_walking_ball_l
    m_Weight: 0
  - m_Path: rp_nathan_animated_003_walking_CTRL/rp_nathan_animated_003_walking_root/rp_nathan_animated_003_walking_hip/rp_nathan_animated_003_walking_upperleg_l/rp_nathan_animated_003_walking_lowerleg_l/rp_nathan_animated_003_walking_foot_l/rp_nathan_animated_003_walking_ball_l/rp_nathan_animated_003_walking_foot_end_l
    m_Weight: 0
  - m_Path: rp_nathan_animated_003_walking_CTRL/rp_nathan_animated_003_walking_root/rp_nathan_animated_003_walking_hip/rp_nathan_animated_003_walking_upperleg_l/rp_nathan_animated_003_walking_lowerleg_l/rp_nathan_animated_003_walking_lowerleg_twist_l
    m_Weight: 0
  - m_Path: rp_nathan_animated_003_walking_CTRL/rp_nathan_animated_003_walking_root/rp_nathan_animated_003_walking_hip/rp_nathan_animated_003_walking_upperleg_l/rp_nathan_animated_003_walking_upperleg_twist_l
    m_Weight: 0
  - m_Path: rp_nathan_animated_003_walking_CTRL/rp_nathan_animated_003_walking_root/rp_nathan_animated_003_walking_hip/rp_nathan_animated_003_walking_upperleg_r
    m_Weight: 0
  - m_Path: rp_nathan_animated_003_walking_CTRL/rp_nathan_animated_003_walking_root/rp_nathan_animated_003_walking_hip/rp_nathan_animated_003_walking_upperleg_r/rp_nathan_animated_003_walking_lowerleg_r
    m_Weight: 0
  - m_Path: rp_nathan_animated_003_walking_CTRL/rp_nathan_animated_003_walking_root/rp_nathan_animated_003_walking_hip/rp_nathan_animated_003_walking_upperleg_r/rp_nathan_animated_003_walking_lowerleg_r/rp_nathan_animated_003_walking_foot_r
    m_Weight: 0
  - m_Path: rp_nathan_animated_003_walking_CTRL/rp_nathan_animated_003_walking_root/rp_nathan_animated_003_walking_hip/rp_nathan_animated_003_walking_upperleg_r/rp_nathan_animated_003_walking_lowerleg_r/rp_nathan_animated_003_walking_foot_r/rp_nathan_animated_003_walking_ball_r
    m_Weight: 0
  - m_Path: rp_nathan_animated_003_walking_CTRL/rp_nathan_animated_003_walking_root/rp_nathan_animated_003_walking_hip/rp_nathan_animated_003_walking_upperleg_r/rp_nathan_animated_003_walking_lowerleg_r/rp_nathan_animated_003_walking_foot_r/rp_nathan_animated_003_walking_ball_r/rp_nathan_animated_003_walking_foot_end_r
    m_Weight: 0
  - m_Path: rp_nathan_animated_003_walking_CTRL/rp_nathan_animated_003_walking_root/rp_nathan_animated_003_walking_hip/rp_nathan_animated_003_walking_upperleg_r/rp_nathan_animated_003_walking_lowerleg_r/rp_nathan_animated_003_walking_lowerleg_twist_r
    m_Weight: 0
  - m_Path: rp_nathan_animated_003_walking_CTRL/rp_nathan_animated_003_walking_root/rp_nathan_animated_003_walking_hip/rp_nathan_animated_003_walking_upperleg_r/rp_nathan_animated_003_walking_upperleg_twist_r
    m_Weight: 0
  - m_Path: rp_nathan_animated_003_walking_geoGRP
    m_Weight: 0
  - m_Path: rp_nathan_animated_003_walking_geoGRP/rp_nathan_animated_003_walking_geo
    m_Weight: 0
