%YAML 1.1
%TAG !u! tag:unity3d.com,2011:
--- !u!114 &-8584139096453907565
MonoBehaviour:
  m_ObjectHideFlags: 3
  m_CorrespondingSourceObject: {fileID: 0}
  m_PrefabInstance: {fileID: 0}
  m_PrefabAsset: {fileID: 0}
  m_GameObject: {fileID: 0}
  m_Enabled: 1
  m_EditorHideFlags: 0
  m_Script: {fileID: 11500000, guid: 7e9e4ed5a6f56fb4ebd693e39684f36f, type: 3}
  m_Name: VolumetricClouds
  m_EditorClassIdentifier: 
  active: 0
  enable:
    m_OverrideState: 0
    m_Value: 0
  localClouds:
    m_OverrideState: 0
    m_Value: 0
  earthCurvature:
    m_OverrideState: 0
    m_Value: 0
  cloudTiling:
    m_OverrideState: 0
    m_Value: {x: 1, y: 1}
  cloudOffset:
    m_OverrideState: 0
    m_Value: {x: 0, y: 0}
  lowestCloudAltitude:
    m_OverrideState: 0
    m_Value: 1000
  cloudThickness:
    m_OverrideState: 0
    m_Value: 8000
  fadeInMode:
    m_OverrideState: 0
    m_Value: 0
  fadeInStart:
    m_OverrideState: 0
    m_Value: 0
  fadeInDistance:
    m_OverrideState: 0
    m_Value: 0
  numPrimarySteps:
    m_OverrideState: 0
    m_Value: 64
  numLightSteps:
    m_OverrideState: 0
    m_Value: 6
  cloudMap:
    m_OverrideState: 0
    m_Value: {fileID: 0}
    dimension: 2
  cloudLut:
    m_OverrideState: 0
    m_Value: {fileID: 0}
    dimension: 2
  cloudControl:
    m_OverrideState: 0
    m_Value: 0
  cloudPreset:
    m_OverrideState: 0
    m_Value: 1
  cumulusMap:
    m_OverrideState: 0
    m_Value: {fileID: 0}
    dimension: 2
  cumulusMapMultiplier:
    m_OverrideState: 0
    m_Value: 1
  altoStratusMap:
    m_OverrideState: 0
    m_Value: {fileID: 0}
    dimension: 2
  altoStratusMapMultiplier:
    m_OverrideState: 0
    m_Value: 1
  cumulonimbusMap:
    m_OverrideState: 0
    m_Value: {fileID: 0}
    dimension: 2
  cumulonimbusMapMultiplier:
    m_OverrideState: 0
    m_Value: 1
  rainMap:
    m_OverrideState: 0
    m_Value: {fileID: 0}
    dimension: 2
  cloudMapResolution:
    m_OverrideState: 0
    m_Value: 64
  customDensityCurve:
    m_OverrideState: 0
    m_Value:
      serializedVersion: 2
      m_Curve:
      - serializedVersion: 3
        time: 0
        value: 0
        inSlope: 0
        outSlope: 0
        tangentMode: 0
        weightedMode: 0
        inWeight: 0
        outWeight: 0
      - serializedVersion: 3
        time: 0.2
        value: 1
        inSlope: 0
        outSlope: 0
        tangentMode: 0
        weightedMode: 0
        inWeight: 0
        outWeight: 0
      - serializedVersion: 3
        time: 0.5
        value: 0.7
        inSlope: 0
        outSlope: 0
        tangentMode: 0
        weightedMode: 0
        inWeight: 0
        outWeight: 0
      - serializedVersion: 3
        time: 0.8
        value: 1
        inSlope: 0
        outSlope: 0
        tangentMode: 0
        weightedMode: 0
        inWeight: 0
        outWeight: 0
      - serializedVersion: 3
        time: 1
        value: 0
        inSlope: 0
        outSlope: 0
        tangentMode: 0
        weightedMode: 0
        inWeight: 0
        outWeight: 0
      m_PreInfinity: 2
      m_PostInfinity: 2
      m_RotationOrder: 4
  customErosionCurve:
    m_OverrideState: 0
    m_Value:
      serializedVersion: 2
      m_Curve:
      - serializedVersion: 3
        time: 0
        value: 0.9
        inSlope: 0
        outSlope: 0
        tangentMode: 0
        weightedMode: 0
        inWeight: 0
        outWeight: 0
      - serializedVersion: 3
        time: 0.2
        value: 1
        inSlope: 0
        outSlope: 0
        tangentMode: 0
        weightedMode: 0
        inWeight: 0
        outWeight: 0
      - serializedVersion: 3
        time: 0.8
        value: 1
        inSlope: 0
        outSlope: 0
        tangentMode: 0
        weightedMode: 0
        inWeight: 0
        outWeight: 0
      - serializedVersion: 3
        time: 1
        value: 0.9
        inSlope: 0
        outSlope: 0
        tangentMode: 0
        weightedMode: 0
        inWeight: 0
        outWeight: 0
      m_PreInfinity: 2
      m_PostInfinity: 2
      m_RotationOrder: 4
  customAmbientOcclusionCurve:
    m_OverrideState: 0
    m_Value:
      serializedVersion: 2
      m_Curve:
      - serializedVersion: 3
        time: 0
        value: 1
        inSlope: 0
        outSlope: 0
        tangentMode: 0
        weightedMode: 0
        inWeight: 0
        outWeight: 0
      - serializedVersion: 3
        time: 0
        value: 0
        inSlope: 0
        outSlope: 0
        tangentMode: 0
        weightedMode: 0
        inWeight: 0
        outWeight: 0
      - serializedVersion: 3
        time: 1
        value: 0
        inSlope: 0
        outSlope: 0
        tangentMode: 0
        weightedMode: 0
        inWeight: 0
        outWeight: 0
      m_PreInfinity: 2
      m_PostInfinity: 2
      m_RotationOrder: 4
  scatteringTint:
    m_OverrideState: 0
    m_Value: {r: 0, g: 0, b: 0, a: 1}
  powderEffectIntensity:
    m_OverrideState: 0
    m_Value: 0.25
  multiScattering:
    m_OverrideState: 0
    m_Value: 0.5
  densityMultiplier:
    m_OverrideState: 0
    m_Value: 0.25
  shapeFactor:
    m_OverrideState: 0
    m_Value: 0.75
  shapeScale:
    m_OverrideState: 0
    m_Value: 2.5
  shapeOffset:
    m_OverrideState: 0
    m_Value: {x: 0, y: 0, z: 0}
  erosionFactor:
    m_OverrideState: 0
    m_Value: 0.5
  erosionScale:
    m_OverrideState: 0
    m_Value: 50
  erosionNoiseType:
    m_OverrideState: 0
    m_Value: 1
  ambientLightProbeDimmer:
    m_OverrideState: 0
    m_Value: 1
  sunLightDimmer:
    m_OverrideState: 0
    m_Value: 1
  erosionOcclusion:
    m_OverrideState: 0
    m_Value: 0.1
  globalWindSpeed:
    m_OverrideState: 0
    m_Value:
      mode: 1
      customValue: 100
      additiveValue: 0
      multiplyValue: 1
  orientation:
    m_OverrideState: 0
    m_Value:
      mode: 1
      customValue: 0
      additiveValue: 0
      multiplyValue: 1
  altitudeDistortion:
    m_OverrideState: 0
    m_Value: 0.5
  cloudMapSpeedMultiplier:
    m_OverrideState: 0
    m_Value: 0.5
  shapeSpeedMultiplier:
    m_OverrideState: 0
    m_Value: 1
  erosionSpeedMultiplier:
    m_OverrideState: 0
    m_Value: 0.25
  verticalShapeWindSpeed:
    m_OverrideState: 0
    m_Value: 0
  verticalErosionWindSpeed:
    m_OverrideState: 0
    m_Value: 0
  temporalAccumulationFactor:
    m_OverrideState: 0
    m_Value: 0.95
  ghostingReduction:
    m_OverrideState: 0
    m_Value: 0
  perceptualBlending:
    m_OverrideState: 0
    m_Value: 1
  shadows:
    m_OverrideState: 0
    m_Value: 0
  shadowResolution:
    m_OverrideState: 0
    m_Value: 256
  shadowPlaneHeightOffset:
    m_OverrideState: 0
    m_Value: 0
  shadowDistance:
    m_OverrideState: 0
    m_Value: 8000
  shadowOpacity:
    m_OverrideState: 0
    m_Value: 1
  shadowOpacityFallback:
    m_OverrideState: 0
    m_Value: 0
  m_Version: 2
  m_ObsoleteWindSpeed:
    m_OverrideState: 0
    m_Value: 1
  m_ObsoleteOrientation:
    m_OverrideState: 0
    m_Value: 0
  m_ObsoleteShapeOffsetX:
    m_OverrideState: 0
    m_Value: 0
  m_ObsoleteShapeOffsetY:
    m_OverrideState: 0
    m_Value: 0
  m_ObsoleteShapeOffsetZ:
    m_OverrideState: 0
    m_Value: 0
--- !u!114 &-6491109568227271909
MonoBehaviour:
  m_ObjectHideFlags: 3
  m_CorrespondingSourceObject: {fileID: 0}
  m_PrefabInstance: {fileID: 0}
  m_PrefabAsset: {fileID: 0}
  m_GameObject: {fileID: 0}
  m_Enabled: 1
  m_EditorHideFlags: 0
  m_Script: {fileID: 11500000, guid: 9008a067f4d626c4d8bc4bc48f04bb89, type: 3}
  m_Name: AmbientOcclusion
  m_EditorClassIdentifier: 
  active: 1
  quality:
    m_OverrideState: 0
    m_Value: 1
  rayTracing:
    m_OverrideState: 0
    m_Value: 0
  intensity:
    m_OverrideState: 0
    m_Value: 0
  directLightingStrength:
    m_OverrideState: 0
    m_Value: 0
  radius:
    m_OverrideState: 0
    m_Value: 2
  spatialBilateralAggressiveness:
    m_OverrideState: 0
    m_Value: 0.15
  temporalAccumulation:
    m_OverrideState: 0
    m_Value: 1
  ghostingReduction:
    m_OverrideState: 0
    m_Value: 0.5
  blurSharpness:
    m_OverrideState: 0
    m_Value: 0.1
  layerMask:
    m_OverrideState: 0
    m_Value:
      serializedVersion: 2
      m_Bits: 4294967295
  occluderMotionRejection:
    m_OverrideState: 0
    m_Value: 1
  receiverMotionRejection:
    m_OverrideState: 0
    m_Value: 1
  m_StepCount:
    m_OverrideState: 0
    m_Value: 6
  m_FullResolution:
    m_OverrideState: 0
    m_Value: 0
  m_MaximumRadiusInPixels:
    m_OverrideState: 0
    m_Value: 40
  m_BilateralUpsample:
    m_OverrideState: 0
    m_Value: 1
  m_DirectionCount:
    m_OverrideState: 0
    m_Value: 2
  m_RayLength:
    m_OverrideState: 0
    m_Value: 3
  m_SampleCount:
    m_OverrideState: 0
    m_Value: 2
  m_Denoise:
    m_OverrideState: 0
    m_Value: 1
  m_DenoiserRadius:
    m_OverrideState: 0
    m_Value: 0.5
--- !u!114 &-80935070937676428
MonoBehaviour:
  m_ObjectHideFlags: 3
  m_CorrespondingSourceObject: {fileID: 0}
  m_PrefabInstance: {fileID: 0}
  m_PrefabAsset: {fileID: 0}
  m_GameObject: {fileID: 0}
  m_Enabled: 1
  m_EditorHideFlags: 0
  m_Script: {fileID: 11500000, guid: e88178bb13f64a54f90d6cd6ef7aa9a1, type: 3}
  m_Name: CloudLayer
  m_EditorClassIdentifier: 
  active: 1
  opacity:
    m_OverrideState: 0
    m_Value: 1
  upperHemisphereOnly:
    m_OverrideState: 0
    m_Value: 1
  layers:
    m_OverrideState: 0
    m_Value: 0
  resolution:
    m_OverrideState: 0
    m_Value: 1024
  shadowMultiplier:
    m_OverrideState: 0
    m_Value: 1
  shadowTint:
    m_OverrideState: 0
    m_Value: {r: 0, g: 0, b: 0, a: 1}
  shadowResolution:
    m_OverrideState: 0
    m_Value: 256
  shadowSize:
    m_OverrideState: 0
    m_Value: 500
  layerA:
    cloudMap:
      m_OverrideState: 0
      m_Value: {fileID: 2800000, guid: 57a33fc2476a01644865bfde5f06e2f4, type: 3}
    opacityR:
      m_OverrideState: 0
      m_Value: 1
    opacityG:
      m_OverrideState: 0
      m_Value: 0
    opacityB:
      m_OverrideState: 0
      m_Value: 0
    opacityA:
      m_OverrideState: 0
      m_Value: 0
    rotation:
      m_OverrideState: 0
      m_Value: 0
    tint:
      m_OverrideState: 0
      m_Value: {r: 1, g: 1, b: 1, a: 1}
    exposure:
      m_OverrideState: 0
      m_Value: 0
    distortionMode:
      m_OverrideState: 0
      m_Value: 0
    scrollOrientation:
      m_OverrideState: 0
      m_Value:
        mode: 1
        customValue: 0
        additiveValue: 0
        multiplyValue: 1
    scrollSpeed:
      m_OverrideState: 0
      m_Value:
        mode: 1
        customValue: 100
        additiveValue: 0
        multiplyValue: 1
    flowmap:
      m_OverrideState: 0
      m_Value: {fileID: 0}
    lighting:
      m_OverrideState: 0
      m_Value: 0
    steps:
      m_OverrideState: 0
      m_Value: 4
    thickness:
      m_OverrideState: 0
      m_Value: 0.5
    castShadows:
      m_OverrideState: 0
      m_Value: 0
  layerB:
    cloudMap:
      m_OverrideState: 0
      m_Value: {fileID: 2800000, guid: 57a33fc2476a01644865bfde5f06e2f4, type: 3}
    opacityR:
      m_OverrideState: 0
      m_Value: 1
    opacityG:
      m_OverrideState: 0
      m_Value: 0
    opacityB:
      m_OverrideState: 0
      m_Value: 0
    opacityA:
      m_OverrideState: 0
      m_Value: 0
    rotation:
      m_OverrideState: 0
      m_Value: 0
    tint:
      m_OverrideState: 0
      m_Value: {r: 1, g: 1, b: 1, a: 1}
    exposure:
      m_OverrideState: 0
      m_Value: 0
    distortionMode:
      m_OverrideState: 0
      m_Value: 0
    scrollOrientation:
      m_OverrideState: 0
      m_Value:
        mode: 1
        customValue: 0
        additiveValue: 0
        multiplyValue: 1
    scrollSpeed:
      m_OverrideState: 0
      m_Value:
        mode: 1
        customValue: 100
        additiveValue: 0
        multiplyValue: 1
    flowmap:
      m_OverrideState: 0
      m_Value: {fileID: 0}
    lighting:
      m_OverrideState: 0
      m_Value: 0
    steps:
      m_OverrideState: 0
      m_Value: 4
    thickness:
      m_OverrideState: 0
      m_Value: 0.5
    castShadows:
      m_OverrideState: 0
      m_Value: 0
--- !u!114 &11400000
MonoBehaviour:
  m_ObjectHideFlags: 0
  m_CorrespondingSourceObject: {fileID: 0}
  m_PrefabInstance: {fileID: 0}
  m_PrefabAsset: {fileID: 0}
  m_GameObject: {fileID: 0}
  m_Enabled: 1
  m_EditorHideFlags: 0
  m_Script: {fileID: 11500000, guid: d7fd9488000d3734a9e00ee676215985, type: 3}
  m_Name: Box Volume Profile
  m_EditorClassIdentifier: 
  components:
  - {fileID: 7260406275890605556}
  - {fileID: -80935070937676428}
  - {fileID: 1348633268083391744}
  - {fileID: -8584139096453907565}
  - {fileID: 6039116909518268726}
  - {fileID: -6491109568227271909}
--- !u!114 &1348633268083391744
MonoBehaviour:
  m_ObjectHideFlags: 3
  m_CorrespondingSourceObject: {fileID: 0}
  m_PrefabInstance: {fileID: 0}
  m_PrefabAsset: {fileID: 0}
  m_GameObject: {fileID: 0}
  m_Enabled: 1
  m_EditorHideFlags: 0
  m_Script: {fileID: 11500000, guid: d877ec3e844f2ca46830012e8e79319b, type: 3}
  m_Name: PhysicallyBasedSky
  m_EditorClassIdentifier: 
  active: 1
  rotation:
    m_OverrideState: 0
    m_Value: 0
  skyIntensityMode:
    m_OverrideState: 0
    m_Value: 0
  exposure:
    m_OverrideState: 0
    m_Value: 0
  multiplier:
    m_OverrideState: 0
    m_Value: 1
  upperHemisphereLuxValue:
    m_OverrideState: 0
    m_Value: 1
  upperHemisphereLuxColor:
    m_OverrideState: 0
    m_Value: {x: 0, y: 0, z: 0}
  desiredLuxValue:
    m_OverrideState: 0
    m_Value: 20000
  updateMode:
    m_OverrideState: 0
    m_Value: 0
  updatePeriod:
    m_OverrideState: 0
    m_Value: 0
  includeSunInBaking:
    m_OverrideState: 0
    m_Value: 0
  type:
    m_OverrideState: 1
    m_Value: 1
  sphericalMode:
    m_OverrideState: 0
    m_Value: 1
  seaLevel:
    m_OverrideState: 0
    m_Value: 0
  planetaryRadius:
    m_OverrideState: 0
    m_Value: 6378100
  planetCenterPosition:
    m_OverrideState: 0
    m_Value: {x: 0, y: -6378100, z: 0}
  airDensityR:
    m_OverrideState: 0
    m_Value: 0.04534
  airDensityG:
    m_OverrideState: 0
    m_Value: 0.10237241
  airDensityB:
    m_OverrideState: 0
    m_Value: 0.23264056
  airTint:
    m_OverrideState: 0
    m_Value: {r: 0.9, g: 0.9, b: 1, a: 1}
  airMaximumAltitude:
    m_OverrideState: 0
    m_Value: 55261.973
  aerosolDensity:
    m_OverrideState: 0
    m_Value: 0.01192826
  aerosolTint:
    m_OverrideState: 0
    m_Value: {r: 0.9, g: 0.9, b: 0.9, a: 1}
  aerosolMaximumAltitude:
    m_OverrideState: 0
    m_Value: 8289.296
  aerosolAnisotropy:
    m_OverrideState: 0
    m_Value: 0
  numberOfBounces:
    m_OverrideState: 0
    m_Value: 3
  groundTint:
    m_OverrideState: 0
    m_Value: {r: 0.4, g: 0.25, b: 0.15, a: 1}
  groundColorTexture:
    m_OverrideState: 0
    m_Value: {fileID: 0}
  groundEmissionTexture:
    m_OverrideState: 0
    m_Value: {fileID: 0}
  groundEmissionMultiplier:
    m_OverrideState: 0
    m_Value: 1
  planetRotation:
    m_OverrideState: 0
    m_Value: {x: 0, y: 0, z: 0}
  spaceEmissionTexture:
    m_OverrideState: 0
    m_Value: {fileID: 0}
  spaceEmissionMultiplier:
    m_OverrideState: 0
    m_Value: 1
  spaceRotation:
    m_OverrideState: 0
    m_Value: {x: 0, y: 0, z: 0}
  colorSaturation:
    m_OverrideState: 0
    m_Value: 1
  alphaSaturation:
    m_OverrideState: 0
    m_Value: 1
  alphaMultiplier:
    m_OverrideState: 0
    m_Value: 1
  horizonTint:
    m_OverrideState: 0
    m_Value: {r: 1, g: 1, b: 1, a: 1}
  zenithTint:
    m_OverrideState: 0
    m_Value: {r: 1, g: 1, b: 1, a: 1}
  horizonZenithShift:
    m_OverrideState: 0
    m_Value: 0
  m_SkyVersion: 1
  m_ObsoleteEarthPreset:
    m_OverrideState: 0
    m_Value: 1
--- !u!114 &6039116909518268726
MonoBehaviour:
  m_ObjectHideFlags: 3
  m_CorrespondingSourceObject: {fileID: 0}
  m_PrefabInstance: {fileID: 0}
  m_PrefabAsset: {fileID: 0}
  m_GameObject: {fileID: 0}
  m_Enabled: 1
  m_EditorHideFlags: 0
  m_Script: {fileID: 11500000, guid: 0d7593b3a9277ac4696b20006c21dde2, type: 3}
  m_Name: VisualEnvironment
  m_EditorClassIdentifier: 
  active: 1
  skyType:
    m_OverrideState: 1
    m_Value: 4
  cloudType:
    m_OverrideState: 1
    m_Value: 1
  skyAmbientMode:
    m_OverrideState: 1
    m_Value: 1
  windOrientation:
    m_OverrideState: 0
    m_Value: 0
  windSpeed:
    m_OverrideState: 0
    m_Value: 100
  fogType:
    m_OverrideState: 0
    m_Value: 0
--- !u!114 &7260406275890605556
MonoBehaviour:
  m_ObjectHideFlags: 3
  m_CorrespondingSourceObject: {fileID: 0}
  m_PrefabInstance: {fileID: 0}
  m_PrefabAsset: {fileID: 0}
  m_GameObject: {fileID: 0}
  m_Enabled: 1
  m_EditorHideFlags: 0
  m_Script: {fileID: 11500000, guid: 2d08ce26990eb1a4a9177b860541e702, type: 3}
  m_Name: Exposure
  m_EditorClassIdentifier: 
  active: 0
  mode:
    m_OverrideState: 1
    m_Value: 1
  meteringMode:
    m_OverrideState: 1
    m_Value: 0
  luminanceSource:
    m_OverrideState: 0
    m_Value: 1
  fixedExposure:
    m_OverrideState: 0
    m_Value: 0
  compensation:
    m_OverrideState: 0
    m_Value: 0
  limitMin:
    m_OverrideState: 0
    m_Value: -1
  limitMax:
    m_OverrideState: 0
    m_Value: 14
  curveMap:
    m_OverrideState: 0
    m_Value:
      serializedVersion: 2
      m_Curve:
      - serializedVersion: 3
        time: -10
        value: -10
        inSlope: 0
        outSlope: 1
        tangentMode: 0
        weightedMode: 0
        inWeight: 0
        outWeight: 0
      - serializedVersion: 3
        time: 20
        value: 20
        inSlope: 1
        outSlope: 0
        tangentMode: 0
        weightedMode: 0
        inWeight: 0
        outWeight: 0
      m_PreInfinity: 2
      m_PostInfinity: 2
      m_RotationOrder: 4
  limitMinCurveMap:
    m_OverrideState: 0
    m_Value:
      serializedVersion: 2
      m_Curve:
      - serializedVersion: 3
        time: -10
        value: -12
        inSlope: 0
        outSlope: 1
        tangentMode: 0
        weightedMode: 0
        inWeight: 0
        outWeight: 0
      - serializedVersion: 3
        time: 20
        value: 18
        inSlope: 1
        outSlope: 0
        tangentMode: 0
        weightedMode: 0
        inWeight: 0
        outWeight: 0
      m_PreInfinity: 2
      m_PostInfinity: 2
      m_RotationOrder: 4
  limitMaxCurveMap:
    m_OverrideState: 0
    m_Value:
      serializedVersion: 2
      m_Curve:
      - serializedVersion: 3
        time: -10
        value: -8
        inSlope: 0
        outSlope: 1
        tangentMode: 0
        weightedMode: 0
        inWeight: 0
        outWeight: 0
      - serializedVersion: 3
        time: 20
        value: 22
        inSlope: 1
        outSlope: 0
        tangentMode: 0
        weightedMode: 0
        inWeight: 0
        outWeight: 0
      m_PreInfinity: 2
      m_PostInfinity: 2
      m_RotationOrder: 4
  adaptationMode:
    m_OverrideState: 0
    m_Value: 1
  adaptationSpeedDarkToLight:
    m_OverrideState: 0
    m_Value: 3
  adaptationSpeedLightToDark:
    m_OverrideState: 0
    m_Value: 1
  weightTextureMask:
    m_OverrideState: 0
    m_Value: {fileID: 0}
  histogramPercentages:
    m_OverrideState: 0
    m_Value: {x: 40, y: 90}
  histogramUseCurveRemapping:
    m_OverrideState: 0
    m_Value: 0
  targetMidGray:
    m_OverrideState: 0
    m_Value: 0
  centerAroundExposureTarget:
    m_OverrideState: 0
    m_Value: 0
  proceduralCenter:
    m_OverrideState: 0
    m_Value: {x: 0.5, y: 0.5}
  proceduralRadii:
    m_OverrideState: 0
    m_Value: {x: 0.3, y: 0.3}
  maskMinIntensity:
    m_OverrideState: 0
    m_Value: -30
  maskMaxIntensity:
    m_OverrideState: 0
    m_Value: 30
  proceduralSoftness:
    m_OverrideState: 0
    m_Value: 0.5
