%YAML 1.1
%TAG !u! tag:unity3d.com,2011:
--- !u!1045 &1
EditorBuildSettings:
  m_ObjectHideFlags: 0
  serializedVersion: 2
  m_Scenes:
  - enabled: 0
    path: 
    guid: 00000000000000000000000000000000
  - enabled: 1
    path: Assets/Scenes/MenuScreen.unity
    guid: 5756ec919a8cbc04a86db33064dcd206
  - enabled: 1
    path: Assets/Scenes/GameScreen.unity
    guid: 0a12e206e3e52424c9f7162f0b8535b9
  - enabled: 1
    path: Assets/Scenes/ResultScreen.unity
    guid: 94ae39c5f75ea204997f2890b3f4947e
  m_configObjects: {}
