%YAML 1.1
%TAG !u! tag:unity3d.com,2011:
--- !u!114 &11400000
MonoBehaviour:
  m_ObjectHideFlags: 0
  m_CorrespondingSourceObject: {fileID: 0}
  m_PrefabInstance: {fileID: 0}
  m_PrefabAsset: {fileID: 0}
  m_GameObject: {fileID: 0}
  m_Enabled: 1
  m_EditorHideFlags: 0
  m_Script: {fileID: 11500000, guid: 1e9853fc9ba23ad47b748167a173d4c5, type: 3}
  m_Name: MC_Data
  m_EditorClassIdentifier: 
  MC_MaxHealth: 60
  MC_LeftHealth: 40
  MC_Moneythisgame: 0
  MC_MoneyTotal: 0
  MC_MoveSpeed: 7
  MC_JumpSpeed: 6
  MC_reloadTime: 0.25
  MC_reloadTimeLeft: -0.0017747977
