%YAML 1.1
%TAG !u! tag:unity3d.com,2011:
--- !u!114 &11400000
MonoBehaviour:
  m_ObjectHideFlags: 0
  m_CorrespondingSourceObject: {fileID: 0}
  m_PrefabInstance: {fileID: 0}
  m_PrefabAsset: {fileID: 0}
  m_GameObject: {fileID: 0}
  m_Enabled: 1
  m_EditorHideFlags: 0
  m_Script: {fileID: 11500000, guid: 0b75c5aa53866c34a91775e21338fd58, type: 3}
  m_Name: Small Potion
  m_EditorClassIdentifier: 
  Name: Small Potion
  ItemEffect: Restore a little portion of your health
  QuantityHeld: 0
  Icon: {fileID: 21300000, guid: b67624a98a5f61c48ba8c2c1ffc757e5, type: 3}
  durantionEffect: 0
  healthRestore: 20
