%YAML 1.1
%TAG !u! tag:unity3d.com,2011:
--- !u!1045 &1
EditorBuildSettings:
  m_ObjectHideFlags: 0
  serializedVersion: 2
  m_Scenes:
  - enabled: 1
    path: Assets/Scenes/MenuScene.unity
    guid: 6979265c8b1e19e4b8b232a507a36aa3
  - enabled: 1
    path: Assets/Scenes/ProvesScene.unity
    guid: 9fc0d4010bbf28b4594072e72b8655ab
  m_configObjects:
    com.unity.input.settings: {fileID: 11400000, guid: 48c84bb0a49bbf54982fa952e81a187d, type: 2}
