%YAML 1.1
%TAG !u! tag:unity3d.com,2011:
--- !u!114 &11400000
MonoBehaviour:
  m_ObjectHideFlags: 0
  m_CorrespondingSourceObject: {fileID: 0}
  m_PrefabInstance: {fileID: 0}
  m_PrefabAsset: {fileID: 0}
  m_GameObject: {fileID: 0}
  m_Enabled: 1
  m_EditorHideFlags: 0
  m_Script: {fileID: 11500000, guid: 25fba67d8ae1825489cfa6debf895196, type: 3}
  m_Name: AttackState
  m_EditorClassIdentifier: 
  action: {fileID: 11400000, guid: 43aca1799436b3444b42f50b364fef62, type: 2}
  scriptableStateTransitions:
  - {fileID: 11400000, guid: 5dd879208d58fbe41a34717a92f699e2, type: 2}
  - {fileID: 11400000, guid: 94dbd68c4821c7c40bad44257b0071ae, type: 2}
