%YAML 1.1
%TAG !u! tag:unity3d.com,2011:
--- !u!319 &31900000
AvatarMask:
  m_ObjectHideFlags: 0
  m_CorrespondingSourceObject: {fileID: 0}
  m_PrefabInstance: {fileID: 0}
  m_PrefabAsset: {fileID: 0}
  m_Name: Player
  m_Mask: 00000000000000000000000000000000000000000000000000000000000000000100000000000000000000000000000000000000
  m_Elements:
  - m_Path: 
    m_Weight: 1
  - m_Path: Root
    m_Weight: 1
  - m_Path: Root/_ik_foot_root
    m_Weight: 1
  - m_Path: Root/_ik_foot_root/_ik_foot_l
    m_Weight: 1
  - m_Path: Root/_ik_foot_root/_ik_foot_r
    m_Weight: 1
  - m_Path: Root/_ik_hand_root
    m_Weight: 1
  - m_Path: Root/_ik_hand_root/_ik_hand_gun
    m_Weight: 1
  - m_Path: Root/_ik_hand_root/_ik_hand_gun/_ik_hand_l
    m_Weight: 1
  - m_Path: Root/_ik_hand_root/_ik_hand_gun/_ik_hand_r
    m_Weight: 1
  - m_Path: Root/Pelvis
    m_Weight: 1
  - m_Path: Root/Pelvis/spine_01
    m_Weight: 1
  - m_Path: Root/Pelvis/spine_01/spine_02
    m_Weight: 1
  - m_Path: Root/Pelvis/spine_01/spine_02/spine_03
    m_Weight: 1
  - m_Path: Root/Pelvis/spine_01/spine_02/spine_03/clavicle_l
    m_Weight: 1
  - m_Path: Root/Pelvis/spine_01/spine_02/spine_03/clavicle_l/UpperArm_L
    m_Weight: 1
  - m_Path: Root/Pelvis/spine_01/spine_02/spine_03/clavicle_l/UpperArm_L/lowerarm_l
    m_Weight: 1
  - m_Path: Root/Pelvis/spine_01/spine_02/spine_03/clavicle_l/UpperArm_L/lowerarm_l/Hand_L
    m_Weight: 1
  - m_Path: Root/Pelvis/spine_01/spine_02/spine_03/clavicle_l/UpperArm_L/lowerarm_l/Hand_L/finger_01_l
    m_Weight: 1
  - m_Path: Root/Pelvis/spine_01/spine_02/spine_03/clavicle_l/UpperArm_L/lowerarm_l/Hand_L/finger_01_l/finger_02_l
    m_Weight: 1
  - m_Path: Root/Pelvis/spine_01/spine_02/spine_03/clavicle_l/UpperArm_L/lowerarm_l/Hand_L/finger_01_l/finger_02_l/finger_03_l
    m_Weight: 1
  - m_Path: Root/Pelvis/spine_01/spine_02/spine_03/clavicle_l/UpperArm_L/lowerarm_l/Hand_L/finger_01_l/finger_02_l/finger_03_l/finger_04_l
    m_Weight: 1
  - m_Path: Root/Pelvis/spine_01/spine_02/spine_03/clavicle_l/UpperArm_L/lowerarm_l/Hand_L/indexFinger_01_l
    m_Weight: 1
  - m_Path: Root/Pelvis/spine_01/spine_02/spine_03/clavicle_l/UpperArm_L/lowerarm_l/Hand_L/indexFinger_01_l/indexFinger_02_l
    m_Weight: 1
  - m_Path: Root/Pelvis/spine_01/spine_02/spine_03/clavicle_l/UpperArm_L/lowerarm_l/Hand_L/indexFinger_01_l/indexFinger_02_l/indexFinger_03_l
    m_Weight: 1
  - m_Path: Root/Pelvis/spine_01/spine_02/spine_03/clavicle_l/UpperArm_L/lowerarm_l/Hand_L/indexFinger_01_l/indexFinger_02_l/indexFinger_03_l/indexFinger_04_l
    m_Weight: 1
  - m_Path: Root/Pelvis/spine_01/spine_02/spine_03/clavicle_l/UpperArm_L/lowerarm_l/Hand_L/thumb_01_l
    m_Weight: 1
  - m_Path: Root/Pelvis/spine_01/spine_02/spine_03/clavicle_l/UpperArm_L/lowerarm_l/Hand_L/thumb_01_l/thumb_02_l
    m_Weight: 1
  - m_Path: Root/Pelvis/spine_01/spine_02/spine_03/clavicle_l/UpperArm_L/lowerarm_l/Hand_L/thumb_01_l/thumb_02_l/thumb_03_l
    m_Weight: 1
  - m_Path: Root/Pelvis/spine_01/spine_02/spine_03/clavicle_r
    m_Weight: 1
  - m_Path: Root/Pelvis/spine_01/spine_02/spine_03/clavicle_r/UpperArm_R
    m_Weight: 1
  - m_Path: Root/Pelvis/spine_01/spine_02/spine_03/clavicle_r/UpperArm_R/lowerarm_r
    m_Weight: 1
  - m_Path: Root/Pelvis/spine_01/spine_02/spine_03/clavicle_r/UpperArm_R/lowerarm_r/Hand_R
    m_Weight: 1
  - m_Path: Root/Pelvis/spine_01/spine_02/spine_03/clavicle_r/UpperArm_R/lowerarm_r/Hand_R/finger_01_r
    m_Weight: 1
  - m_Path: Root/Pelvis/spine_01/spine_02/spine_03/clavicle_r/UpperArm_R/lowerarm_r/Hand_R/finger_01_r/finger_02_r
    m_Weight: 1
  - m_Path: Root/Pelvis/spine_01/spine_02/spine_03/clavicle_r/UpperArm_R/lowerarm_r/Hand_R/finger_01_r/finger_02_r/finger_03_r
    m_Weight: 1
  - m_Path: Root/Pelvis/spine_01/spine_02/spine_03/clavicle_r/UpperArm_R/lowerarm_r/Hand_R/finger_01_r/finger_02_r/finger_03_r/finger_04_r
    m_Weight: 1
  - m_Path: Root/Pelvis/spine_01/spine_02/spine_03/clavicle_r/UpperArm_R/lowerarm_r/Hand_R/indexFinger_01_r
    m_Weight: 1
  - m_Path: Root/Pelvis/spine_01/spine_02/spine_03/clavicle_r/UpperArm_R/lowerarm_r/Hand_R/indexFinger_01_r/indexFinger_02_r
    m_Weight: 1
  - m_Path: Root/Pelvis/spine_01/spine_02/spine_03/clavicle_r/UpperArm_R/lowerarm_r/Hand_R/indexFinger_01_r/indexFinger_02_r/indexFinger_03_r
    m_Weight: 1
  - m_Path: Root/Pelvis/spine_01/spine_02/spine_03/clavicle_r/UpperArm_R/lowerarm_r/Hand_R/indexFinger_01_r/indexFinger_02_r/indexFinger_03_r/indexFinger_04_r
    m_Weight: 1
  - m_Path: Root/Pelvis/spine_01/spine_02/spine_03/clavicle_r/UpperArm_R/lowerarm_r/Hand_R/thumb_01_r
    m_Weight: 1
  - m_Path: Root/Pelvis/spine_01/spine_02/spine_03/clavicle_r/UpperArm_R/lowerarm_r/Hand_R/thumb_01_r/thumb_02_r
    m_Weight: 1
  - m_Path: Root/Pelvis/spine_01/spine_02/spine_03/clavicle_r/UpperArm_R/lowerarm_r/Hand_R/thumb_01_r/thumb_02_r/thumb_03_r
    m_Weight: 1
  - m_Path: Root/Pelvis/spine_01/spine_02/spine_03/neck_01
    m_Weight: 1
  - m_Path: Root/Pelvis/spine_01/spine_02/spine_03/neck_01/head
    m_Weight: 1
  - m_Path: Root/Pelvis/spine_01/spine_02/spine_03/neck_01/head/eyebrows
    m_Weight: 1
  - m_Path: Root/Pelvis/spine_01/spine_02/spine_03/neck_01/head/eyes
    m_Weight: 1
  - m_Path: Root/Pelvis/Thigh_L
    m_Weight: 1
  - m_Path: Root/Pelvis/Thigh_L/calf_l
    m_Weight: 1
  - m_Path: Root/Pelvis/Thigh_L/calf_l/Foot_L
    m_Weight: 1
  - m_Path: Root/Pelvis/Thigh_L/calf_l/Foot_L/ball_l
    m_Weight: 1
  - m_Path: Root/Pelvis/Thigh_L/calf_l/Foot_L/ball_l/toes_l
    m_Weight: 1
  - m_Path: Root/Pelvis/Thigh_R
    m_Weight: 1
  - m_Path: Root/Pelvis/Thigh_R/calf_r
    m_Weight: 1
  - m_Path: Root/Pelvis/Thigh_R/calf_r/Foot_R
    m_Weight: 1
  - m_Path: Root/Pelvis/Thigh_R/calf_r/Foot_R/ball_r
    m_Weight: 1
  - m_Path: Root/Pelvis/Thigh_R/calf_r/Foot_R/ball_r/toes_r
    m_Weight: 1
  - m_Path: SK_Chr_Explorer_Female_01
    m_Weight: 1
