%YAML 1.1
%TAG !u! tag:unity3d.com,2011:
--- !u!114 &11400000
MonoBehaviour:
  m_ObjectHideFlags: 0
  m_CorrespondingSourceObject: {fileID: 0}
  m_PrefabInstance: {fileID: 0}
  m_PrefabAsset: {fileID: 0}
  m_GameObject: {fileID: 0}
  m_Enabled: 1
  m_EditorHideFlags: 0
  m_Script: {fileID: 11500000, guid: 59761e5d94232df41aa28c87e6f87222, type: 3}
  m_Name: ShotGun
  m_EditorClassIdentifier: 
  name: ShotGun
  description: A powerfull weapon if you are in front of the enemy
  spriteWeapon: {fileID: 1452465748, guid: b18154edd2a5c594b9547c16338680a5, type: 3}
  bulletForEachCharger: 10
  charger: 2
  timeToRecharge: 4
  maxBullets: 20
  currentBullets: 10
  costToBuy: 1000
  shootSpeed: 1.5
  damage: 50
  bulletSpead: 10
  goBullet: {fileID: 4300214286537844982, guid: 43bd7c2f28428d34091fd2bbca52a1a3, type: 3}
  maxDistance: 2
