%YAML 1.1
%TAG !u! tag:unity3d.com,2011:
--- !u!1 &4788827011847932826
GameObject:
  m_ObjectHideFlags: 0
  m_CorrespondingSourceObject: {fileID: 0}
  m_PrefabInstance: {fileID: 0}
  m_PrefabAsset: {fileID: 0}
  serializedVersion: 6
  m_Component:
  - component: {fileID: 2043336777776626516}
  - component: {fileID: 4856606529264718597}
  - component: {fileID: 7613750247208659128}
  m_Layer: 0
  m_Name: Layer1
  m_TagString: Untagged
  m_Icon: {fileID: 0}
  m_NavMeshLayer: 0
  m_StaticEditorFlags: 0
  m_IsActive: 1
--- !u!4 &2043336777776626516
Transform:
  m_ObjectHideFlags: 0
  m_CorrespondingSourceObject: {fileID: 0}
  m_PrefabInstance: {fileID: 0}
  m_PrefabAsset: {fileID: 0}
  m_GameObject: {fileID: 4788827011847932826}
  m_LocalRotation: {x: -0, y: -0, z: -0, w: 1}
  m_LocalPosition: {x: 0, y: 0, z: 0}
  m_LocalScale: {x: 1, y: 1, z: 1}
  m_ConstrainProportionsScale: 0
  m_Children: []
  m_Father: {fileID: 3395180003883468369}
  m_RootOrder: 0
  m_LocalEulerAnglesHint: {x: 0, y: 0, z: 0}
--- !u!1839735485 &4856606529264718597
Tilemap:
  m_ObjectHideFlags: 0
  m_CorrespondingSourceObject: {fileID: 0}
  m_PrefabInstance: {fileID: 0}
  m_PrefabAsset: {fileID: 0}
  m_GameObject: {fileID: 4788827011847932826}
  m_Enabled: 1
  m_Tiles:
  - first: {x: -2, y: -2, z: 0}
    second:
      serializedVersion: 2
      m_TileIndex: 2
      m_TileSpriteIndex: 2
      m_TileMatrixIndex: 0
      m_TileColorIndex: 0
      m_TileObjectToInstantiateIndex: 65535
      dummyAlignment: 0
      m_AllTileFlags: 0
  - first: {x: -1, y: -2, z: 0}
    second:
      serializedVersion: 2
      m_TileIndex: 3
      m_TileSpriteIndex: 3
      m_TileMatrixIndex: 0
      m_TileColorIndex: 0
      m_TileObjectToInstantiateIndex: 65535
      dummyAlignment: 0
      m_AllTileFlags: 0
  - first: {x: 0, y: -2, z: 0}
    second:
      serializedVersion: 2
      m_TileIndex: 5
      m_TileSpriteIndex: 5
      m_TileMatrixIndex: 0
      m_TileColorIndex: 0
      m_TileObjectToInstantiateIndex: 65535
      dummyAlignment: 0
      m_AllTileFlags: 0
  - first: {x: 1, y: -2, z: 0}
    second:
      serializedVersion: 2
      m_TileIndex: 4
      m_TileSpriteIndex: 4
      m_TileMatrixIndex: 0
      m_TileColorIndex: 0
      m_TileObjectToInstantiateIndex: 65535
      dummyAlignment: 0
      m_AllTileFlags: 0
  - first: {x: -2, y: 1, z: 0}
    second:
      serializedVersion: 2
      m_TileIndex: 1
      m_TileSpriteIndex: 1
      m_TileMatrixIndex: 0
      m_TileColorIndex: 0
      m_TileObjectToInstantiateIndex: 65535
      dummyAlignment: 0
      m_AllTileFlags: 0
  - first: {x: -1, y: 1, z: 0}
    second:
      serializedVersion: 2
      m_TileIndex: 0
      m_TileSpriteIndex: 0
      m_TileMatrixIndex: 0
      m_TileColorIndex: 0
      m_TileObjectToInstantiateIndex: 65535
      dummyAlignment: 0
      m_AllTileFlags: 0
  - first: {x: -2, y: 3, z: 0}
    second:
      serializedVersion: 2
      m_TileIndex: 12
      m_TileSpriteIndex: 12
      m_TileMatrixIndex: 0
      m_TileColorIndex: 0
      m_TileObjectToInstantiateIndex: 65535
      dummyAlignment: 0
      m_AllTileFlags: 1073741825
  - first: {x: -1, y: 3, z: 0}
    second:
      serializedVersion: 2
      m_TileIndex: 13
      m_TileSpriteIndex: 13
      m_TileMatrixIndex: 0
      m_TileColorIndex: 0
      m_TileObjectToInstantiateIndex: 65535
      dummyAlignment: 0
      m_AllTileFlags: 1073741825
  - first: {x: 0, y: 3, z: 0}
    second:
      serializedVersion: 2
      m_TileIndex: 14
      m_TileSpriteIndex: 14
      m_TileMatrixIndex: 0
      m_TileColorIndex: 0
      m_TileObjectToInstantiateIndex: 65535
      dummyAlignment: 0
      m_AllTileFlags: 1073741825
  - first: {x: -2, y: 4, z: 0}
    second:
      serializedVersion: 2
      m_TileIndex: 9
      m_TileSpriteIndex: 9
      m_TileMatrixIndex: 0
      m_TileColorIndex: 0
      m_TileObjectToInstantiateIndex: 65535
      dummyAlignment: 0
      m_AllTileFlags: 1073741825
  - first: {x: -1, y: 4, z: 0}
    second:
      serializedVersion: 2
      m_TileIndex: 10
      m_TileSpriteIndex: 10
      m_TileMatrixIndex: 0
      m_TileColorIndex: 0
      m_TileObjectToInstantiateIndex: 65535
      dummyAlignment: 0
      m_AllTileFlags: 1073741825
  - first: {x: 0, y: 4, z: 0}
    second:
      serializedVersion: 2
      m_TileIndex: 11
      m_TileSpriteIndex: 11
      m_TileMatrixIndex: 0
      m_TileColorIndex: 0
      m_TileObjectToInstantiateIndex: 65535
      dummyAlignment: 0
      m_AllTileFlags: 1073741825
  - first: {x: -2, y: 5, z: 0}
    second:
      serializedVersion: 2
      m_TileIndex: 7
      m_TileSpriteIndex: 7
      m_TileMatrixIndex: 0
      m_TileColorIndex: 0
      m_TileObjectToInstantiateIndex: 65535
      dummyAlignment: 0
      m_AllTileFlags: 0
  - first: {x: -1, y: 5, z: 0}
    second:
      serializedVersion: 2
      m_TileIndex: 6
      m_TileSpriteIndex: 6
      m_TileMatrixIndex: 0
      m_TileColorIndex: 0
      m_TileObjectToInstantiateIndex: 65535
      dummyAlignment: 0
      m_AllTileFlags: 0
  - first: {x: 0, y: 5, z: 0}
    second:
      serializedVersion: 2
      m_TileIndex: 8
      m_TileSpriteIndex: 8
      m_TileMatrixIndex: 0
      m_TileColorIndex: 0
      m_TileObjectToInstantiateIndex: 65535
      dummyAlignment: 0
      m_AllTileFlags: 0
  m_AnimatedTiles:
  - first: {x: -2, y: -2, z: 0}
    second:
      m_AnimatedSprites:
      - {fileID: 1858225024, guid: c80144b985a1b9049847804c91f5e248, type: 3}
      - {fileID: 589214180, guid: c80144b985a1b9049847804c91f5e248, type: 3}
      - {fileID: 1187987638, guid: c80144b985a1b9049847804c91f5e248, type: 3}
      - {fileID: 1264307898, guid: c80144b985a1b9049847804c91f5e248, type: 3}
      - {fileID: -1987723118, guid: c80144b985a1b9049847804c91f5e248, type: 3}
      - {fileID: -752578792, guid: c80144b985a1b9049847804c91f5e248, type: 3}
      - {fileID: 582826174, guid: c80144b985a1b9049847804c91f5e248, type: 3}
      - {fileID: 402304098, guid: c80144b985a1b9049847804c91f5e248, type: 3}
      m_AnimationSpeed: 1
      m_AnimationTimeOffset: 0
      m_IsLooping: 1
  - first: {x: -1, y: -2, z: 0}
    second:
      m_AnimatedSprites:
      - {fileID: 685930655, guid: c80144b985a1b9049847804c91f5e248, type: 3}
      - {fileID: -1803228109, guid: c80144b985a1b9049847804c91f5e248, type: 3}
      - {fileID: 2117276353, guid: c80144b985a1b9049847804c91f5e248, type: 3}
      - {fileID: 1307084102, guid: c80144b985a1b9049847804c91f5e248, type: 3}
      - {fileID: -26417425, guid: c80144b985a1b9049847804c91f5e248, type: 3}
      - {fileID: -420017605, guid: c80144b985a1b9049847804c91f5e248, type: 3}
      - {fileID: -2145294199, guid: c80144b985a1b9049847804c91f5e248, type: 3}
      - {fileID: -58189926, guid: c80144b985a1b9049847804c91f5e248, type: 3}
      m_AnimationSpeed: 1
      m_AnimationTimeOffset: 0
      m_IsLooping: 1
  - first: {x: 0, y: -2, z: 0}
    second:
      m_AnimatedSprites:
      - {fileID: -1355096796, guid: c80144b985a1b9049847804c91f5e248, type: 3}
      - {fileID: 650412659, guid: c80144b985a1b9049847804c91f5e248, type: 3}
      - {fileID: 780225675, guid: c80144b985a1b9049847804c91f5e248, type: 3}
      - {fileID: -195565858, guid: c80144b985a1b9049847804c91f5e248, type: 3}
      - {fileID: 1214617618, guid: c80144b985a1b9049847804c91f5e248, type: 3}
      - {fileID: 613355569, guid: c80144b985a1b9049847804c91f5e248, type: 3}
      - {fileID: -1880766241, guid: c80144b985a1b9049847804c91f5e248, type: 3}
      - {fileID: 1552791791, guid: c80144b985a1b9049847804c91f5e248, type: 3}
      m_AnimationSpeed: 1
      m_AnimationTimeOffset: 0
      m_IsLooping: 1
  - first: {x: 1, y: -2, z: 0}
    second:
      m_AnimatedSprites:
      - {fileID: -1009267749, guid: c80144b985a1b9049847804c91f5e248, type: 3}
      - {fileID: 28954483, guid: c80144b985a1b9049847804c91f5e248, type: 3}
      - {fileID: -1609953405, guid: c80144b985a1b9049847804c91f5e248, type: 3}
      - {fileID: -293245921, guid: c80144b985a1b9049847804c91f5e248, type: 3}
      - {fileID: 846543630, guid: c80144b985a1b9049847804c91f5e248, type: 3}
      - {fileID: 2017208632, guid: c80144b985a1b9049847804c91f5e248, type: 3}
      - {fileID: -413084117, guid: c80144b985a1b9049847804c91f5e248, type: 3}
      - {fileID: -1377333683, guid: c80144b985a1b9049847804c91f5e248, type: 3}
      m_AnimationSpeed: 1
      m_AnimationTimeOffset: 0
      m_IsLooping: 1
  - first: {x: -2, y: 1, z: 0}
    second:
      m_AnimatedSprites:
      - {fileID: 1980916796, guid: abfbd5fe57348604dace3e4da284861a, type: 3}
      - {fileID: -457244322, guid: abfbd5fe57348604dace3e4da284861a, type: 3}
      - {fileID: 1593715237, guid: abfbd5fe57348604dace3e4da284861a, type: 3}
      - {fileID: -1256002502, guid: abfbd5fe57348604dace3e4da284861a, type: 3}
      - {fileID: 843215835, guid: abfbd5fe57348604dace3e4da284861a, type: 3}
      - {fileID: 440398339, guid: abfbd5fe57348604dace3e4da284861a, type: 3}
      - {fileID: 114804314, guid: abfbd5fe57348604dace3e4da284861a, type: 3}
      - {fileID: -1885650487, guid: abfbd5fe57348604dace3e4da284861a, type: 3}
      - {fileID: 1457694552, guid: abfbd5fe57348604dace3e4da284861a, type: 3}
      - {fileID: -1519756161, guid: abfbd5fe57348604dace3e4da284861a, type: 3}
      - {fileID: 1948267606, guid: abfbd5fe57348604dace3e4da284861a, type: 3}
      - {fileID: 1223449362, guid: abfbd5fe57348604dace3e4da284861a, type: 3}
      - {fileID: 1743110493, guid: abfbd5fe57348604dace3e4da284861a, type: 3}
      - {fileID: -376252614, guid: abfbd5fe57348604dace3e4da284861a, type: 3}
      - {fileID: 575903582, guid: abfbd5fe57348604dace3e4da284861a, type: 3}
      - {fileID: 1794993326, guid: abfbd5fe57348604dace3e4da284861a, type: 3}
      - {fileID: -782118826, guid: abfbd5fe57348604dace3e4da284861a, type: 3}
      - {fileID: 586810901, guid: abfbd5fe57348604dace3e4da284861a, type: 3}
      - {fileID: 1496802474, guid: abfbd5fe57348604dace3e4da284861a, type: 3}
      m_AnimationSpeed: 1
      m_AnimationTimeOffset: 0
      m_IsLooping: 1
  - first: {x: -1, y: 1, z: 0}
    second:
      m_AnimatedSprites:
      - {fileID: 1181260141, guid: abfbd5fe57348604dace3e4da284861a, type: 3}
      - {fileID: 1605452168, guid: abfbd5fe57348604dace3e4da284861a, type: 3}
      - {fileID: -1341785416, guid: abfbd5fe57348604dace3e4da284861a, type: 3}
      - {fileID: 729780106, guid: abfbd5fe57348604dace3e4da284861a, type: 3}
      - {fileID: -1843017279, guid: abfbd5fe57348604dace3e4da284861a, type: 3}
      - {fileID: 146957167, guid: abfbd5fe57348604dace3e4da284861a, type: 3}
      - {fileID: 1454628144, guid: abfbd5fe57348604dace3e4da284861a, type: 3}
      - {fileID: 416404219, guid: abfbd5fe57348604dace3e4da284861a, type: 3}
      - {fileID: 1081246611, guid: abfbd5fe57348604dace3e4da284861a, type: 3}
      - {fileID: 539472747, guid: abfbd5fe57348604dace3e4da284861a, type: 3}
      - {fileID: 1986291879, guid: abfbd5fe57348604dace3e4da284861a, type: 3}
      - {fileID: 1537099164, guid: abfbd5fe57348604dace3e4da284861a, type: 3}
      - {fileID: 1301560605, guid: abfbd5fe57348604dace3e4da284861a, type: 3}
      - {fileID: -2080636744, guid: abfbd5fe57348604dace3e4da284861a, type: 3}
      - {fileID: -1044586838, guid: abfbd5fe57348604dace3e4da284861a, type: 3}
      - {fileID: 842695327, guid: abfbd5fe57348604dace3e4da284861a, type: 3}
      - {fileID: -939392122, guid: abfbd5fe57348604dace3e4da284861a, type: 3}
      - {fileID: 643980550, guid: abfbd5fe57348604dace3e4da284861a, type: 3}
      - {fileID: -2014875405, guid: abfbd5fe57348604dace3e4da284861a, type: 3}
      m_AnimationSpeed: 1
      m_AnimationTimeOffset: 0
      m_IsLooping: 1
  - first: {x: -2, y: 5, z: 0}
    second:
      m_AnimatedSprites:
      - {fileID: -246977148, guid: 6f2e9b2775634344f99bf06e82209657, type: 3}
      - {fileID: -974757481, guid: 6f2e9b2775634344f99bf06e82209657, type: 3}
      - {fileID: -1923491958, guid: 6f2e9b2775634344f99bf06e82209657, type: 3}
      - {fileID: -1165076417, guid: 6f2e9b2775634344f99bf06e82209657, type: 3}
      - {fileID: -181928763, guid: 6f2e9b2775634344f99bf06e82209657, type: 3}
      - {fileID: 1392778230, guid: 6f2e9b2775634344f99bf06e82209657, type: 3}
      - {fileID: 749271335, guid: 6f2e9b2775634344f99bf06e82209657, type: 3}
      - {fileID: -452540595, guid: 6f2e9b2775634344f99bf06e82209657, type: 3}
      m_AnimationSpeed: 1
      m_AnimationTimeOffset: 0
      m_IsLooping: 1
  - first: {x: -1, y: 5, z: 0}
    second:
      m_AnimatedSprites:
      - {fileID: -1727648744, guid: 6f2e9b2775634344f99bf06e82209657, type: 3}
      - {fileID: -1423422574, guid: 6f2e9b2775634344f99bf06e82209657, type: 3}
      - {fileID: 372906810, guid: 6f2e9b2775634344f99bf06e82209657, type: 3}
      - {fileID: 704683845, guid: 6f2e9b2775634344f99bf06e82209657, type: 3}
      - {fileID: -1866013541, guid: 6f2e9b2775634344f99bf06e82209657, type: 3}
      - {fileID: 1197433110, guid: 6f2e9b2775634344f99bf06e82209657, type: 3}
      - {fileID: -1484136820, guid: 6f2e9b2775634344f99bf06e82209657, type: 3}
      - {fileID: 188514868, guid: 6f2e9b2775634344f99bf06e82209657, type: 3}
      m_AnimationSpeed: 1
      m_AnimationTimeOffset: 0
      m_IsLooping: 1
  - first: {x: 0, y: 5, z: 0}
    second:
      m_AnimatedSprites:
      - {fileID: -1348110775, guid: 6f2e9b2775634344f99bf06e82209657, type: 3}
      - {fileID: 1194762242, guid: 6f2e9b2775634344f99bf06e82209657, type: 3}
      - {fileID: -990308364, guid: 6f2e9b2775634344f99bf06e82209657, type: 3}
      - {fileID: -1868954480, guid: 6f2e9b2775634344f99bf06e82209657, type: 3}
      - {fileID: 2027201647, guid: 6f2e9b2775634344f99bf06e82209657, type: 3}
      - {fileID: 1672526348, guid: 6f2e9b2775634344f99bf06e82209657, type: 3}
      - {fileID: -1798863681, guid: 6f2e9b2775634344f99bf06e82209657, type: 3}
      - {fileID: 1937998760, guid: 6f2e9b2775634344f99bf06e82209657, type: 3}
      m_AnimationSpeed: 1
      m_AnimationTimeOffset: 0
      m_IsLooping: 1
  m_TileAssetArray:
  - m_RefCount: 1
    m_Data: {fileID: 11400000, guid: 6763d5275daefd543abfc0a0bcbd66ed, type: 2}
  - m_RefCount: 1
    m_Data: {fileID: 11400000, guid: 5f99478895139054bb01b969ad6296bb, type: 2}
  - m_RefCount: 1
    m_Data: {fileID: 11400000, guid: 230f7c0ffcafe2e4eb9155c130cc4323, type: 2}
  - m_RefCount: 1
    m_Data: {fileID: 11400000, guid: 63860c785bcba394eb20082901cbce2e, type: 2}
  - m_RefCount: 1
    m_Data: {fileID: 11400000, guid: 111f0be37f8d3be459db2e622d9bf31b, type: 2}
  - m_RefCount: 1
    m_Data: {fileID: 11400000, guid: a8822fce9dbdaaa4aba70ef254841ff8, type: 2}
  - m_RefCount: 1
    m_Data: {fileID: 11400000, guid: ad659bc052631ef41a3d0d3edd52001b, type: 2}
  - m_RefCount: 1
    m_Data: {fileID: 11400000, guid: 5a23d5091d0edbb44aebb30e982c22e1, type: 2}
  - m_RefCount: 1
    m_Data: {fileID: 11400000, guid: dfaf545052cb4044fbde0ef9bc80d859, type: 2}
  - m_RefCount: 1
    m_Data: {fileID: 11400000, guid: 926e1913727e8c9448c1691a68ff8ebc, type: 2}
  - m_RefCount: 1
    m_Data: {fileID: 11400000, guid: a96962c26d8db0c4581bbee0eb6c5856, type: 2}
  - m_RefCount: 1
    m_Data: {fileID: 11400000, guid: 4426a4776a294804e900c8685ffe2612, type: 2}
  - m_RefCount: 1
    m_Data: {fileID: 11400000, guid: a085a56a568ed734fa4183250b5cfc87, type: 2}
  - m_RefCount: 1
    m_Data: {fileID: 11400000, guid: 57986edefa84eb744b714f7279427ada, type: 2}
  - m_RefCount: 1
    m_Data: {fileID: 11400000, guid: bfa2d8fab24274744806d501f6583241, type: 2}
  m_TileSpriteArray:
  - m_RefCount: 1
    m_Data: {fileID: -2014875405, guid: abfbd5fe57348604dace3e4da284861a, type: 3}
  - m_RefCount: 1
    m_Data: {fileID: 1496802474, guid: abfbd5fe57348604dace3e4da284861a, type: 3}
  - m_RefCount: 1
    m_Data: {fileID: 402304098, guid: c80144b985a1b9049847804c91f5e248, type: 3}
  - m_RefCount: 1
    m_Data: {fileID: -58189926, guid: c80144b985a1b9049847804c91f5e248, type: 3}
  - m_RefCount: 1
    m_Data: {fileID: -1377333683, guid: c80144b985a1b9049847804c91f5e248, type: 3}
  - m_RefCount: 1
    m_Data: {fileID: 1552791791, guid: c80144b985a1b9049847804c91f5e248, type: 3}
  - m_RefCount: 1
    m_Data: {fileID: 188514868, guid: 6f2e9b2775634344f99bf06e82209657, type: 3}
  - m_RefCount: 1
    m_Data: {fileID: -452540595, guid: 6f2e9b2775634344f99bf06e82209657, type: 3}
  - m_RefCount: 1
    m_Data: {fileID: 1937998760, guid: 6f2e9b2775634344f99bf06e82209657, type: 3}
  - m_RefCount: 1
    m_Data: {fileID: -1434754304, guid: 6f2e9b2775634344f99bf06e82209657, type: 3}
  - m_RefCount: 1
    m_Data: {fileID: 1180049691, guid: 6f2e9b2775634344f99bf06e82209657, type: 3}
  - m_RefCount: 1
    m_Data: {fileID: 433458824, guid: 6f2e9b2775634344f99bf06e82209657, type: 3}
  - m_RefCount: 1
    m_Data: {fileID: -553320315, guid: 6f2e9b2775634344f99bf06e82209657, type: 3}
  - m_RefCount: 1
    m_Data: {fileID: 2119091252, guid: 6f2e9b2775634344f99bf06e82209657, type: 3}
  - m_RefCount: 1
    m_Data: {fileID: 529363246, guid: 6f2e9b2775634344f99bf06e82209657, type: 3}
  m_TileMatrixArray:
  - m_RefCount: 15
    m_Data:
      e00: 1
      e01: 0
      e02: 0
      e03: 0
      e10: 0
      e11: 1
      e12: 0
      e13: 0
      e20: 0
      e21: 0
      e22: 1
      e23: 0
      e30: 0
      e31: 0
      e32: 0
      e33: 1
  m_TileColorArray:
  - m_RefCount: 15
    m_Data: {r: 1, g: 1, b: 1, a: 1}
  m_TileObjectToInstantiateArray: []
  m_AnimationFrameRate: 1
  m_Color: {r: 1, g: 1, b: 1, a: 1}
  m_Origin: {x: -2, y: -2, z: 0}
  m_Size: {x: 4, y: 8, z: 1}
  m_TileAnchor: {x: 0.5, y: 0.5, z: 0}
  m_TileOrientation: 0
  m_TileOrientationMatrix:
    e00: 1
    e01: 0
    e02: 0
    e03: 0
    e10: 0
    e11: 1
    e12: 0
    e13: 0
    e20: 0
    e21: 0
    e22: 1
    e23: 0
    e30: 0
    e31: 0
    e32: 0
    e33: 1
--- !u!483693784 &7613750247208659128
TilemapRenderer:
  m_ObjectHideFlags: 0
  m_CorrespondingSourceObject: {fileID: 0}
  m_PrefabInstance: {fileID: 0}
  m_PrefabAsset: {fileID: 0}
  m_GameObject: {fileID: 4788827011847932826}
  m_Enabled: 1
  m_CastShadows: 0
  m_ReceiveShadows: 0
  m_DynamicOccludee: 0
  m_StaticShadowCaster: 0
  m_MotionVectors: 1
  m_LightProbeUsage: 0
  m_ReflectionProbeUsage: 0
  m_RayTracingMode: 0
  m_RayTraceProcedural: 0
  m_RenderingLayerMask: 1
  m_RendererPriority: 0
  m_Materials:
  - {fileID: 10754, guid: 0000000000000000f000000000000000, type: 0}
  m_StaticBatchInfo:
    firstSubMesh: 0
    subMeshCount: 0
  m_StaticBatchRoot: {fileID: 0}
  m_ProbeAnchor: {fileID: 0}
  m_LightProbeVolumeOverride: {fileID: 0}
  m_ScaleInLightmap: 1
  m_ReceiveGI: 1
  m_PreserveUVs: 0
  m_IgnoreNormalsForChartDetection: 0
  m_ImportantGI: 0
  m_StitchLightmapSeams: 1
  m_SelectedEditorRenderState: 0
  m_MinimumChartSize: 4
  m_AutoUVMaxDistance: 0.5
  m_AutoUVMaxAngle: 89
  m_LightmapParameters: {fileID: 0}
  m_SortingLayerID: 0
  m_SortingLayer: 0
  m_SortingOrder: 0
  m_ChunkSize: {x: 32, y: 32, z: 32}
  m_ChunkCullingBounds: {x: 0, y: 0, z: 0}
  m_MaxChunkCount: 16
  m_MaxFrameAge: 16
  m_SortOrder: 0
  m_Mode: 0
  m_DetectChunkCullingBounds: 0
  m_MaskInteraction: 0
--- !u!1 &4920580112679206951
GameObject:
  m_ObjectHideFlags: 0
  m_CorrespondingSourceObject: {fileID: 0}
  m_PrefabInstance: {fileID: 0}
  m_PrefabAsset: {fileID: 0}
  serializedVersion: 6
  m_Component:
  - component: {fileID: 3395180003883468369}
  - component: {fileID: 1221013287406492316}
  m_Layer: 0
  m_Name: animated tiles
  m_TagString: Untagged
  m_Icon: {fileID: 0}
  m_NavMeshLayer: 0
  m_StaticEditorFlags: 0
  m_IsActive: 1
--- !u!4 &3395180003883468369
Transform:
  m_ObjectHideFlags: 0
  m_CorrespondingSourceObject: {fileID: 0}
  m_PrefabInstance: {fileID: 0}
  m_PrefabAsset: {fileID: 0}
  m_GameObject: {fileID: 4920580112679206951}
  m_LocalRotation: {x: 0, y: 0, z: 0, w: 1}
  m_LocalPosition: {x: 0, y: 0, z: 0}
  m_LocalScale: {x: 1, y: 1, z: 1}
  m_ConstrainProportionsScale: 0
  m_Children:
  - {fileID: 2043336777776626516}
  m_Father: {fileID: 0}
  m_RootOrder: 0
  m_LocalEulerAnglesHint: {x: 0, y: 0, z: 0}
--- !u!156049354 &1221013287406492316
Grid:
  m_ObjectHideFlags: 0
  m_CorrespondingSourceObject: {fileID: 0}
  m_PrefabInstance: {fileID: 0}
  m_PrefabAsset: {fileID: 0}
  m_GameObject: {fileID: 4920580112679206951}
  m_Enabled: 1
  m_CellSize: {x: 1, y: 1, z: 0}
  m_CellGap: {x: 0, y: 0, z: 0}
  m_CellLayout: 0
  m_CellSwizzle: 0
--- !u!114 &6503191557997757827
MonoBehaviour:
  m_ObjectHideFlags: 0
  m_CorrespondingSourceObject: {fileID: 0}
  m_PrefabInstance: {fileID: 0}
  m_PrefabAsset: {fileID: 0}
  m_GameObject: {fileID: 0}
  m_Enabled: 1
  m_EditorHideFlags: 0
  m_Script: {fileID: 12395, guid: 0000000000000000e000000000000000, type: 0}
  m_Name: Palette Settings
  m_EditorClassIdentifier: 
  cellSizing: 0
  m_TransparencySortMode: 0
  m_TransparencySortAxis: {x: 0, y: 0, z: 1}
