%YAML 1.1
%TAG !u! tag:unity3d.com,2011:
--- !u!1 &5705657587212894564
GameObject:
  m_ObjectHideFlags: 0
  m_CorrespondingSourceObject: {fileID: 0}
  m_PrefabInstance: {fileID: 0}
  m_PrefabAsset: {fileID: 0}
  serializedVersion: 6
  m_Component:
  - component: {fileID: 5705657587212894569}
  - component: {fileID: 5705657587212894570}
  - component: {fileID: 5705657587212894571}
  m_Layer: 0
  m_Name: AudioManager
  m_TagString: Untagged
  m_Icon: {fileID: 0}
  m_NavMeshLayer: 0
  m_StaticEditorFlags: 0
  m_IsActive: 1
--- !u!4 &5705657587212894569
Transform:
  m_ObjectHideFlags: 0
  m_CorrespondingSourceObject: {fileID: 0}
  m_PrefabInstance: {fileID: 0}
  m_PrefabAsset: {fileID: 0}
  m_GameObject: {fileID: 5705657587212894564}
  m_LocalRotation: {x: 0, y: 0, z: 0, w: 1}
  m_LocalPosition: {x: 1186.2759, y: 539.25256, z: 134.2513}
  m_LocalScale: {x: 1, y: 1, z: 1}
  m_ConstrainProportionsScale: 0
  m_Children: []
  m_Father: {fileID: 0}
  m_RootOrder: 0
  m_LocalEulerAnglesHint: {x: 0, y: 0, z: 0}
--- !u!114 &5705657587212894570
MonoBehaviour:
  m_ObjectHideFlags: 0
  m_CorrespondingSourceObject: {fileID: 0}
  m_PrefabInstance: {fileID: 0}
  m_PrefabAsset: {fileID: 0}
  m_GameObject: {fileID: 5705657587212894564}
  m_Enabled: 1
  m_EditorHideFlags: 0
  m_Script: {fileID: 11500000, guid: cca92eba371e4ba4aba6fef476350fcd, type: 3}
  m_Name: 
  m_EditorClassIdentifier: 
  sfxPenLightButton:
  - {fileID: 8300000, guid: 47ce415e628af6b479f6ba6408413888, type: 3}
  - {fileID: 8300000, guid: 86e9fc56e4b743142b702c05e3114a36, type: 3}
  - {fileID: 8300000, guid: 2cf99cc3a4ba7fc4f8811faa67a25c5c, type: 3}
  - {fileID: 8300000, guid: 27b5c3824d67ca145a3e0ce3ffe4167c, type: 3}
  - {fileID: 8300000, guid: 31a82cb06accc4042903e5c46d3a189f, type: 3}
  - {fileID: 8300000, guid: 70f7ee92404a04b4d9fbfb772d95f4cf, type: 3}
  - {fileID: 8300000, guid: 3ba92b16ebb8b6f448ffa08b7734451d, type: 3}
  - {fileID: 8300000, guid: aef808bce2b0ec94a98b62e3fbccb7cf, type: 3}
  - {fileID: 8300000, guid: 997564806972ebe429318d924be2d981, type: 3}
  - {fileID: 8300000, guid: 6a1176526a6950a4a9c3aaa68fb67846, type: 3}
  - {fileID: 8300000, guid: 872b4490e039cda41ae581d6938a822c, type: 3}
  - {fileID: 8300000, guid: 7a172aba15908694eaecd90d51a08b19, type: 3}
  - {fileID: 8300000, guid: a5cdd9de949efa749bc7615313a1a248, type: 3}
--- !u!82 &5705657587212894571
AudioSource:
  m_ObjectHideFlags: 0
  m_CorrespondingSourceObject: {fileID: 0}
  m_PrefabInstance: {fileID: 0}
  m_PrefabAsset: {fileID: 0}
  m_GameObject: {fileID: 5705657587212894564}
  m_Enabled: 1
  serializedVersion: 4
  OutputAudioMixerGroup: {fileID: 8925681558131491728, guid: 2c76fdd8e4ef75745a61a18461703664, type: 2}
  m_audioClip: {fileID: 0}
  m_PlayOnAwake: 1
  m_Volume: 1
  m_Pitch: 1
  Loop: 0
  Mute: 0
  Spatialize: 0
  SpatializePostEffects: 0
  Priority: 128
  DopplerLevel: 1
  MinDistance: 1
  MaxDistance: 500
  Pan2D: 0
  rolloffMode: 0
  BypassEffects: 0
  BypassListenerEffects: 0
  BypassReverbZones: 0
  rolloffCustomCurve:
    serializedVersion: 2
    m_Curve:
    - serializedVersion: 3
      time: 0
      value: 1
      inSlope: 0
      outSlope: 0
      tangentMode: 0
      weightedMode: 0
      inWeight: 0.33333334
      outWeight: 0.33333334
    - serializedVersion: 3
      time: 1
      value: 0
      inSlope: 0
      outSlope: 0
      tangentMode: 0
      weightedMode: 0
      inWeight: 0.33333334
      outWeight: 0.33333334
    m_PreInfinity: 2
    m_PostInfinity: 2
    m_RotationOrder: 4
  panLevelCustomCurve:
    serializedVersion: 2
    m_Curve:
    - serializedVersion: 3
      time: 0
      value: 0
      inSlope: 0
      outSlope: 0
      tangentMode: 0
      weightedMode: 0
      inWeight: 0.33333334
      outWeight: 0.33333334
    m_PreInfinity: 2
    m_PostInfinity: 2
    m_RotationOrder: 4
  spreadCustomCurve:
    serializedVersion: 2
    m_Curve:
    - serializedVersion: 3
      time: 0
      value: 0
      inSlope: 0
      outSlope: 0
      tangentMode: 0
      weightedMode: 0
      inWeight: 0.33333334
      outWeight: 0.33333334
    m_PreInfinity: 2
    m_PostInfinity: 2
    m_RotationOrder: 4
  reverbZoneMixCustomCurve:
    serializedVersion: 2
    m_Curve:
    - serializedVersion: 3
      time: 0
      value: 1
      inSlope: 0
      outSlope: 0
      tangentMode: 0
      weightedMode: 0
      inWeight: 0.33333334
      outWeight: 0.33333334
    m_PreInfinity: 2
    m_PostInfinity: 2
    m_RotationOrder: 4
