[
  {
    "id": "0",
    "nom": "Oscar",
    "sexualidad": "Homosexual"
  },
  {
    "id": "1",
    "nom": "Lorenzo",
    "sexualidad": "Homosexual"
  },
  {
    "id": "3",
    "nom": "Pol",
    "sexualidad": "Normal"
  }
]