<?xml version="1.0" encoding="UTF-8" standalone="no"?>
<!DOCTYPE svg PUBLIC "-//W3C//DTD SVG 1.1//EN"
 "http://www.w3.org/Graphics/SVG/1.1/DTD/svg11.dtd">
<!-- Generated by graphviz version 2.38.0 (20140413.2041)
 -->
<!-- Title: G Pages: 1 -->
<svg width="657pt" height="836pt"
 viewBox="0.00 0.00 657.27 836.21" xmlns="http://www.w3.org/2000/svg" xmlns:xlink="http://www.w3.org/1999/xlink">
<g id="graph0" class="graph" transform="scale(1 1) rotate(0) translate(4 832.21)">
<title>G</title>
<polygon fill="white" stroke="none" points="-4,4 -4,-832.21 653.275,-832.21 653.275,4 -4,4"/>
<!-- mqttbrokerclient_curiosity_rover -->
<g id="node1" class="node"><title>mqttbrokerclient_curiosity_rover</title>
<ellipse fill="#c24747" stroke="black" cx="300.158" cy="-99.6396" rx="62.8651" ry="21.4286"/>
<text text-anchor="middle" x="300.158" y="-102.64" font-family="Helvetica,sans-Serif" font-size="10.00" fill="#ffffff">mqttbrokerclient.</text>
<text text-anchor="middle" x="300.158" y="-91.6396" font-family="Helvetica,sans-Serif" font-size="10.00" fill="#ffffff">curiosity_rover</text>
</g>
<!-- mqttbrokerclient -->
<g id="node2" class="node"><title>mqttbrokerclient</title>
<ellipse fill="#ac4949" stroke="black" cx="210.158" cy="-21.2132" rx="50.7503" ry="18"/>
<text text-anchor="middle" x="210.158" y="-18.7132" font-family="Helvetica,sans-Serif" font-size="10.00" fill="#ffffff">mqttbrokerclient</text>
</g>
<!-- mqttbrokerclient_curiosity_rover&#45;&gt;mqttbrokerclient -->
<g id="edge1" class="edge"><title>mqttbrokerclient_curiosity_rover&#45;&gt;mqttbrokerclient</title>
<path fill="none" stroke="black" d="M277.91,-79.7477C265.409,-69.132 249.729,-55.8167 236.603,-44.6699"/>
<polygon fill="black" stroke="black" points="238.699,-41.8582 228.811,-38.0532 234.168,-47.1939 238.699,-41.8582"/>
</g>
<!-- mqttbrokerclient_simple_connection_manager -->
<g id="node3" class="node"><title>mqttbrokerclient_simple_connection_manager</title>
<ellipse fill="#a83838" stroke="black" cx="120.158" cy="-99.6396" rx="98.9899" ry="21.4286"/>
<text text-anchor="middle" x="120.158" y="-102.64" font-family="Helvetica,sans-Serif" font-size="10.00" fill="#ffffff">mqttbrokerclient.</text>
<text text-anchor="middle" x="120.158" y="-91.6396" font-family="Helvetica,sans-Serif" font-size="10.00" fill="#ffffff">simple_connection_manager</text>
</g>
<!-- mqttbrokerclient_simple_connection_manager&#45;&gt;mqttbrokerclient -->
<g id="edge2" class="edge"><title>mqttbrokerclient_simple_connection_manager&#45;&gt;mqttbrokerclient</title>
<path fill="none" stroke="black" d="M143.335,-78.9579C155.757,-68.4096 171.105,-55.3756 183.959,-44.4605"/>
<polygon fill="black" stroke="black" points="186.234,-47.1201 191.591,-37.9793 181.703,-41.7843 186.234,-47.1201"/>
</g>
<!-- mqttbrokerclient_mosquitto_connection -->
<g id="node4" class="node"><title>mqttbrokerclient_mosquitto_connection</title>
<ellipse fill="#bf2121" stroke="black" cx="185.158" cy="-264.271" rx="62.8651" ry="28.9828"/>
<text text-anchor="middle" x="185.158" y="-272.771" font-family="Helvetica,sans-Serif" font-size="10.00" fill="#ffffff">mqttbrokerclient.</text>
<text text-anchor="middle" x="185.158" y="-261.771" font-family="Helvetica,sans-Serif" font-size="10.00" fill="#ffffff">mosquitto.</text>
<text text-anchor="middle" x="185.158" y="-250.771" font-family="Helvetica,sans-Serif" font-size="10.00" fill="#ffffff">connection</text>
</g>
<!-- mqttbrokerclient_mosquitto_connection&#45;&gt;mqttbrokerclient_simple_connection_manager -->
<g id="edge3" class="edge"><title>mqttbrokerclient_mosquitto_connection&#45;&gt;mqttbrokerclient_simple_connection_manager</title>
<path fill="none" stroke="black" d="M140.871,-243.536C116.742,-229.466 91.8168,-207.923 92.1576,-179.066"/>
</g>
<!-- mqttbrokerclient_mosquitto -->
<g id="node5" class="node"><title>mqttbrokerclient_mosquitto</title>
<ellipse fill="#c43131" stroke="black" cx="183.158" cy="-178.066" rx="62.8651" ry="21.4286"/>
<text text-anchor="middle" x="183.158" y="-181.066" font-family="Helvetica,sans-Serif" font-size="10.00" fill="#ffffff">mqttbrokerclient.</text>
<text text-anchor="middle" x="183.158" y="-170.066" font-family="Helvetica,sans-Serif" font-size="10.00" fill="#ffffff">mosquitto</text>
</g>
<!-- mqttbrokerclient_mosquitto_connection&#45;&gt;mqttbrokerclient_mosquitto -->
<g id="edge8" class="edge"><title>mqttbrokerclient_mosquitto_connection&#45;&gt;mqttbrokerclient_mosquitto</title>
<path fill="none" stroke="black" d="M184.492,-235.232C184.297,-227.024 184.083,-218.01 183.884,-209.653"/>
<polygon fill="black" stroke="black" points="187.38,-209.441 183.644,-199.527 180.382,-209.607 187.38,-209.441"/>
</g>
<!-- mqttbrokerclient_simple_message_publisher -->
<g id="node15" class="node"><title>mqttbrokerclient_simple_message_publisher</title>
<ellipse fill="#913030" stroke="black" cx="514.158" cy="-99.6396" rx="94.5053" ry="21.4286"/>
<text text-anchor="middle" x="514.158" y="-102.64" font-family="Helvetica,sans-Serif" font-size="10.00" fill="#ffffff">mqttbrokerclient.</text>
<text text-anchor="middle" x="514.158" y="-91.6396" font-family="Helvetica,sans-Serif" font-size="10.00" fill="#ffffff">simple_message_publisher</text>
</g>
<!-- mqttbrokerclient_mosquitto_connection&#45;&gt;mqttbrokerclient_simple_message_publisher -->
<g id="edge23" class="edge"><title>mqttbrokerclient_mosquitto_connection&#45;&gt;mqttbrokerclient_simple_message_publisher</title>
<path fill="none" stroke="black" d="M213.688,-238.36C226.627,-226.768 241.952,-212.619 255.158,-199.279 272.966,-181.289 271.507,-169.97 293.158,-156.853 331.711,-133.494 379.688,-119.794 421.08,-111.781"/>
<polygon fill="black" stroke="black" points="421.979,-115.174 431.175,-109.913 420.705,-108.291 421.979,-115.174"/>
</g>
<!-- mqttbrokerclient_mosquitto&#45;&gt;mqttbrokerclient_simple_connection_manager -->
<g id="edge4" class="edge"><title>mqttbrokerclient_mosquitto&#45;&gt;mqttbrokerclient_simple_connection_manager</title>
<path fill="none" stroke="black" d="M166.934,-157.384C159.699,-148.608 151.046,-138.111 143.161,-128.545"/>
<polygon fill="black" stroke="black" points="145.827,-126.277 136.765,-120.787 140.426,-130.729 145.827,-126.277"/>
</g>
<!-- mqttbrokerclient_mosquitto&#45;&gt;mqttbrokerclient_simple_message_publisher -->
<g id="edge29" class="edge"><title>mqttbrokerclient_mosquitto&#45;&gt;mqttbrokerclient_simple_message_publisher</title>
<path fill="none" stroke="black" d="M231.142,-164.161C240.736,-161.668 250.754,-159.127 260.158,-156.853 319.421,-142.522 386.815,-127.673 437.284,-116.838"/>
<polygon fill="black" stroke="black" points="438.1,-120.243 447.145,-114.726 436.634,-113.398 438.1,-120.243"/>
</g>
<!-- time -->
<g id="node6" class="node"><title>time</title>
<ellipse fill="#3b3bce" stroke="black" cx="310.158" cy="-810.21" rx="27" ry="18"/>
<text text-anchor="middle" x="310.158" y="-807.71" font-family="Helvetica,sans-Serif" font-size="10.00" fill="#ffffff">time</text>
</g>
<!-- time&#45;&gt;mqttbrokerclient_simple_connection_manager -->
<g id="edge5" class="edge"><title>time&#45;&gt;mqttbrokerclient_simple_connection_manager</title>
<path fill="none" stroke="black" d="M283.352,-807.642C221.622,-802.412 69.8617,-779.937 6.15761,-684.21 -2.70661,-670.89 -1.13684,-662.451 6.15761,-648.21 18.6416,-623.839 48.5329,-638.51 56.1576,-612.21"/>
<path fill="none" stroke="black" d="M56.1576,-611.21C71.9103,-542.789 56.1576,-523.447 56.1576,-453.236 56.1576,-453.236 56.1576,-453.236 56.1576,-357.253 56.1576,-276.459 91.2034,-259.855 92.1576,-179.066"/>
<path fill="none" stroke="black" d="M92.1576,-177.066C91.5728,-160.888 97.1188,-143.884 103.426,-130.033"/>
<polygon fill="black" stroke="black" points="106.596,-131.518 107.847,-120.997 100.308,-128.441 106.596,-131.518"/>
</g>
<!-- logging -->
<g id="node9" class="node"><title>logging</title>
<ellipse fill="#dd18dd" stroke="black" cx="382.158" cy="-738.21" rx="27.8353" ry="18"/>
<text text-anchor="middle" x="382.158" y="-735.71" font-family="Helvetica,sans-Serif" font-size="10.00" fill="#ffffff">logging</text>
</g>
<!-- time&#45;&gt;logging -->
<g id="edge15" class="edge"><title>time&#45;&gt;logging</title>
<path fill="none" stroke="black" d="M324.728,-795.045C334.908,-785.148 348.681,-771.756 360.188,-760.569"/>
<polygon fill="black" stroke="black" points="362.632,-763.075 367.362,-753.595 357.752,-758.056 362.632,-763.075"/>
</g>
<!-- paho_mqtt_client -->
<g id="node10" class="node"><title>paho_mqtt_client</title>
<ellipse fill="#bcbc2f" stroke="black" cx="382.158" cy="-546.219" rx="28.9828" ry="28.9828"/>
<text text-anchor="middle" x="382.158" y="-554.719" font-family="Helvetica,sans-Serif" font-size="10.00" fill="#000000">paho.</text>
<text text-anchor="middle" x="382.158" y="-543.719" font-family="Helvetica,sans-Serif" font-size="10.00" fill="#000000">mqtt.</text>
<text text-anchor="middle" x="382.158" y="-532.719" font-family="Helvetica,sans-Serif" font-size="10.00" fill="#000000">client</text>
</g>
<!-- time&#45;&gt;paho_mqtt_client -->
<g id="edge18" class="edge"><title>time&#45;&gt;paho_mqtt_client</title>
<path fill="none" stroke="black" d="M331.537,-798.988C363.094,-783.875 418.519,-757.23 419.158,-756.21 453.299,-701.645 423.62,-624.238 401.32,-580.567"/>
<polygon fill="black" stroke="black" points="404.314,-578.74 396.559,-571.521 398.12,-582 404.314,-578.74"/>
</g>
<!-- configparser -->
<g id="node7" class="node"><title>configparser</title>
<ellipse fill="#4cb34c" stroke="black" cx="56.1576" cy="-666.21" rx="41.4139" ry="18"/>
<text text-anchor="middle" x="56.1576" y="-663.71" font-family="Helvetica,sans-Serif" font-size="10.00" fill="#000000">configparser</text>
</g>
<!-- configparser&#45;&gt;mqttbrokerclient_simple_connection_manager -->
<g id="edge6" class="edge"><title>configparser&#45;&gt;mqttbrokerclient_simple_connection_manager</title>
<path fill="none" stroke="black" d="M53.7772,-648.163C52.8813,-637.602 52.7757,-623.876 56.1576,-612.21"/>
</g>
<!-- os -->
<g id="node8" class="node"><title>os</title>
<ellipse fill="#0cf3f3" stroke="black" cx="382.158" cy="-810.21" rx="27" ry="18"/>
<text text-anchor="middle" x="382.158" y="-807.71" font-family="Helvetica,sans-Serif" font-size="10.00" fill="#000000">os</text>
</g>
<!-- os&#45;&gt;configparser -->
<g id="edge7" class="edge"><title>os&#45;&gt;configparser</title>
<path fill="none" stroke="black" d="M360.893,-799.021C356.063,-796.748 350.945,-794.372 346.158,-792.21 256.595,-751.775 150.286,-706.685 94.5851,-683.28"/>
<polygon fill="black" stroke="black" points="95.6892,-679.948 85.1139,-679.305 92.9799,-686.402 95.6892,-679.948"/>
</g>
<!-- os&#45;&gt;logging -->
<g id="edge14" class="edge"><title>os&#45;&gt;logging</title>
<path fill="none" stroke="black" d="M382.158,-791.907C382.158,-784.193 382.158,-774.923 382.158,-766.323"/>
<polygon fill="black" stroke="black" points="385.658,-766.315 382.158,-756.315 378.658,-766.315 385.658,-766.315"/>
</g>
<!-- os&#45;&gt;paho_mqtt_client -->
<g id="edge17" class="edge"><title>os&#45;&gt;paho_mqtt_client</title>
<path fill="none" stroke="black" d="M407.11,-802.868C482.508,-782.431 699.106,-713.673 637.158,-612.21"/>
<path fill="none" stroke="black" d="M637.158,-611.21C609.804,-570.699 465.187,-594.229 420.158,-575.21 417.627,-574.141 415.107,-572.872 412.638,-571.473"/>
<polygon fill="black" stroke="black" points="414.313,-568.39 403.998,-565.969 410.551,-574.294 414.313,-568.39"/>
</g>
<!-- os&#45;&gt;mqttbrokerclient_simple_message_publisher -->
<g id="edge26" class="edge"><title>os&#45;&gt;mqttbrokerclient_simple_message_publisher</title>
<path fill="none" stroke="black" d="M637.158,-611.21C597.869,-553.021 637.158,-523.447 637.158,-453.236 637.158,-453.236 637.158,-453.236 637.158,-357.253 637.158,-278.059 663.008,-253.923 637.158,-179.066"/>
<path fill="none" stroke="black" d="M637.158,-177.066C626.812,-151.072 602.218,-133.235 577.719,-121.376"/>
<polygon fill="black" stroke="black" points="578.915,-118.075 568.364,-117.119 576.016,-124.446 578.915,-118.075"/>
</g>
<!-- mqttbrokerclient_simple_message_manager -->
<g id="node17" class="node"><title>mqttbrokerclient_simple_message_manager</title>
<ellipse fill="#a44646" stroke="black" cx="514.158" cy="-21.2132" rx="94.0904" ry="21.4286"/>
<text text-anchor="middle" x="514.158" y="-24.2132" font-family="Helvetica,sans-Serif" font-size="10.00" fill="#ffffff">mqttbrokerclient.</text>
<text text-anchor="middle" x="514.158" y="-13.2132" font-family="Helvetica,sans-Serif" font-size="10.00" fill="#ffffff">simple_message_manager</text>
</g>
<!-- os&#45;&gt;mqttbrokerclient_simple_message_manager -->
<g id="edge31" class="edge"><title>os&#45;&gt;mqttbrokerclient_simple_message_manager</title>
<path fill="none" stroke="black" d="M637.158,-177.066C620.648,-135.585 644.561,-114.428 618.158,-78.4264 607.148,-63.4146 590.885,-51.9837 574.472,-43.4807"/>
<polygon fill="black" stroke="black" points="575.895,-40.2807 565.371,-39.0539 572.833,-46.5755 575.895,-40.2807"/>
</g>
<!-- logging&#45;&gt;mqttbrokerclient_mosquitto_connection -->
<g id="edge13" class="edge"><title>logging&#45;&gt;mqttbrokerclient_mosquitto_connection</title>
<path fill="none" stroke="black" d="M185.158,-357.253C181.205,-340.016 180.672,-320.479 181.339,-303.858"/>
<polygon fill="black" stroke="black" points="184.86,-303.591 181.928,-293.41 177.871,-303.197 184.86,-303.591"/>
</g>
<!-- logging&#45;&gt;mqttbrokerclient_mosquitto -->
<g id="edge9" class="edge"><title>logging&#45;&gt;mqttbrokerclient_mosquitto</title>
<path fill="none" stroke="black" d="M379.734,-719.95C376.854,-695.577 373.455,-649.846 382.158,-612.21"/>
<path fill="none" stroke="black" d="M382.158,-611.21C390.359,-581.919 281.167,-570.128 261.158,-547.219"/>
<path fill="none" stroke="black" d="M261.158,-545.219C202.422,-477.97 205.116,-446.281 185.158,-359.253"/>
<path fill="none" stroke="black" d="M185.158,-357.253C170.661,-316.97 130.697,-332.316 113.158,-293.262 102.6,-269.754 102.016,-258.516 113.158,-235.279 119.502,-222.047 130.648,-210.945 142.205,-202.195"/>
<polygon fill="black" stroke="black" points="144.482,-204.872 150.63,-196.243 140.443,-199.155 144.482,-204.872"/>
</g>
<!-- logging&#45;&gt;paho_mqtt_client -->
<g id="edge16" class="edge"><title>logging&#45;&gt;paho_mqtt_client</title>
<path fill="none" stroke="black" d="M382.158,-611.21C384.062,-602.976 384.834,-593.986 384.979,-585.415"/>
<polygon fill="black" stroke="black" points="388.478,-585.213 384.879,-575.248 381.478,-585.282 388.478,-585.213"/>
</g>
<!-- mqttbrokerclient_simple_message_subscriber -->
<g id="node14" class="node"><title>mqttbrokerclient_simple_message_subscriber</title>
<ellipse fill="#a83838" stroke="black" cx="401.158" cy="-178.066" rx="98.9899" ry="21.4286"/>
<text text-anchor="middle" x="401.158" y="-181.066" font-family="Helvetica,sans-Serif" font-size="10.00" fill="#ffffff">mqttbrokerclient.</text>
<text text-anchor="middle" x="401.158" y="-170.066" font-family="Helvetica,sans-Serif" font-size="10.00" fill="#ffffff">simple_message_subscriber</text>
</g>
<!-- logging&#45;&gt;mqttbrokerclient_simple_message_subscriber -->
<g id="edge22" class="edge"><title>logging&#45;&gt;mqttbrokerclient_simple_message_subscriber</title>
<path fill="none" stroke="black" d="M261.158,-545.219C224.592,-504.316 259.619,-474.12 280.158,-423.245 293.174,-391.004 308.805,-389.937 325.158,-359.253"/>
<path fill="none" stroke="black" d="M325.158,-357.253C349.524,-310.153 389.304,-316.959 401.158,-265.271"/>
<path fill="none" stroke="black" d="M401.158,-263.271C405.179,-245.738 405.334,-225.606 404.411,-209.424"/>
<polygon fill="black" stroke="black" points="407.9,-209.145 403.679,-199.427 400.919,-209.656 407.9,-209.145"/>
</g>
<!-- logging&#45;&gt;mqttbrokerclient_simple_message_publisher -->
<g id="edge28" class="edge"><title>logging&#45;&gt;mqttbrokerclient_simple_message_publisher</title>
<path fill="none" stroke="black" d="M382.158,-611.21C406.273,-525.08 522.847,-643.88 580.158,-575.21 596.67,-555.425 580.5,-542.995 580.158,-517.227 579.046,-433.665 585.244,-412.221 575.158,-329.262 571.644,-300.362 564.492,-294.192 561.158,-265.271"/>
</g>
<!-- paho_mqtt_client&#45;&gt;mqttbrokerclient_mosquitto_connection -->
<g id="edge10" class="edge"><title>paho_mqtt_client&#45;&gt;mqttbrokerclient_mosquitto_connection</title>
<path fill="none" stroke="black" d="M355.618,-534.022C332.993,-523.324 300.929,-505.274 280.158,-481.227 234.355,-428.204 207.346,-349.616 194.465,-303.304"/>
<polygon fill="black" stroke="black" points="197.77,-302.116 191.783,-293.375 191.012,-303.942 197.77,-302.116"/>
</g>
<!-- paho_mqtt_subscribe -->
<g id="node13" class="node"><title>paho_mqtt_subscribe</title>
<ellipse fill="#a4a446" stroke="black" cx="331.158" cy="-452.236" rx="41.9398" ry="28.9828"/>
<text text-anchor="middle" x="331.158" y="-460.736" font-family="Helvetica,sans-Serif" font-size="10.00" fill="#000000">paho.</text>
<text text-anchor="middle" x="331.158" y="-449.736" font-family="Helvetica,sans-Serif" font-size="10.00" fill="#000000">mqtt.</text>
<text text-anchor="middle" x="331.158" y="-438.736" font-family="Helvetica,sans-Serif" font-size="10.00" fill="#000000">subscribe</text>
</g>
<!-- paho_mqtt_client&#45;&gt;paho_mqtt_subscribe -->
<g id="edge33" class="edge"><title>paho_mqtt_client&#45;&gt;paho_mqtt_subscribe</title>
<path fill="none" stroke="black" d="M368.491,-520.569C363.004,-510.674 356.579,-499.086 350.621,-488.339"/>
<polygon fill="black" stroke="black" points="353.666,-486.614 345.756,-479.566 347.544,-490.009 353.666,-486.614"/>
</g>
<!-- paho_mqtt_publish -->
<g id="node16" class="node"><title>paho_mqtt_publish</title>
<ellipse fill="#a4a446" stroke="black" cx="462.158" cy="-358.253" rx="33.4697" ry="28.9828"/>
<text text-anchor="middle" x="462.158" y="-366.753" font-family="Helvetica,sans-Serif" font-size="10.00" fill="#000000">paho.</text>
<text text-anchor="middle" x="462.158" y="-355.753" font-family="Helvetica,sans-Serif" font-size="10.00" fill="#000000">mqtt.</text>
<text text-anchor="middle" x="462.158" y="-344.753" font-family="Helvetica,sans-Serif" font-size="10.00" fill="#000000">publish</text>
</g>
<!-- paho_mqtt_client&#45;&gt;paho_mqtt_publish -->
<g id="edge34" class="edge"><title>paho_mqtt_client&#45;&gt;paho_mqtt_publish</title>
<path fill="none" stroke="black" d="M395.805,-520.3C402.013,-508.587 409.27,-494.342 415.158,-481.227 427.819,-453.023 440.315,-420.296 449.235,-395.846"/>
<polygon fill="black" stroke="black" points="452.598,-396.839 452.71,-386.245 446.016,-394.457 452.598,-396.839"/>
</g>
<!-- paho_mqtt -->
<g id="node11" class="node"><title>paho_mqtt</title>
<ellipse fill="#e7e722" stroke="black" cx="464.158" cy="-546.219" rx="35.1405" ry="18"/>
<text text-anchor="middle" x="464.158" y="-543.719" font-family="Helvetica,sans-Serif" font-size="10.00" fill="#000000">paho.mqtt</text>
</g>
<!-- paho_mqtt&#45;&gt;mqttbrokerclient_mosquitto_connection -->
<g id="edge11" class="edge"><title>paho_mqtt&#45;&gt;mqttbrokerclient_mosquitto_connection</title>
<path fill="none" stroke="black" d="M450.329,-529.47C435.793,-512.045 413.373,-482.535 401.158,-453.236"/>
<path fill="none" stroke="black" d="M401.158,-451.236C384.136,-410.41 400.176,-383.464 363.158,-359.253"/>
<path fill="none" stroke="black" d="M363.158,-357.253C323.206,-331.124 274.935,-306.576 238.745,-289.422"/>
<polygon fill="black" stroke="black" points="239.887,-286.091 229.348,-285.005 236.909,-292.426 239.887,-286.091"/>
</g>
<!-- paho_mqtt&#45;&gt;mqttbrokerclient_simple_message_subscriber -->
<g id="edge20" class="edge"><title>paho_mqtt&#45;&gt;mqttbrokerclient_simple_message_subscriber</title>
<path fill="none" stroke="black" d="M401.158,-451.236C369.352,-374.949 385.376,-346.401 401.158,-265.271"/>
</g>
<!-- paho_mqtt&#45;&gt;mqttbrokerclient_simple_message_publisher -->
<g id="edge27" class="edge"><title>paho_mqtt&#45;&gt;mqttbrokerclient_simple_message_publisher</title>
<path fill="none" stroke="black" d="M470.863,-528.488C493.225,-472.379 563.697,-292.866 561.158,-265.271"/>
<path fill="none" stroke="black" d="M561.158,-263.271C556.794,-225.427 551.742,-216.587 545.158,-179.066"/>
</g>
<!-- paho -->
<g id="node12" class="node"><title>paho</title>
<ellipse fill="#e7e722" stroke="black" cx="544.158" cy="-546.219" rx="27" ry="18"/>
<text text-anchor="middle" x="544.158" y="-543.719" font-family="Helvetica,sans-Serif" font-size="10.00" fill="#000000">paho</text>
</g>
<!-- paho&#45;&gt;mqttbrokerclient_mosquitto_connection -->
<g id="edge12" class="edge"><title>paho&#45;&gt;mqttbrokerclient_mosquitto_connection</title>
<path fill="none" stroke="black" d="M551.951,-528.943C559.787,-510.302 569.591,-479.012 561.158,-453.236"/>
<path fill="none" stroke="black" d="M561.158,-451.236C539.757,-385.83 482.384,-416.636 420.158,-387.245 394.638,-375.191 386.778,-374.701 363.158,-359.253"/>
</g>
<!-- paho&#45;&gt;mqttbrokerclient_simple_message_subscriber -->
<g id="edge21" class="edge"><title>paho&#45;&gt;mqttbrokerclient_simple_message_subscriber</title>
<path fill="none" stroke="black" d="M561.158,-451.236C548.444,-412.382 565.228,-399.931 561.158,-359.253"/>
<path fill="none" stroke="black" d="M561.158,-357.253C554.235,-288.074 488.086,-233.242 443.04,-203.532"/>
<polygon fill="black" stroke="black" points="444.916,-200.577 434.615,-198.103 441.125,-206.462 444.916,-200.577"/>
</g>
<!-- paho&#45;&gt;mqttbrokerclient_simple_message_publisher -->
<g id="edge24" class="edge"><title>paho&#45;&gt;mqttbrokerclient_simple_message_publisher</title>
<path fill="none" stroke="black" d="M561.158,-357.253C555.959,-316.704 564.904,-305.98 561.158,-265.271"/>
</g>
<!-- paho_mqtt_subscribe&#45;&gt;mqttbrokerclient_simple_message_subscriber -->
<g id="edge19" class="edge"><title>paho_mqtt_subscribe&#45;&gt;mqttbrokerclient_simple_message_subscriber</title>
<path fill="none" stroke="black" d="M322.088,-423.872C317.403,-404.681 314.62,-379.025 325.158,-359.253"/>
</g>
<!-- mqttbrokerclient_simple_message_subscriber&#45;&gt;mqttbrokerclient_simple_message_manager -->
<g id="edge32" class="edge"><title>mqttbrokerclient_simple_message_subscriber&#45;&gt;mqttbrokerclient_simple_message_manager</title>
<path fill="none" stroke="black" d="M397.747,-156.734C395.295,-135.416 394.723,-101.824 410.158,-78.4264 420.265,-63.1035 436.004,-51.626 452.206,-43.1773"/>
<polygon fill="black" stroke="black" points="453.762,-46.3129 461.222,-38.79 450.699,-40.0186 453.762,-46.3129"/>
</g>
<!-- mqttbrokerclient_simple_message_publisher&#45;&gt;mqttbrokerclient_simple_message_manager -->
<g id="edge30" class="edge"><title>mqttbrokerclient_simple_message_publisher&#45;&gt;mqttbrokerclient_simple_message_manager</title>
<path fill="none" stroke="black" d="M514.158,-78.1587C514.158,-70.3001 514.158,-61.1558 514.158,-52.5655"/>
<polygon fill="black" stroke="black" points="517.658,-52.4856 514.158,-42.4856 510.658,-52.4856 517.658,-52.4856"/>
</g>
<!-- paho_mqtt_publish&#45;&gt;mqttbrokerclient_simple_message_publisher -->
<g id="edge25" class="edge"><title>paho_mqtt_publish&#45;&gt;mqttbrokerclient_simple_message_publisher</title>
<path fill="none" stroke="black" d="M481.648,-334.592C507.371,-302.155 548.999,-239.69 545.158,-179.066"/>
<path fill="none" stroke="black" d="M545.158,-177.066C542.322,-160.909 535.816,-143.908 529.493,-130.053"/>
<polygon fill="black" stroke="black" points="532.649,-128.539 525.192,-121.013 526.328,-131.547 532.649,-128.539"/>
</g>
</g>
</svg>
