digraph G {
    concentrate = true;
    rankdir = TB;
    node [style=filled,fillcolor="#ffffff",fontcolor="#000000",fontname=Helvetica,fontsize=10];

    enum -> mastermind_comparison_rules_names [weight="5",minlen="2"];
    mastermind_general_rules_generic_rule -> mastermind_comparison_rules_engine [weight="5",minlen="2"];
    mastermind_general_rules -> mastermind_comparison_rules_engine [weight="5"];
    mastermind_comparison_rules_names -> mastermind_comparison_rules_engine [weight="5"];
    mastermind_general_rules_rule_equals_datasetA_datasetB -> mastermind_comparison_rules_engine [weight="5",minlen="2"];
    mastermind_general_rules_rule_equals_datasetA_datasetB -> mastermind_general_rules [weight="5"];
    abc -> mastermind_general_rules_generic_rule [weight="5",minlen="3"];
    mastermind_general_rules_generic_rule -> mastermind_general_rules_rule_equals_datasetA_datasetB [weight="5"];
    mastermind_comparison_rules_engine -> mastermind_validate_collected_data [weight="5"];
    mastermind_validate_collected_data -> mastermind [weight="5"];
    mastermind_comparison_rules_names -> mastermind [weight="5"];
    mastermind_comparison_rules_engine [label="mastermind\.\ncomparison_rules_engine",fillcolor="#a83838",fontcolor="#ffffff"];
    mastermind_general_rules_rule_equals_datasetA_datasetB [label="mastermind\.\ngeneral_rules\.\nrule_equals_datasetA_datasetB",fillcolor="#cc3333",fontcolor="#ffffff"];
    mastermind_validate_collected_data [label="mastermind\.\nvalidate_collected_data",fillcolor="#c04040",fontcolor="#ffffff"];
    mastermind_general_rules [label="mastermind\.\ngeneral_rules",fillcolor="#c04040",fontcolor="#ffffff"];
    mastermind [fillcolor="#ac4949",fontcolor="#ffffff"];
    mastermind_comparison_rules_names [label="mastermind\.\ncomparison_rules_names",fillcolor="#cc3333",fontcolor="#ffffff"];
    abc [fillcolor="#53b653"];
    mastermind_general_rules_generic_rule [label="mastermind\.\ngeneral_rules\.\ngeneric_rule",fillcolor="#cc3333",fontcolor="#ffffff"];
    enum [fillcolor="#5353b6",fontcolor="#ffffff"];
}

