digraph G {
    concentrate = true;
    rankdir = TB;
    node [style=filled,fillcolor="#ffffff",fontcolor="#000000",fontname=Helvetica,fontsize=10];

    logging_handlers -> datacollector_local_logger [weight="5",minlen="2"];
    logging -> datacollector_local_logger [weight="5",minlen="2"];
    datacollector_default_section_config_data -> datacollector_local_logger [weight="5"];
    datacollector_generic_server_config_data -> datacollector_nmap_config_data [weight="5"];
    datacollector_generic_server_config_data -> datacollector_mqttbroker_config_data [weight="5"];
    datetime -> datacollector_control_unit [weight="5",minlen="2"];
    datacollector_scheduler_host_discovery_request -> datacollector_control_unit [weight="5",minlen="2"];
    datacollector_scheduler_ping_pong_test -> datacollector_control_unit [weight="5",minlen="2"];
    datacollector_scheduler_redis_communication_manager -> datacollector_control_unit [weight="5",minlen="2"];
    datacollector_scheduler -> datacollector_control_unit [weight="5"];
    datacollector_scheduler_mqttbroker_expert -> datacollector_control_unit [weight="5",minlen="2"];
    datacollector_main -> datacollector_control_unit [weight="5"];
    datacollector_scheduler_port_scanning_request -> datacollector_control_unit [weight="5",minlen="2"];
    datacollector_scheduler_simple_scheduler -> datacollector_control_unit [weight="5",minlen="2"];
    datacollector_generic_server_config_data -> datacollector_redismq_config_data [weight="5"];
    daemonize -> datacollector_daemon_tools [weight="5",minlen="2"];
    time -> datacollector_daemon_tools [weight="2",minlen="2"];
    configparser -> datacollector_external_configuration [weight="5",minlen="2"];
    datacollector_redismq_config_data -> datacollector_external_configuration [weight="5"];
    datacollector_mqttbroker_config_data -> datacollector_external_configuration [weight="5"];
    datacollector_nmap_config_data -> datacollector_external_configuration [weight="5"];
    datacollector_default_section_config_data -> datacollector_external_configuration [weight="5"];
    datacollector_daemon_tools -> datacollector_main [weight="5"];
    datacollector_external_configuration -> datacollector_main [weight="5"];
    datacollector_control_unit -> datacollector_main [weight="5"];
    datacollector_local_logger -> datacollector_main [weight="5"];
    mqttbrokerclient -> datacollector_scheduler_mqttbroker_expert [weight="5",minlen="3"];
    datacollector_scheduler_redis_communication_manager -> datacollector_scheduler_master_mind_pipe [weight="5"];
    mastermind -> datacollector_scheduler_master_mind_pipe [weight="5",minlen="3"];
    datacollector_main -> datacollector_scheduler_master_mind_pipe [weight="5",minlen="2"];
    datacollector_vlab_monitoring_port_scan_response_parser -> datacollector_scheduler_port_scanning_request [weight="5",minlen="3"];
    datacollector_vlab -> datacollector_scheduler_port_scanning_request [weight="5",minlen="2"];
    datacollector_vlab_monitoring_host_discovery_book -> datacollector_scheduler_port_scanning_request [weight="5",minlen="3"];
    os -> datacollector_scheduler_port_scanning_request [weight="5",minlen="3"];
    datacollector_scheduler_master_mind_pipe -> datacollector_scheduler_port_scanning_request [weight="5"];
    datacollector_vlab_monitoring -> datacollector_scheduler_port_scanning_request [weight="5",minlen="2"];
    tcpclientserver_client -> datacollector_scheduler_port_scanning_request [weight="5",minlen="3"];
    tcpclientserver -> datacollector_scheduler_port_scanning_request [weight="5",minlen="3"];
    datacollector_vlab_monitoring_port_scan_book -> datacollector_scheduler_port_scanning_request [weight="5",minlen="3"];
    datacollector_scheduler_redis_communication_manager -> datacollector_scheduler_port_scanning_request [weight="5"];
    datacollector_scheduler_master_mind_pipe -> datacollector_scheduler_host_discovery_request [weight="5"];
    datacollector_vlab -> datacollector_scheduler_host_discovery_request [weight="5",minlen="2"];
    datacollector_vlab_monitoring_host_discovery_tool_parser -> datacollector_scheduler_host_discovery_request [weight="5",minlen="3"];
    datacollector_vlab_monitoring -> datacollector_scheduler_host_discovery_request [weight="5",minlen="2"];
    datetime -> datacollector_scheduler_host_discovery_request [weight="5",minlen="3"];
    tcpclientserver_client -> datacollector_scheduler_host_discovery_request [weight="5",minlen="3"];
    tcpclientserver -> datacollector_scheduler_host_discovery_request [weight="5",minlen="3"];
    datacollector_main -> datacollector_scheduler_host_discovery_request [weight="5",minlen="2"];
    os -> datacollector_scheduler_simple_scheduler [weight="5",minlen="3"];
    schedule -> datacollector_scheduler_simple_scheduler [weight="5",minlen="3"];
    datacollector_scheduler_port_scanning_request -> datacollector_scheduler_simple_scheduler [weight="5"];
    time -> datacollector_scheduler_simple_scheduler [weight="2",minlen="3"];
    datacollector_scheduler_host_discovery_request -> datacollector_scheduler_simple_scheduler [weight="5"];
    datacollector_scheduler_master_mind_pipe -> datacollector_scheduler_ping_pong_test [weight="5"];
    datetime -> datacollector_scheduler_ping_pong_test [weight="5",minlen="3"];
    tcpclientserver_client -> datacollector_scheduler_ping_pong_test [weight="5",minlen="3"];
    datacollector_scheduler_host_discovery_request -> datacollector_scheduler_ping_pong_test [weight="5"];
    datacollector_scheduler_ping_pong_test -> datacollector_scheduler_ping_pong_test [weight="5",minlen="0"];
    tcpclientserver -> datacollector_scheduler_ping_pong_test [weight="5",minlen="3"];
    datacollector_scheduler_redis_communication_manager -> datacollector_scheduler_ping_pong_test [weight="5"];
    datacollector_scheduler_mqttbroker_expert -> datacollector_scheduler_ping_pong_test [weight="5"];
    datacollector_scheduler_port_scanning_request -> datacollector_scheduler_ping_pong_test [weight="5"];
    datacollector_scheduler_simple_scheduler -> datacollector_scheduler_ping_pong_test [weight="5"];
    datacollector_scheduler_master_mind_pipe -> datacollector_scheduler_redis_communication_manager [weight="5"];
    datacollector_scheduler_host_discovery_request -> datacollector_scheduler_redis_communication_manager [weight="5"];
    messageqclient -> datacollector_scheduler_redis_communication_manager [weight="5",minlen="3"];
    datacollector_scheduler_ping_pong_test -> datacollector_scheduler_redis_communication_manager [weight="5"];
    messageqclient_constants -> datacollector_scheduler_redis_communication_manager [weight="5",minlen="3"];
    datacollector_scheduler_mqttbroker_expert -> datacollector_scheduler_redis_communication_manager [weight="5"];
    datacollector_scheduler_redis_communication_manager -> datacollector_scheduler_redis_communication_manager [weight="5",minlen="0"];
    datacollector_scheduler_port_scanning_request -> datacollector_scheduler_redis_communication_manager [weight="5"];
    datacollector_scheduler_simple_scheduler -> datacollector_scheduler_redis_communication_manager [weight="5"];
    re -> datacollector_vlab_monitoring_port_scan_response_parser [weight="5",minlen="4"];
    tcpclientserver_server -> datacollector_vlab_monitoring_port_scan_response_parser [weight="5",minlen="4"];
    tcpclientserver -> datacollector_vlab_monitoring_port_scan_response_parser [weight="5",minlen="4"];
    datacollector_vlab_monitoring_host_discovery_book -> datacollector_vlab_monitoring_host_discovery_tool_parser [weight="5"];
    tcpclientserver_server -> datacollector_vlab_monitoring_host_discovery_tool_parser [weight="5",minlen="4"];
    datacollector_main -> datacollector_vlab_monitoring_host_discovery_tool_parser [weight="5",minlen="3"];
    tcpclientserver -> datacollector_vlab_monitoring_host_discovery_tool_parser [weight="5",minlen="4"];
    os -> logging [weight="5"];
    time -> logging [weight="2"];
    time -> datetime [weight="2"];
    os -> logging_handlers [weight="5",minlen="2"];
    time -> logging_handlers [weight="2",minlen="2"];
    re -> logging_handlers [weight="5",minlen="2"];
    os -> configparser [weight="5"];
    re -> configparser [weight="5"];
    os -> daemonize [weight="5"];
    logging_handlers -> daemonize [weight="5",minlen="2"];
    logging -> daemonize [weight="5"];
    tcpclientserver_client -> tcpclientserver_client [weight="5",minlen="0"];
    tcpclientserver_server -> tcpclientserver_client [weight="5"];
    time -> tcpclientserver_client [weight="2",minlen="2"];
    tcpclientserver_server -> tcpclientserver_server [weight="5",minlen="0"];
    tcpclientserver_client -> tcpclientserver_server [weight="5"];
    datetime -> schedule [weight="5"];
    time -> schedule [weight="2"];
    logging -> schedule [weight="5"];
    re -> schedule [weight="5"];
    datacollector_daemon_tools [label="datacollector\.\ndaemon_tools",fillcolor="#b83d3d",fontcolor="#ffffff"];
    datacollector_vlab_monitoring_port_scan_response_parser [label="datacollector\.\nvlab\.\nmonitoring\.\nport_scan_response_parser",fillcolor="#b03a3a",fontcolor="#ffffff"];
    datacollector_vlab_monitoring_host_discovery_tool_parser [label="datacollector\.\nvlab\.\nmonitoring\.\nhost_discovery_tool_parser",fillcolor="#a13535",fontcolor="#ffffff"];   
    time [fillcolor="#f97c10"];
    tcpclientserver_client [label="tcpclientserver\.\nclient",fillcolor="#cabc16"];
    datacollector_scheduler_ping_pong_test [label="datacollector\.\nscheduler\.\nping_pong_test",fillcolor="#821717",fontcolor="#ffffff"];
    datacollector_scheduler [label="datacollector\.\nscheduler",fillcolor="#db2f2f",fontcolor="#ffffff"];
    logging [fillcolor="#8ed024"];
    mqttbrokerclient [fillcolor="#63b653"];
    datacollector_generic_server_config_data [label="datacollector\.\ngeneric_server_config_data",fillcolor="#db2f2f",fontcolor="#ffffff"];
    datacollector_external_configuration [label="datacollector\.\nexternal_configuration",fillcolor="#993333",fontcolor="#ffffff"];
    schedule [fillcolor="#439d5f",fontcolor="#ffffff"];
    datacollector_main [label="datacollector\.\nmain",fillcolor="#c11515",fontcolor="#ffffff"];
    datacollector_default_section_config_data [label="datacollector\.\ndefault_section_config_data",fillcolor="#ce3b3b",fontcolor="#ffffff"];
    configparser [fillcolor="#49ac95"];
    mastermind [fillcolor="#539fb6"];
    datacollector_scheduler_master_mind_pipe [label="datacollector\.\nscheduler\.\nmaster_mind_pipe",fillcolor="#ca1616",fontcolor="#ffffff"];
    datacollector_vlab_monitoring [label="datacollector\.\nvlab\.\nmonitoring",fillcolor="#ce3b3b",fontcolor="#ffffff"];
    logging_handlers [label="logging\.\nhandlers",fillcolor="#7da838"];
    datacollector_local_logger [label="datacollector\.\nlocal_logger",fillcolor="#a83838",fontcolor="#ffffff"];
    datacollector_scheduler_host_discovery_request [label="datacollector\.\nscheduler\.\nhost_discovery_request",fillcolor="#a51212",fontcolor="#ffffff"];
    datacollector_scheduler_redis_communication_manager [label="datacollector\.\nscheduler\.\nredis_communication_manager",fillcolor="#910707",fontcolor="#ffffff"];
    daemonize [fillcolor="#4663a4",fontcolor="#ffffff"];
    datacollector_scheduler_port_scanning_request [label="datacollector\.\nscheduler\.\nport_scanning_request",fillcolor="#8a0f0f",fontcolor="#ffffff"];
    os [fillcolor="#3816f3",fontcolor="#ffffff"];
    messageqclient [fillcolor="#9053b6",fontcolor="#ffffff"];
    tcpclientserver [fillcolor="#f9e710"];
    messageqclient_constants [label="messageqclient\.\nconstants",fillcolor="#9053b6",fontcolor="#ffffff"];
    datacollector_redismq_config_data [label="datacollector\.\nredismq_config_data",fillcolor="#b83d3d",fontcolor="#ffffff"];
    datacollector_control_unit [label="datacollector\.\ncontrol_unit",fillcolor="#7a2828",fontcolor="#ffffff"];
    tcpclientserver_server [label="tcpclientserver\.\nserver",fillcolor="#c8bb23"];
    datacollector_vlab [label="datacollector\.\nvlab",fillcolor="#ce3b3b",fontcolor="#ffffff"];
    datacollector_vlab_monitoring_host_discovery_book [label="datacollector\.\nvlab\.\nmonitoring\.\nhost_discovery_book",fillcolor="#ce3b3b",fontcolor="#ffffff"];
    datetime [fillcolor="#d926cb",fontcolor="#ffffff"];
    datacollector_nmap_config_data [label="datacollector\.\nnmap_config_data",fillcolor="#b83d3d",fontcolor="#ffffff"];
    datacollector_vlab_monitoring_port_scan_book [label="datacollector\.\nvlab\.\nmonitoring\.\nport_scan_book",fillcolor="#c24747",fontcolor="#ffffff"];
    datacollector_scheduler_mqttbroker_expert [label="datacollector\.\nscheduler\.\nmqttbroker_expert",fillcolor="#d92626",fontcolor="#ffffff"];
    re [fillcolor="#db2f7e",fontcolor="#ffffff"];
    datacollector_mqttbroker_config_data [label="datacollector\.\nmqttbroker_config_data",fillcolor="#b83d3d",fontcolor="#ffffff"];
    datacollector_scheduler_simple_scheduler [label="datacollector\.\nscheduler\.\nsimple_scheduler",fillcolor="#b62020",fontcolor="#ffffff"];
}

