<?xml version="1.0" encoding="UTF-8" standalone="no"?>
<!DOCTYPE svg PUBLIC "-//W3C//DTD SVG 1.1//EN"
 "http://www.w3.org/Graphics/SVG/1.1/DTD/svg11.dtd">
<!-- Generated by graphviz version 2.38.0 (20140413.2041)
 -->
<!-- Title: G Pages: 1 -->
<svg width="1402pt" height="1751pt"
 viewBox="0.00 0.00 1402.00 1751.35" xmlns="http://www.w3.org/2000/svg" xmlns:xlink="http://www.w3.org/1999/xlink">
<g id="graph0" class="graph" transform="scale(1 1) rotate(0) translate(4 1747.35)">
<title>G</title>
<polygon fill="white" stroke="none" points="-4,4 -4,-1747.35 1398,-1747.35 1398,4 -4,4"/>
<!-- logging_handlers -->
<g id="node1" class="node"><title>logging_handlers</title>
<ellipse fill="#7da838" stroke="black" cx="1040" cy="-1578.14" rx="37.4533" ry="21.4286"/>
<text text-anchor="middle" x="1040" y="-1581.14" font-family="Helvetica,sans-Serif" font-size="10.00" fill="#000000">logging.</text>
<text text-anchor="middle" x="1040" y="-1570.14" font-family="Helvetica,sans-Serif" font-size="10.00" fill="#000000">handlers</text>
</g>
<!-- datacollector_local_logger -->
<g id="node2" class="node"><title>datacollector_local_logger</title>
<ellipse fill="#a83838" stroke="black" cx="1016" cy="-1342.86" rx="53.066" ry="21.4286"/>
<text text-anchor="middle" x="1016" y="-1345.86" font-family="Helvetica,sans-Serif" font-size="10.00" fill="#ffffff">datacollector.</text>
<text text-anchor="middle" x="1016" y="-1334.86" font-family="Helvetica,sans-Serif" font-size="10.00" fill="#ffffff">local_logger</text>
</g>
<!-- logging_handlers&#45;&gt;datacollector_local_logger -->
<g id="edge1" class="edge"><title>logging_handlers&#45;&gt;datacollector_local_logger</title>
<path fill="none" stroke="black" d="M1044.41,-1557.02C1051.97,-1520.99 1065.86,-1446.91 1058,-1422.29"/>
<path fill="none" stroke="black" d="M1058,-1420.29C1051.81,-1403.64 1042.48,-1386.2 1034.18,-1372.19"/>
<polygon fill="black" stroke="black" points="1037.1,-1370.25 1028.92,-1363.52 1031.11,-1373.89 1037.1,-1370.25"/>
</g>
<!-- daemonize -->
<g id="node19" class="node"><title>daemonize</title>
<ellipse fill="#4663a4" stroke="black" cx="1124" cy="-1421.29" rx="37.8497" ry="18"/>
<text text-anchor="middle" x="1124" y="-1418.79" font-family="Helvetica,sans-Serif" font-size="10.00" fill="#ffffff">daemonize</text>
</g>
<!-- logging_handlers&#45;&gt;daemonize -->
<g id="edge89" class="edge"><title>logging_handlers&#45;&gt;daemonize</title>
<path fill="none" stroke="black" d="M1072.45,-1566.96C1093.8,-1558.38 1120.11,-1543.77 1133,-1520.93 1145.41,-1498.91 1140.61,-1469.67 1134.26,-1448.75"/>
<polygon fill="black" stroke="black" points="1137.57,-1447.6 1131.09,-1439.22 1130.93,-1449.81 1137.57,-1447.6"/>
</g>
<!-- datacollector_main -->
<g id="node15" class="node"><title>datacollector_main</title>
<ellipse fill="#c11515" stroke="black" cx="1016" cy="-1186.01" rx="53.066" ry="21.4286"/>
<text text-anchor="middle" x="1016" y="-1189.01" font-family="Helvetica,sans-Serif" font-size="10.00" fill="#ffffff">datacollector.</text>
<text text-anchor="middle" x="1016" y="-1178.01" font-family="Helvetica,sans-Serif" font-size="10.00" fill="#ffffff">main</text>
</g>
<!-- datacollector_local_logger&#45;&gt;datacollector_main -->
<g id="edge26" class="edge"><title>datacollector_local_logger&#45;&gt;datacollector_main</title>
<path fill="none" stroke="black" d="M1016,-1321.61C1016,-1295.07 1016,-1248.26 1016,-1217.43"/>
<polygon fill="black" stroke="black" points="1019.5,-1217.26 1016,-1207.26 1012.5,-1217.26 1019.5,-1217.26"/>
</g>
<!-- logging -->
<g id="node3" class="node"><title>logging</title>
<ellipse fill="#8ed024" stroke="black" cx="1096" cy="-1499.71" rx="27.8353" ry="18"/>
<text text-anchor="middle" x="1096" y="-1497.21" font-family="Helvetica,sans-Serif" font-size="10.00" fill="#000000">logging</text>
</g>
<!-- logging&#45;&gt;datacollector_local_logger -->
<g id="edge2" class="edge"><title>logging&#45;&gt;datacollector_local_logger</title>
<path fill="none" stroke="black" d="M1086.18,-1482.63C1077.44,-1467.57 1064.99,-1444.16 1058,-1422.29"/>
</g>
<!-- logging&#45;&gt;daemonize -->
<g id="edge90" class="edge"><title>logging&#45;&gt;daemonize</title>
<path fill="none" stroke="black" d="M1102.07,-1482.13C1105.64,-1472.38 1110.24,-1459.83 1114.3,-1448.75"/>
<polygon fill="black" stroke="black" points="1117.68,-1449.69 1117.84,-1439.1 1111.11,-1447.29 1117.68,-1449.69"/>
</g>
<!-- schedule -->
<g id="node36" class="node"><title>schedule</title>
<ellipse fill="#439d5f" stroke="black" cx="45.9976" cy="-843.723" rx="32.9303" ry="18"/>
<text text-anchor="middle" x="45.9976" y="-841.223" font-family="Helvetica,sans-Serif" font-size="10.00" fill="#ffffff">schedule</text>
</g>
<!-- logging&#45;&gt;schedule -->
<g id="edge98" class="edge"><title>logging&#45;&gt;schedule</title>
<path fill="none" stroke="black" d="M1081.02,-1484.19C1057.74,-1462.48 1010.6,-1421.78 962.998,-1400.07 895.492,-1369.3 868.685,-1392.11 799.998,-1364.07 767.018,-1350.61 765.455,-1333.87 731.998,-1321.65 626.562,-1283.11 587.616,-1323.68 481.998,-1285.65 297.768,-1219.31 187.567,-1234.03 105.998,-1056.02"/>
</g>
<!-- datacollector_default_section_config_data -->
<g id="node4" class="node"><title>datacollector_default_section_config_data</title>
<ellipse fill="#ce3b3b" stroke="black" cx="855.998" cy="-1421.29" rx="97.6615" ry="21.4286"/>
<text text-anchor="middle" x="855.998" y="-1424.29" font-family="Helvetica,sans-Serif" font-size="10.00" fill="#ffffff">datacollector.</text>
<text text-anchor="middle" x="855.998" y="-1413.29" font-family="Helvetica,sans-Serif" font-size="10.00" fill="#ffffff">default_section_config_data</text>
</g>
<!-- datacollector_default_section_config_data&#45;&gt;datacollector_local_logger -->
<g id="edge3" class="edge"><title>datacollector_default_section_config_data&#45;&gt;datacollector_local_logger</title>
<path fill="none" stroke="black" d="M894.729,-1401.78C918.676,-1390.35 949.415,-1375.66 973.954,-1363.94"/>
<polygon fill="black" stroke="black" points="975.513,-1367.08 983.027,-1359.61 972.495,-1360.76 975.513,-1367.08"/>
</g>
<!-- datacollector_external_configuration -->
<g id="node23" class="node"><title>datacollector_external_configuration</title>
<ellipse fill="#993333" stroke="black" cx="643.998" cy="-1342.86" rx="79.3924" ry="21.4286"/>
<text text-anchor="middle" x="643.998" y="-1345.86" font-family="Helvetica,sans-Serif" font-size="10.00" fill="#ffffff">datacollector.</text>
<text text-anchor="middle" x="643.998" y="-1334.86" font-family="Helvetica,sans-Serif" font-size="10.00" fill="#ffffff">external_configuration</text>
</g>
<!-- datacollector_default_section_config_data&#45;&gt;datacollector_external_configuration -->
<g id="edge22" class="edge"><title>datacollector_default_section_config_data&#45;&gt;datacollector_external_configuration</title>
<path fill="none" stroke="black" d="M807.626,-1402.85C775.37,-1391.22 732.886,-1375.9 699.291,-1363.79"/>
<polygon fill="black" stroke="black" points="700.215,-1360.41 689.62,-1360.31 697.841,-1366.99 700.215,-1360.41"/>
</g>
<!-- datacollector_generic_server_config_data -->
<g id="node5" class="node"><title>datacollector_generic_server_config_data</title>
<ellipse fill="#db2f2f" stroke="black" cx="305.998" cy="-1499.71" rx="96.3333" ry="21.4286"/>
<text text-anchor="middle" x="305.998" y="-1502.71" font-family="Helvetica,sans-Serif" font-size="10.00" fill="#ffffff">datacollector.</text>
<text text-anchor="middle" x="305.998" y="-1491.71" font-family="Helvetica,sans-Serif" font-size="10.00" fill="#ffffff">generic_server_config_data</text>
</g>
<!-- datacollector_nmap_config_data -->
<g id="node6" class="node"><title>datacollector_nmap_config_data</title>
<ellipse fill="#b83d3d" stroke="black" cx="633.998" cy="-1421.29" rx="67.7647" ry="21.4286"/>
<text text-anchor="middle" x="633.998" y="-1424.29" font-family="Helvetica,sans-Serif" font-size="10.00" fill="#ffffff">datacollector.</text>
<text text-anchor="middle" x="633.998" y="-1413.29" font-family="Helvetica,sans-Serif" font-size="10.00" fill="#ffffff">nmap_config_data</text>
</g>
<!-- datacollector_generic_server_config_data&#45;&gt;datacollector_nmap_config_data -->
<g id="edge4" class="edge"><title>datacollector_generic_server_config_data&#45;&gt;datacollector_nmap_config_data</title>
<path fill="none" stroke="black" d="M373.003,-1484.4C423.652,-1473.41 494.839,-1457.61 556.998,-1442.5 562.59,-1441.14 568.4,-1439.69 574.209,-1438.21"/>
<polygon fill="black" stroke="black" points="575.132,-1441.58 583.947,-1435.71 573.39,-1434.81 575.132,-1441.58"/>
</g>
<!-- datacollector_mqttbroker_config_data -->
<g id="node7" class="node"><title>datacollector_mqttbroker_config_data</title>
<ellipse fill="#b83d3d" stroke="black" cx="293.998" cy="-1421.29" rx="84.2917" ry="21.4286"/>
<text text-anchor="middle" x="293.998" y="-1424.29" font-family="Helvetica,sans-Serif" font-size="10.00" fill="#ffffff">datacollector.</text>
<text text-anchor="middle" x="293.998" y="-1413.29" font-family="Helvetica,sans-Serif" font-size="10.00" fill="#ffffff">mqttbroker_config_data</text>
</g>
<!-- datacollector_generic_server_config_data&#45;&gt;datacollector_mqttbroker_config_data -->
<g id="edge5" class="edge"><title>datacollector_generic_server_config_data&#45;&gt;datacollector_mqttbroker_config_data</title>
<path fill="none" stroke="black" d="M302.782,-1478.23C301.548,-1470.37 300.112,-1461.23 298.763,-1452.64"/>
<polygon fill="black" stroke="black" points="302.19,-1451.89 297.181,-1442.56 295.274,-1452.98 302.19,-1451.89"/>
</g>
<!-- datacollector_redismq_config_data -->
<g id="node18" class="node"><title>datacollector_redismq_config_data</title>
<ellipse fill="#b83d3d" stroke="black" cx="471.998" cy="-1421.29" rx="75.8212" ry="21.4286"/>
<text text-anchor="middle" x="471.998" y="-1424.29" font-family="Helvetica,sans-Serif" font-size="10.00" fill="#ffffff">datacollector.</text>
<text text-anchor="middle" x="471.998" y="-1413.29" font-family="Helvetica,sans-Serif" font-size="10.00" fill="#ffffff">redismq_config_data</text>
</g>
<!-- datacollector_generic_server_config_data&#45;&gt;datacollector_redismq_config_data -->
<g id="edge15" class="edge"><title>datacollector_generic_server_config_data&#45;&gt;datacollector_redismq_config_data</title>
<path fill="none" stroke="black" d="M346.182,-1480.21C369.92,-1469.28 400.093,-1455.39 424.94,-1443.95"/>
<polygon fill="black" stroke="black" points="426.557,-1447.06 434.177,-1439.7 423.63,-1440.7 426.557,-1447.06"/>
</g>
<!-- datacollector_nmap_config_data&#45;&gt;datacollector_external_configuration -->
<g id="edge21" class="edge"><title>datacollector_nmap_config_data&#45;&gt;datacollector_external_configuration</title>
<path fill="none" stroke="black" d="M636.677,-1399.8C637.706,-1391.95 638.902,-1382.8 640.026,-1374.21"/>
<polygon fill="black" stroke="black" points="643.518,-1374.5 641.345,-1364.13 636.577,-1373.59 643.518,-1374.5"/>
</g>
<!-- datacollector_mqttbroker_config_data&#45;&gt;datacollector_external_configuration -->
<g id="edge20" class="edge"><title>datacollector_mqttbroker_config_data&#45;&gt;datacollector_external_configuration</title>
<path fill="none" stroke="black" d="M355.765,-1406.8C416.958,-1393.44 510.523,-1373 574.332,-1359.07"/>
<polygon fill="black" stroke="black" points="575.285,-1362.45 584.308,-1356.89 573.792,-1355.61 575.285,-1362.45"/>
</g>
<!-- datetime -->
<g id="node8" class="node"><title>datetime</title>
<ellipse fill="#d926cb" stroke="black" cx="143.998" cy="-945.484" rx="31.577" ry="18"/>
<text text-anchor="middle" x="143.998" y="-942.984" font-family="Helvetica,sans-Serif" font-size="10.00" fill="#ffffff">datetime</text>
</g>
<!-- datacollector_control_unit -->
<g id="node9" class="node"><title>datacollector_control_unit</title>
<ellipse fill="#7a2828" stroke="black" cx="1277" cy="-21.2132" rx="53.066" ry="21.4286"/>
<text text-anchor="middle" x="1277" y="-24.2132" font-family="Helvetica,sans-Serif" font-size="10.00" fill="#ffffff">datacollector.</text>
<text text-anchor="middle" x="1277" y="-13.2132" font-family="Helvetica,sans-Serif" font-size="10.00" fill="#ffffff">control_unit</text>
</g>
<!-- datetime&#45;&gt;datacollector_control_unit -->
<g id="edge6" class="edge"><title>datetime&#45;&gt;datacollector_control_unit</title>
<path fill="none" stroke="black" d="M141.105,-927.204C138.482,-906.438 136.797,-871.101 149.998,-844.723"/>
<path fill="none" stroke="black" d="M149.998,-842.723C165.223,-812.301 117.739,-811.327 107.998,-778.732 102.598,-760.665 107.681,-755.159 107.998,-736.306 110.22,-604.025 71.6409,-562.713 117.998,-438.801 130.838,-404.478 150.099,-405.584 169.998,-374.81"/>
<path fill="none" stroke="black" d="M169.998,-372.81C176.015,-360.269 175.953,-356.166 183.998,-344.818 206.9,-312.512 231.551,-317.698 245.998,-280.827"/>
<path fill="none" stroke="black" d="M245.998,-278.827C254.564,-256.963 272.146,-217.562 353.998,-156.853 401.625,-121.528 423.207,-129.517 474.998,-100.64"/>
<path fill="none" stroke="black" d="M474.998,-98.6396C537.538,-60.2799 1036.31,-33.4599 1214.23,-25.0321"/>
<polygon fill="black" stroke="black" points="1214.65,-28.5163 1224.47,-24.5504 1214.32,-21.524 1214.65,-28.5163"/>
</g>
<!-- datacollector_scheduler_host_discovery_request -->
<g id="node10" class="node"><title>datacollector_scheduler_host_discovery_request</title>
<ellipse fill="#a51212" stroke="black" cx="533.998" cy="-671.314" rx="84.7059" ry="28.9828"/>
<text text-anchor="middle" x="533.998" y="-679.814" font-family="Helvetica,sans-Serif" font-size="10.00" fill="#ffffff">datacollector.</text>
<text text-anchor="middle" x="533.998" y="-668.814" font-family="Helvetica,sans-Serif" font-size="10.00" fill="#ffffff">scheduler.</text>
<text text-anchor="middle" x="533.998" y="-657.814" font-family="Helvetica,sans-Serif" font-size="10.00" fill="#ffffff">host_discovery_request</text>
</g>
<!-- datetime&#45;&gt;datacollector_scheduler_host_discovery_request -->
<g id="edge45" class="edge"><title>datetime&#45;&gt;datacollector_scheduler_host_discovery_request</title>
<path fill="none" stroke="black" d="M168.42,-933.586C220.295,-909.803 344.073,-849.663 433.998,-778.732 460.767,-757.617 487.008,-729.318 505.888,-707.211"/>
<polygon fill="black" stroke="black" points="508.728,-709.272 512.499,-699.371 503.377,-704.76 508.728,-709.272"/>
</g>
<!-- datacollector_scheduler_ping_pong_test -->
<g id="node11" class="node"><title>datacollector_scheduler_ping_pong_test</title>
<ellipse fill="#821717" stroke="black" cx="428.998" cy="-569.553" rx="58.8803" ry="28.9828"/>
<text text-anchor="middle" x="428.998" y="-578.053" font-family="Helvetica,sans-Serif" font-size="10.00" fill="#ffffff">datacollector.</text>
<text text-anchor="middle" x="428.998" y="-567.053" font-family="Helvetica,sans-Serif" font-size="10.00" fill="#ffffff">scheduler.</text>
<text text-anchor="middle" x="428.998" y="-556.053" font-family="Helvetica,sans-Serif" font-size="10.00" fill="#ffffff">ping_pong_test</text>
</g>
<!-- datetime&#45;&gt;datacollector_scheduler_ping_pong_test -->
<g id="edge55" class="edge"><title>datetime&#45;&gt;datacollector_scheduler_ping_pong_test</title>
<path fill="none" stroke="black" d="M149.998,-842.723C206.253,-730.314 358.957,-868.403 419.998,-758.519"/>
<path fill="none" stroke="black" d="M419.998,-756.519C438.172,-723.801 427.089,-709.242 420.998,-672.314"/>
<path fill="none" stroke="black" d="M420.998,-670.314C417.657,-650.064 419.103,-627.261 421.629,-608.573"/>
<polygon fill="black" stroke="black" points="425.094,-609.065 423.12,-598.656 418.172,-608.025 425.094,-609.065"/>
</g>
<!-- datetime&#45;&gt;schedule -->
<g id="edge96" class="edge"><title>datetime&#45;&gt;schedule</title>
<path fill="none" stroke="black" d="M129.114,-929.333C112.924,-912.853 86.872,-886.332 68.2503,-867.376"/>
<polygon fill="black" stroke="black" points="70.5265,-864.699 61.0218,-860.018 65.5328,-869.604 70.5265,-864.699"/>
</g>
<!-- datacollector_scheduler_host_discovery_request&#45;&gt;datacollector_control_unit -->
<g id="edge7" class="edge"><title>datacollector_scheduler_host_discovery_request&#45;&gt;datacollector_control_unit</title>
<path fill="none" stroke="black" d="M533.998,-466.792C524.849,-328.612 539.646,-290.12 501.998,-156.853 494.463,-130.181 450.978,-114.468 474.998,-100.64"/>
</g>
<!-- datacollector_scheduler_host_discovery_request&#45;&gt;datacollector_scheduler_ping_pong_test -->
<g id="edge57" class="edge"><title>datacollector_scheduler_host_discovery_request&#45;&gt;datacollector_scheduler_ping_pong_test</title>
<path fill="none" stroke="black" d="M506.135,-643.842C492.91,-631.276 476.986,-616.147 463.05,-602.906"/>
<polygon fill="black" stroke="black" points="465.202,-600.123 455.541,-595.773 460.38,-605.198 465.202,-600.123"/>
</g>
<!-- datacollector_scheduler_redis_communication_manager -->
<g id="node12" class="node"><title>datacollector_scheduler_redis_communication_manager</title>
<ellipse fill="#910707" stroke="black" cx="342.998" cy="-467.792" rx="107.46" ry="28.9828"/>
<text text-anchor="middle" x="342.998" y="-476.292" font-family="Helvetica,sans-Serif" font-size="10.00" fill="#ffffff">datacollector.</text>
<text text-anchor="middle" x="342.998" y="-465.292" font-family="Helvetica,sans-Serif" font-size="10.00" fill="#ffffff">scheduler.</text>
<text text-anchor="middle" x="342.998" y="-454.292" font-family="Helvetica,sans-Serif" font-size="10.00" fill="#ffffff">redis_communication_manager</text>
</g>
<!-- datacollector_scheduler_host_discovery_request&#45;&gt;datacollector_scheduler_redis_communication_manager -->
<g id="edge65" class="edge"><title>datacollector_scheduler_host_discovery_request&#45;&gt;datacollector_scheduler_redis_communication_manager</title>
<path fill="none" stroke="black" d="M539.382,-642.189C542.058,-621.615 543.048,-593.422 533.998,-570.553"/>
<path fill="none" stroke="black" d="M533.998,-568.553C527.374,-551.815 528.539,-544.645 514.998,-532.784 492.594,-513.16 463.618,-499.335 435.857,-489.691"/>
<polygon fill="black" stroke="black" points="436.694,-486.281 426.101,-486.451 434.488,-492.924 436.694,-486.281"/>
</g>
<!-- datacollector_scheduler_simple_scheduler -->
<g id="node17" class="node"><title>datacollector_scheduler_simple_scheduler</title>
<ellipse fill="#b62020" stroke="black" cx="427.998" cy="-185.844" rx="65.1077" ry="28.9828"/>
<text text-anchor="middle" x="427.998" y="-194.344" font-family="Helvetica,sans-Serif" font-size="10.00" fill="#ffffff">datacollector.</text>
<text text-anchor="middle" x="427.998" y="-183.344" font-family="Helvetica,sans-Serif" font-size="10.00" fill="#ffffff">scheduler.</text>
<text text-anchor="middle" x="427.998" y="-172.344" font-family="Helvetica,sans-Serif" font-size="10.00" fill="#ffffff">simple_scheduler</text>
</g>
<!-- datacollector_scheduler_host_discovery_request&#45;&gt;datacollector_scheduler_simple_scheduler -->
<g id="edge53" class="edge"><title>datacollector_scheduler_host_discovery_request&#45;&gt;datacollector_scheduler_simple_scheduler</title>
<path fill="none" stroke="black" d="M533.998,-568.553C517.682,-527.326 542.463,-512.315 533.998,-468.792"/>
<path fill="none" stroke="black" d="M533.998,-466.792C516.342,-376.026 472.025,-276.199 446.635,-223.75"/>
<polygon fill="black" stroke="black" points="449.66,-221.969 442.125,-214.521 443.371,-225.043 449.66,-221.969"/>
</g>
<!-- datacollector_scheduler_ping_pong_test&#45;&gt;datacollector_control_unit -->
<g id="edge8" class="edge"><title>datacollector_scheduler_ping_pong_test&#45;&gt;datacollector_control_unit</title>
<path fill="none" stroke="black" d="M371.28,-563.336C323.071,-556.049 255.571,-538.592 212.998,-496.784 171.986,-456.509 136.947,-421.838 169.998,-374.81"/>
</g>
<!-- datacollector_scheduler_ping_pong_test&#45;&gt;datacollector_scheduler_ping_pong_test -->
<g id="edge58" class="edge"><title>datacollector_scheduler_ping_pong_test&#45;&gt;datacollector_scheduler_ping_pong_test</title>
<path fill="none" stroke="black" d="M473.898,-588.23C491.258,-589.06 505.688,-582.835 505.688,-569.553 505.688,-558.97 496.525,-552.867 484.018,-551.244"/>
<polygon fill="black" stroke="black" points="484.018,-547.742 473.898,-550.877 483.764,-554.737 484.018,-547.742"/>
</g>
<!-- datacollector_scheduler_ping_pong_test&#45;&gt;datacollector_scheduler_redis_communication_manager -->
<g id="edge67" class="edge"><title>datacollector_scheduler_ping_pong_test&#45;&gt;datacollector_scheduler_redis_communication_manager</title>
<path fill="none" stroke="black" d="M400.083,-535.012C391.535,-525.097 382.152,-514.212 373.507,-504.184"/>
<polygon fill="black" stroke="black" points="397.446,-537.314 406.627,-542.603 402.748,-532.743 397.446,-537.314"/>
<polygon fill="black" stroke="black" points="375.942,-501.648 366.762,-496.359 370.64,-506.218 375.942,-501.648"/>
</g>
<!-- datacollector_scheduler_redis_communication_manager&#45;&gt;datacollector_control_unit -->
<g id="edge9" class="edge"><title>datacollector_scheduler_redis_communication_manager&#45;&gt;datacollector_control_unit</title>
<path fill="none" stroke="black" d="M312.044,-439.96C274.901,-404.321 220.608,-339.076 245.998,-280.827"/>
</g>
<!-- datacollector_scheduler_redis_communication_manager&#45;&gt;datacollector_scheduler_redis_communication_manager -->
<g id="edge70" class="edge"><title>datacollector_scheduler_redis_communication_manager&#45;&gt;datacollector_scheduler_redis_communication_manager</title>
<path fill="none" stroke="black" d="M430.083,-484.821C452.034,-483.666 468.478,-477.99 468.478,-467.792 468.478,-459.268 456.987,-453.903 440.394,-451.697"/>
<polygon fill="black" stroke="black" points="440.358,-448.18 430.083,-450.764 439.726,-455.151 440.358,-448.18"/>
</g>
<!-- datacollector_scheduler_port_scanning_request -->
<g id="node16" class="node"><title>datacollector_scheduler_port_scanning_request</title>
<ellipse fill="#8a0f0f" stroke="black" cx="629.998" cy="-279.827" rx="81.135" ry="28.9828"/>
<text text-anchor="middle" x="629.998" y="-288.327" font-family="Helvetica,sans-Serif" font-size="10.00" fill="#ffffff">datacollector.</text>
<text text-anchor="middle" x="629.998" y="-277.327" font-family="Helvetica,sans-Serif" font-size="10.00" fill="#ffffff">scheduler.</text>
<text text-anchor="middle" x="629.998" y="-266.327" font-family="Helvetica,sans-Serif" font-size="10.00" fill="#ffffff">port_scanning_request</text>
</g>
<!-- datacollector_scheduler_redis_communication_manager&#45;&gt;datacollector_scheduler_port_scanning_request -->
<g id="edge40" class="edge"><title>datacollector_scheduler_redis_communication_manager&#45;&gt;datacollector_scheduler_port_scanning_request</title>
<path fill="none" stroke="black" d="M376.108,-432.356C402.859,-405.929 442.444,-369.847 481.998,-344.818 507.279,-328.821 537.247,-315.027 563.581,-304.386"/>
<polygon fill="black" stroke="black" points="373.519,-429.995 368.914,-439.536 378.464,-434.949 373.519,-429.995"/>
<polygon fill="black" stroke="black" points="565.098,-307.55 573.103,-300.61 562.517,-301.043 565.098,-307.55"/>
</g>
<!-- datacollector_scheduler_master_mind_pipe -->
<g id="node25" class="node"><title>datacollector_scheduler_master_mind_pipe</title>
<ellipse fill="#ca1616" stroke="black" cx="629.998" cy="-373.81" rx="67.7647" ry="28.9828"/>
<text text-anchor="middle" x="629.998" y="-382.31" font-family="Helvetica,sans-Serif" font-size="10.00" fill="#ffffff">datacollector.</text>
<text text-anchor="middle" x="629.998" y="-371.31" font-family="Helvetica,sans-Serif" font-size="10.00" fill="#ffffff">scheduler.</text>
<text text-anchor="middle" x="629.998" y="-360.31" font-family="Helvetica,sans-Serif" font-size="10.00" fill="#ffffff">master_mind_pipe</text>
</g>
<!-- datacollector_scheduler_redis_communication_manager&#45;&gt;datacollector_scheduler_master_mind_pipe -->
<g id="edge28" class="edge"><title>datacollector_scheduler_redis_communication_manager&#45;&gt;datacollector_scheduler_master_mind_pipe</title>
<path fill="none" stroke="black" d="M420.356,-441.999C466.353,-427.257 523.955,-408.796 567.135,-394.957"/>
<polygon fill="black" stroke="black" points="419.104,-438.725 410.649,-445.11 421.24,-445.391 419.104,-438.725"/>
<polygon fill="black" stroke="black" points="568.219,-398.285 576.673,-391.9 566.082,-391.619 568.219,-398.285"/>
</g>
<!-- datacollector_scheduler -->
<g id="node13" class="node"><title>datacollector_scheduler</title>
<ellipse fill="#db2f2f" stroke="black" cx="1237" cy="-99.6396" rx="53.066" ry="21.4286"/>
<text text-anchor="middle" x="1237" y="-102.64" font-family="Helvetica,sans-Serif" font-size="10.00" fill="#ffffff">datacollector.</text>
<text text-anchor="middle" x="1237" y="-91.6396" font-family="Helvetica,sans-Serif" font-size="10.00" fill="#ffffff">scheduler</text>
</g>
<!-- datacollector_scheduler&#45;&gt;datacollector_control_unit -->
<g id="edge10" class="edge"><title>datacollector_scheduler&#45;&gt;datacollector_control_unit</title>
<path fill="none" stroke="black" d="M1247.51,-78.5595C1251.87,-70.2221 1257.02,-60.3856 1261.78,-51.2842"/>
<polygon fill="black" stroke="black" points="1265.02,-52.6421 1266.56,-42.1592 1258.82,-49.3961 1265.02,-52.6421"/>
</g>
<!-- datacollector_scheduler_mqttbroker_expert -->
<g id="node14" class="node"><title>datacollector_scheduler_mqttbroker_expert</title>
<ellipse fill="#d92626" stroke="black" cx="740.998" cy="-671.314" rx="67.3507" ry="28.9828"/>
<text text-anchor="middle" x="740.998" y="-679.814" font-family="Helvetica,sans-Serif" font-size="10.00" fill="#ffffff">datacollector.</text>
<text text-anchor="middle" x="740.998" y="-668.814" font-family="Helvetica,sans-Serif" font-size="10.00" fill="#ffffff">scheduler.</text>
<text text-anchor="middle" x="740.998" y="-657.814" font-family="Helvetica,sans-Serif" font-size="10.00" fill="#ffffff">mqttbroker_expert</text>
</g>
<!-- datacollector_scheduler_mqttbroker_expert&#45;&gt;datacollector_control_unit -->
<g id="edge11" class="edge"><title>datacollector_scheduler_mqttbroker_expert&#45;&gt;datacollector_control_unit</title>
<path fill="none" stroke="black" d="M804.04,-661.197C844.783,-655.441 898.973,-648.04 946.998,-642.323 1025.08,-633.028 1242.42,-660.931 1299,-606.323 1343.39,-563.469 1318,-530.498 1318,-468.792 1318,-468.792 1318,-468.792 1318,-372.81 1318,-290.158 1266.33,-251.359 1318,-186.844"/>
</g>
<!-- datacollector_scheduler_mqttbroker_expert&#45;&gt;datacollector_scheduler_ping_pong_test -->
<g id="edge61" class="edge"><title>datacollector_scheduler_mqttbroker_expert&#45;&gt;datacollector_scheduler_ping_pong_test</title>
<path fill="none" stroke="black" d="M684.231,-655.435C639.322,-643.291 575.204,-625.12 519.998,-606.323 507.825,-602.178 494.889,-597.355 482.706,-592.617"/>
<polygon fill="black" stroke="black" points="483.714,-589.252 473.127,-588.85 481.152,-595.766 483.714,-589.252"/>
</g>
<!-- datacollector_scheduler_mqttbroker_expert&#45;&gt;datacollector_scheduler_redis_communication_manager -->
<g id="edge69" class="edge"><title>datacollector_scheduler_mqttbroker_expert&#45;&gt;datacollector_scheduler_redis_communication_manager</title>
<path fill="none" stroke="black" d="M711.819,-644.978C675.578,-614.627 610.83,-563.98 547.998,-532.784 511.672,-514.748 469.203,-500.485 432.37,-490.046"/>
<polygon fill="black" stroke="black" points="433.212,-486.647 422.64,-487.339 431.336,-493.391 433.212,-486.647"/>
</g>
<!-- datacollector_main&#45;&gt;datacollector_control_unit -->
<g id="edge12" class="edge"><title>datacollector_main&#45;&gt;datacollector_control_unit</title>
<path fill="none" stroke="black" d="M1052.94,-1162.46C1104.15,-1129.32 1196.12,-1062.58 1247,-982.254 1374.02,-781.725 1394,-706.166 1394,-468.792 1394,-468.792 1394,-468.792 1394,-184.844 1394,-126.883 1344.42,-75.47 1309.81,-46.6396"/>
<polygon fill="black" stroke="black" points="1051.02,-1159.54 1044.48,-1167.87 1054.79,-1165.44 1051.02,-1159.54"/>
<polygon fill="black" stroke="black" points="1311.78,-43.7303 1301.81,-40.1493 1307.37,-49.1669 1311.78,-43.7303"/>
</g>
<!-- datacollector_main&#45;&gt;datacollector_scheduler_host_discovery_request -->
<g id="edge48" class="edge"><title>datacollector_main&#45;&gt;datacollector_scheduler_host_discovery_request</title>
<path fill="none" stroke="black" d="M1020.77,-1164.79C1025.93,-1138.51 1031.5,-1091.77 1016,-1056.02"/>
<path fill="none" stroke="black" d="M1016,-1054.02C995.826,-1013.67 963.741,-1032.69 920.998,-1018.25 868.245,-1000.43 842.771,-1019.07 800.998,-982.254 775.915,-960.148 755.738,-874.22 739.998,-844.723"/>
</g>
<!-- datacollector_main&#45;&gt;datacollector_scheduler_master_mind_pipe -->
<g id="edge30" class="edge"><title>datacollector_main&#45;&gt;datacollector_scheduler_master_mind_pipe</title>
<path fill="none" stroke="black" d="M1016,-1054.02C986.939,-995.734 1002.15,-964.955 1035,-908.715 1048.45,-885.689 1070.33,-896.18 1083,-872.715 1146.92,-754.31 1090.21,-704.595 1102,-570.553"/>
</g>
<!-- datacollector_vlab_monitoring_host_discovery_tool_parser -->
<g id="node35" class="node"><title>datacollector_vlab_monitoring_host_discovery_tool_parser</title>
<ellipse fill="#a13535" stroke="black" cx="657.998" cy="-945.484" rx="96.3333" ry="36.5405"/>
<text text-anchor="middle" x="657.998" y="-959.484" font-family="Helvetica,sans-Serif" font-size="10.00" fill="#ffffff">datacollector.</text>
<text text-anchor="middle" x="657.998" y="-948.484" font-family="Helvetica,sans-Serif" font-size="10.00" fill="#ffffff">vlab.</text>
<text text-anchor="middle" x="657.998" y="-937.484" font-family="Helvetica,sans-Serif" font-size="10.00" fill="#ffffff">monitoring.</text>
<text text-anchor="middle" x="657.998" y="-926.484" font-family="Helvetica,sans-Serif" font-size="10.00" fill="#ffffff">host_discovery_tool_parser</text>
</g>
<!-- datacollector_main&#45;&gt;datacollector_vlab_monitoring_host_discovery_tool_parser -->
<g id="edge78" class="edge"><title>datacollector_main&#45;&gt;datacollector_vlab_monitoring_host_discovery_tool_parser</title>
<path fill="none" stroke="black" d="M972.109,-1173.87C905.545,-1156.3 783.183,-1121.13 748.998,-1091.79 735.337,-1080.07 742.548,-1068.93 729.998,-1056.02"/>
</g>
<!-- datacollector_scheduler_port_scanning_request&#45;&gt;datacollector_control_unit -->
<g id="edge13" class="edge"><title>datacollector_scheduler_port_scanning_request&#45;&gt;datacollector_control_unit</title>
<path fill="none" stroke="black" d="M710.086,-274.364C883.576,-263.829 1281.5,-234.646 1318,-186.844"/>
<path fill="none" stroke="black" d="M1318,-184.844C1348.33,-145.115 1319.55,-85.5419 1297.29,-50.6012"/>
<polygon fill="black" stroke="black" points="1299.95,-48.2798 1291.53,-41.8559 1294.11,-52.1318 1299.95,-48.2798"/>
</g>
<!-- datacollector_scheduler_port_scanning_request&#45;&gt;datacollector_scheduler_ping_pong_test -->
<g id="edge62" class="edge"><title>datacollector_scheduler_port_scanning_request&#45;&gt;datacollector_scheduler_ping_pong_test</title>
<path fill="none" stroke="black" d="M593.854,-305.817C579.903,-316.677 564.555,-330.247 552.998,-344.818 506.07,-403.982 514.952,-431.499 476.998,-496.784 469.913,-508.969 461.557,-521.886 453.82,-533.353"/>
<polygon fill="black" stroke="black" points="450.799,-531.569 448.054,-541.803 456.582,-535.515 450.799,-531.569"/>
</g>
<!-- datacollector_scheduler_port_scanning_request&#45;&gt;datacollector_scheduler_simple_scheduler -->
<g id="edge51" class="edge"><title>datacollector_scheduler_port_scanning_request&#45;&gt;datacollector_scheduler_simple_scheduler</title>
<path fill="none" stroke="black" d="M581.099,-256.56C551.153,-242.924 512.792,-225.456 481.961,-211.417"/>
<polygon fill="black" stroke="black" points="483.203,-208.137 472.652,-207.178 480.302,-214.507 483.203,-208.137"/>
</g>
<!-- datacollector_scheduler_simple_scheduler&#45;&gt;datacollector_control_unit -->
<g id="edge14" class="edge"><title>datacollector_scheduler_simple_scheduler&#45;&gt;datacollector_control_unit</title>
<path fill="none" stroke="black" d="M435.401,-156.678C442.187,-137.112 454.395,-112.501 474.998,-100.64"/>
</g>
<!-- datacollector_scheduler_simple_scheduler&#45;&gt;datacollector_scheduler_ping_pong_test -->
<g id="edge63" class="edge"><title>datacollector_scheduler_simple_scheduler&#45;&gt;datacollector_scheduler_ping_pong_test</title>
<path fill="none" stroke="black" d="M412.45,-214.233C394.11,-247.74 363.862,-306.954 345.973,-363.102"/>
<polygon fill="black" stroke="black" points="342.582,-362.223 342.998,-372.81 349.275,-364.275 342.582,-362.223"/>
<path fill="none" stroke="black" d="M342.998,-374.81C324.956,-430.857 257.812,-388.628 226.998,-438.801 213.511,-460.76 212.136,-475.731 226.998,-496.784 259.301,-542.542 323.437,-559.303 370.813,-565.347"/>
</g>
<!-- datacollector_scheduler_simple_scheduler&#45;&gt;datacollector_scheduler_redis_communication_manager -->
<g id="edge72" class="edge"><title>datacollector_scheduler_simple_scheduler&#45;&gt;datacollector_scheduler_redis_communication_manager</title>
<path fill="none" stroke="black" d="M342.998,-374.81C336.343,-395.483 336.759,-420.151 338.611,-438.735"/>
</g>
<!-- datacollector_redismq_config_data&#45;&gt;datacollector_external_configuration -->
<g id="edge19" class="edge"><title>datacollector_redismq_config_data&#45;&gt;datacollector_external_configuration</title>
<path fill="none" stroke="black" d="M511.027,-1402.94C536.03,-1391.83 568.673,-1377.33 595.359,-1365.47"/>
<polygon fill="black" stroke="black" points="596.81,-1368.66 604.527,-1361.4 593.968,-1362.26 596.81,-1368.66"/>
</g>
<!-- datacollector_daemon_tools -->
<g id="node20" class="node"><title>datacollector_daemon_tools</title>
<ellipse fill="#b83d3d" stroke="black" cx="1146" cy="-1264.43" rx="54.3945" ry="21.4286"/>
<text text-anchor="middle" x="1146" y="-1267.43" font-family="Helvetica,sans-Serif" font-size="10.00" fill="#ffffff">datacollector.</text>
<text text-anchor="middle" x="1146" y="-1256.43" font-family="Helvetica,sans-Serif" font-size="10.00" fill="#ffffff">daemon_tools</text>
</g>
<!-- daemonize&#45;&gt;datacollector_daemon_tools -->
<g id="edge16" class="edge"><title>daemonize&#45;&gt;datacollector_daemon_tools</title>
<path fill="none" stroke="black" d="M1140.14,-1404.76C1153.33,-1390.26 1169.58,-1367.38 1168,-1343.86"/>
<path fill="none" stroke="black" d="M1168,-1341.86C1166.93,-1326.01 1162.38,-1308.96 1157.69,-1295"/>
<polygon fill="black" stroke="black" points="1160.94,-1293.7 1154.3,-1285.44 1154.34,-1296.04 1160.94,-1293.7"/>
</g>
<!-- datacollector_daemon_tools&#45;&gt;datacollector_main -->
<g id="edge23" class="edge"><title>datacollector_daemon_tools&#45;&gt;datacollector_main</title>
<path fill="none" stroke="black" d="M1116.82,-1246.28C1098.26,-1235.37 1074.02,-1221.12 1053.96,-1209.32"/>
<polygon fill="black" stroke="black" points="1055.47,-1206.15 1045.07,-1204.1 1051.92,-1212.19 1055.47,-1206.15"/>
</g>
<!-- time -->
<g id="node21" class="node"><title>time</title>
<ellipse fill="#f97c10" stroke="black" cx="516.998" cy="-1725.35" rx="27" ry="18"/>
<text text-anchor="middle" x="516.998" y="-1722.85" font-family="Helvetica,sans-Serif" font-size="10.00" fill="#000000">time</text>
</g>
<!-- time&#45;&gt;logging_handlers -->
<g id="edge84" class="edge"><title>time&#45;&gt;logging_handlers</title>
<path fill="none" stroke="black" d="M544.095,-1722.29C610.86,-1716.67 788.09,-1698.44 928.998,-1654.35"/>
<path fill="none" stroke="black" d="M928.998,-1652.35C960.701,-1642.43 991.835,-1620.53 1013.02,-1603.25"/>
<polygon fill="black" stroke="black" points="1015.49,-1605.76 1020.91,-1596.66 1011,-1600.39 1015.49,-1605.76"/>
</g>
<!-- time&#45;&gt;logging -->
<g id="edge81" class="edge"><title>time&#45;&gt;logging</title>
<path fill="none" stroke="black" d="M105.998,-1652.35C69.9704,-1560.67 873.397,-1512.48 1058.4,-1502.62"/>
<polygon fill="black" stroke="black" points="1058.67,-1506.12 1068.47,-1502.09 1058.3,-1499.13 1058.67,-1506.12"/>
</g>
<!-- time&#45;&gt;datetime -->
<g id="edge82" class="edge"><title>time&#45;&gt;datetime</title>
<path fill="none" stroke="black" d="M105.998,-1420.29C105.772,-1349.42 143.998,-1336.3 143.998,-1265.43 143.998,-1265.43 143.998,-1265.43 143.998,-1127.79 143.998,-1073.17 143.998,-1009.28 143.998,-973.793"/>
<polygon fill="black" stroke="black" points="147.498,-973.734 143.998,-963.734 140.498,-973.734 147.498,-973.734"/>
</g>
<!-- time&#45;&gt;datacollector_scheduler_simple_scheduler -->
<g id="edge52" class="edge"><title>time&#45;&gt;datacollector_scheduler_simple_scheduler</title>
<path fill="none" stroke="black" d="M490.094,-1722.49C400.196,-1715.93 115.336,-1692.21 105.998,-1654.35"/>
<path fill="none" stroke="black" d="M105.998,-1652.35C98.2054,-1620.76 86.7379,-1605.37 105.998,-1579.14"/>
<path fill="none" stroke="black" d="M105.998,-1577.14C146.734,-1521.67 110.359,-1490.97 105.998,-1422.29"/>
<path fill="none" stroke="black" d="M105.998,-1420.29C72.6205,-1210.67 81.5752,-1155.74 45.9976,-946.484"/>
<path fill="none" stroke="black" d="M45.9976,-944.484C37.8391,-908.438 13.6679,-908.385 3.99764,-872.715 -2.74521,-847.843 1.49279,-840.38 3.99764,-814.732 20.5925,-644.811 -0.259415,-587.855 82.9976,-438.801 112.27,-386.395 130.327,-378.525 179.998,-344.818 212.26,-322.925 228.781,-332.179 259.998,-308.818 273.118,-299 271.246,-291.12 283.998,-280.827"/>
<path fill="none" stroke="black" d="M283.998,-278.827C311.991,-252.871 348.228,-229.767 377.348,-213.206"/>
<polygon fill="black" stroke="black" points="379.126,-216.222 386.139,-208.281 375.704,-210.115 379.126,-216.222"/>
</g>
<!-- time&#45;&gt;datacollector_daemon_tools -->
<g id="edge17" class="edge"><title>time&#45;&gt;datacollector_daemon_tools</title>
<path fill="none" stroke="black" d="M928.998,-1652.35C946.569,-1646.85 1070.82,-1609.78 1086,-1599.35 1123.31,-1573.71 1130.46,-1561.27 1151,-1520.93 1186.86,-1450.47 1173.3,-1422.74 1168,-1343.86"/>
</g>
<!-- tcpclientserver_client -->
<g id="node32" class="node"><title>tcpclientserver_client</title>
<ellipse fill="#cabc16" stroke="black" cx="867.998" cy="-1342.86" rx="58.8803" ry="21.4286"/>
<text text-anchor="middle" x="867.998" y="-1345.86" font-family="Helvetica,sans-Serif" font-size="10.00" fill="#000000">tcpclientserver.</text>
<text text-anchor="middle" x="867.998" y="-1334.86" font-family="Helvetica,sans-Serif" font-size="10.00" fill="#000000">client</text>
</g>
<!-- time&#45;&gt;tcpclientserver_client -->
<g id="edge93" class="edge"><title>time&#45;&gt;tcpclientserver_client</title>
<path fill="none" stroke="black" d="M105.998,-1577.14C131.597,-1536.3 931.512,-1478.99 962.998,-1442.5 975.316,-1428.22 972.338,-1416.45 962.998,-1400.07 953.386,-1383.22 936.517,-1370.9 919.634,-1362.17"/>
<polygon fill="black" stroke="black" points="920.829,-1358.86 910.3,-1357.68 917.796,-1365.17 920.829,-1358.86"/>
</g>
<!-- time&#45;&gt;schedule -->
<g id="edge97" class="edge"><title>time&#45;&gt;schedule</title>
<path fill="none" stroke="black" d="M45.9976,-944.484C41.8636,-920.169 42.3289,-892.036 43.5558,-871.856"/>
<polygon fill="black" stroke="black" points="47.0516,-872.038 44.2688,-861.815 40.0692,-871.542 47.0516,-872.038"/>
</g>
<!-- configparser -->
<g id="node22" class="node"><title>configparser</title>
<ellipse fill="#49ac95" stroke="black" cx="1036" cy="-1653.35" rx="41.4139" ry="18"/>
<text text-anchor="middle" x="1036" y="-1650.85" font-family="Helvetica,sans-Serif" font-size="10.00" fill="#000000">configparser</text>
</g>
<!-- configparser&#45;&gt;datacollector_external_configuration -->
<g id="edge18" class="edge"><title>configparser&#45;&gt;datacollector_external_configuration</title>
<path fill="none" stroke="black" d="M1013.19,-1638.04C962.967,-1606.02 840.048,-1524.95 748.998,-1442.5 730.234,-1425.51 729.184,-1417.68 710.998,-1400.07 700.201,-1389.62 687.737,-1378.85 676.51,-1369.56"/>
<polygon fill="black" stroke="black" points="678.552,-1366.71 668.595,-1363.09 674.122,-1372.13 678.552,-1366.71"/>
</g>
<!-- datacollector_external_configuration&#45;&gt;datacollector_main -->
<g id="edge24" class="edge"><title>datacollector_external_configuration&#45;&gt;datacollector_main</title>
<path fill="none" stroke="black" d="M671.647,-1322.91C709,-1297.58 773.907,-1254.53 799.998,-1243.22 814.868,-1236.77 902.572,-1214.74 961.55,-1200.25"/>
<polygon fill="black" stroke="black" points="962.599,-1203.59 971.478,-1197.81 960.932,-1196.8 962.599,-1203.59"/>
</g>
<!-- mqttbrokerclient -->
<g id="node24" class="node"><title>mqttbrokerclient</title>
<ellipse fill="#63b653" stroke="black" cx="860.998" cy="-945.484" rx="50.7503" ry="18"/>
<text text-anchor="middle" x="860.998" y="-942.984" font-family="Helvetica,sans-Serif" font-size="10.00" fill="#000000">mqttbrokerclient</text>
</g>
<!-- mqttbrokerclient&#45;&gt;datacollector_scheduler_mqttbroker_expert -->
<g id="edge27" class="edge"><title>mqttbrokerclient&#45;&gt;datacollector_scheduler_mqttbroker_expert</title>
<path fill="none" stroke="black" d="M842.766,-928.517C828.39,-914.994 808.851,-894.394 796.998,-872.715 768.4,-820.411 753.402,-752.27 746.353,-710.442"/>
<polygon fill="black" stroke="black" points="749.781,-709.713 744.729,-700.4 742.871,-710.83 749.781,-709.713"/>
</g>
<!-- datacollector_scheduler_master_mind_pipe&#45;&gt;datacollector_scheduler_host_discovery_request -->
<g id="edge41" class="edge"><title>datacollector_scheduler_master_mind_pipe&#45;&gt;datacollector_scheduler_host_discovery_request</title>
<path fill="none" stroke="black" d="M609.998,-468.792C579.872,-528.351 554.808,-602.829 542.393,-642.465"/>
</g>
<!-- datacollector_scheduler_master_mind_pipe&#45;&gt;datacollector_scheduler_ping_pong_test -->
<g id="edge54" class="edge"><title>datacollector_scheduler_master_mind_pipe&#45;&gt;datacollector_scheduler_ping_pong_test</title>
<path fill="none" stroke="black" d="M627.601,-403.007C625.489,-419.075 621.537,-439.544 614.17,-457.604"/>
<polygon fill="black" stroke="black" points="610.945,-456.24 609.998,-466.792 617.319,-459.134 610.945,-456.24"/>
<path fill="none" stroke="black" d="M609.998,-468.792C596.434,-495.607 523.133,-530.041 474.073,-550.643"/>
</g>
<!-- datacollector_scheduler_master_mind_pipe&#45;&gt;datacollector_scheduler_port_scanning_request -->
<g id="edge35" class="edge"><title>datacollector_scheduler_master_mind_pipe&#45;&gt;datacollector_scheduler_port_scanning_request</title>
<path fill="none" stroke="black" d="M629.998,-344.712C629.998,-336.674 629.998,-327.772 629.998,-319.229"/>
<polygon fill="black" stroke="black" points="633.498,-319.069 629.998,-309.07 626.498,-319.07 633.498,-319.069"/>
</g>
<!-- mastermind -->
<g id="node26" class="node"><title>mastermind</title>
<ellipse fill="#539fb6" stroke="black" cx="995.998" cy="-671.314" rx="40.0582" ry="18"/>
<text text-anchor="middle" x="995.998" y="-668.814" font-family="Helvetica,sans-Serif" font-size="10.00" fill="#000000">mastermind</text>
</g>
<!-- mastermind&#45;&gt;datacollector_scheduler_master_mind_pipe -->
<g id="edge29" class="edge"><title>mastermind&#45;&gt;datacollector_scheduler_master_mind_pipe</title>
<path fill="none" stroke="black" d="M1021.89,-657.389C1049.91,-641.509 1091.96,-611.546 1102,-570.553"/>
<path fill="none" stroke="black" d="M1102,-568.553C1142.72,-402.19 852.656,-376.609 708.263,-374.051"/>
<polygon fill="black" stroke="black" points="708.175,-370.549 698.126,-373.905 708.074,-377.549 708.175,-370.549"/>
</g>
<!-- datacollector_vlab_monitoring_port_scan_response_parser -->
<g id="node27" class="node"><title>datacollector_vlab_monitoring_port_scan_response_parser</title>
<ellipse fill="#b03a3a" stroke="black" cx="1141" cy="-945.484" rx="96.7474" ry="36.5405"/>
<text text-anchor="middle" x="1141" y="-959.484" font-family="Helvetica,sans-Serif" font-size="10.00" fill="#ffffff">datacollector.</text>
<text text-anchor="middle" x="1141" y="-948.484" font-family="Helvetica,sans-Serif" font-size="10.00" fill="#ffffff">vlab.</text>
<text text-anchor="middle" x="1141" y="-937.484" font-family="Helvetica,sans-Serif" font-size="10.00" fill="#ffffff">monitoring.</text>
<text text-anchor="middle" x="1141" y="-926.484" font-family="Helvetica,sans-Serif" font-size="10.00" fill="#ffffff">port_scan_response_parser</text>
</g>
<!-- datacollector_vlab_monitoring_port_scan_response_parser&#45;&gt;datacollector_scheduler_port_scanning_request -->
<g id="edge31" class="edge"><title>datacollector_vlab_monitoring_port_scan_response_parser&#45;&gt;datacollector_scheduler_port_scanning_request</title>
<path fill="none" stroke="black" d="M1139.92,-908.434C1139.63,-889.458 1139.69,-865.813 1141,-844.723"/>
</g>
<!-- datacollector_vlab -->
<g id="node28" class="node"><title>datacollector_vlab</title>
<ellipse fill="#ce3b3b" stroke="black" cx="1021" cy="-843.723" rx="53.066" ry="21.4286"/>
<text text-anchor="middle" x="1021" y="-846.723" font-family="Helvetica,sans-Serif" font-size="10.00" fill="#ffffff">datacollector.</text>
<text text-anchor="middle" x="1021" y="-835.723" font-family="Helvetica,sans-Serif" font-size="10.00" fill="#ffffff">vlab</text>
</g>
<!-- datacollector_vlab&#45;&gt;datacollector_scheduler_host_discovery_request -->
<g id="edge42" class="edge"><title>datacollector_vlab&#45;&gt;datacollector_scheduler_host_discovery_request</title>
<path fill="none" stroke="black" d="M979.938,-829.944C961.976,-824.689 940.575,-818.876 920.998,-814.732 835.979,-796.737 581.493,-831.294 533.998,-758.519"/>
</g>
<!-- datacollector_vlab&#45;&gt;datacollector_scheduler_port_scanning_request -->
<g id="edge32" class="edge"><title>datacollector_vlab&#45;&gt;datacollector_scheduler_port_scanning_request</title>
<path fill="none" stroke="black" d="M1061.03,-829.598C1091.38,-816.987 1129.72,-794.459 1141,-758.519"/>
<path fill="none" stroke="black" d="M1141,-756.519C1152.2,-720.811 1133.38,-708.954 1141,-672.314"/>
</g>
<!-- datacollector_vlab_monitoring_host_discovery_book -->
<g id="node29" class="node"><title>datacollector_vlab_monitoring_host_discovery_book</title>
<ellipse fill="#ce3b3b" stroke="black" cx="834.998" cy="-1055.02" rx="77.1494" ry="36.5405"/>
<text text-anchor="middle" x="834.998" y="-1069.02" font-family="Helvetica,sans-Serif" font-size="10.00" fill="#ffffff">datacollector.</text>
<text text-anchor="middle" x="834.998" y="-1058.02" font-family="Helvetica,sans-Serif" font-size="10.00" fill="#ffffff">vlab.</text>
<text text-anchor="middle" x="834.998" y="-1047.02" font-family="Helvetica,sans-Serif" font-size="10.00" fill="#ffffff">monitoring.</text>
<text text-anchor="middle" x="834.998" y="-1036.02" font-family="Helvetica,sans-Serif" font-size="10.00" fill="#ffffff">host_discovery_book</text>
</g>
<!-- datacollector_vlab_monitoring_host_discovery_book&#45;&gt;datacollector_scheduler_port_scanning_request -->
<g id="edge33" class="edge"><title>datacollector_vlab_monitoring_host_discovery_book&#45;&gt;datacollector_scheduler_port_scanning_request</title>
<path fill="none" stroke="black" d="M874.887,-1023.5C914.752,-993.356 978.131,-946.439 1035,-908.715 1080.85,-878.294 1137.59,-899.648 1141,-844.723"/>
<path fill="none" stroke="black" d="M1141,-842.723C1142.83,-805.344 1129.79,-794.227 1141,-758.519"/>
</g>
<!-- datacollector_vlab_monitoring_host_discovery_book&#45;&gt;datacollector_vlab_monitoring_host_discovery_tool_parser -->
<g id="edge76" class="edge"><title>datacollector_vlab_monitoring_host_discovery_book&#45;&gt;datacollector_vlab_monitoring_host_discovery_tool_parser</title>
<path fill="none" stroke="black" d="M788.03,-1025.49C766.234,-1012.25 740.092,-996.362 716.983,-982.322"/>
<polygon fill="black" stroke="black" points="718.653,-979.241 708.29,-977.04 715.019,-985.224 718.653,-979.241"/>
</g>
<!-- os -->
<g id="node30" class="node"><title>os</title>
<ellipse fill="#3816f3" stroke="black" cx="1088" cy="-1725.35" rx="27" ry="18"/>
<text text-anchor="middle" x="1088" y="-1722.85" font-family="Helvetica,sans-Serif" font-size="10.00" fill="#ffffff">os</text>
</g>
<!-- os&#45;&gt;logging_handlers -->
<g id="edge83" class="edge"><title>os&#45;&gt;logging_handlers</title>
<path fill="none" stroke="black" d="M1095.18,-1707.9C1100.53,-1693.86 1106.65,-1673.04 1105,-1654.35"/>
<path fill="none" stroke="black" d="M1105,-1652.35C1103.14,-1631.3 1087.76,-1613.43 1072.42,-1600.61"/>
<polygon fill="black" stroke="black" points="1074.51,-1597.8 1064.48,-1594.38 1070.19,-1603.31 1074.51,-1597.8"/>
</g>
<!-- os&#45;&gt;logging -->
<g id="edge80" class="edge"><title>os&#45;&gt;logging</title>
<path fill="none" stroke="black" d="M1105,-1652.35C1101.18,-1609.07 1098.55,-1558.68 1097.16,-1528.27"/>
<polygon fill="black" stroke="black" points="1100.64,-1527.85 1096.7,-1518.02 1093.65,-1528.16 1100.64,-1527.85"/>
</g>
<!-- os&#45;&gt;datacollector_scheduler_port_scanning_request -->
<g id="edge34" class="edge"><title>os&#45;&gt;datacollector_scheduler_port_scanning_request</title>
<path fill="none" stroke="black" d="M1356,-1498.71C1324.89,-1437.32 1356,-1412.68 1356,-1343.86 1356,-1343.86 1356,-1343.86 1356,-568.553 1356,-471.447 1331.1,-435.127 1255,-374.81"/>
</g>
<!-- os&#45;&gt;datacollector_scheduler_simple_scheduler -->
<g id="edge49" class="edge"><title>os&#45;&gt;datacollector_scheduler_simple_scheduler</title>
<path fill="none" stroke="black" d="M1063.21,-1717.67C1050.12,-1714.29 1033.76,-1710.29 1019,-1707.35 834.46,-1670.56 181.998,-1767.31 181.998,-1579.14 181.998,-1579.14 181.998,-1579.14 181.998,-1185.01 181.998,-1062.2 198.469,-1030.78 184.998,-908.715 180.303,-866.173 180.435,-854.25 163.998,-814.732 156.706,-797.201 146.322,-796.957 140.998,-778.732 135.709,-760.633 138.764,-755.029 140.998,-736.306 157.111,-601.222 168.925,-567.506 212.998,-438.801 225.466,-402.389 255.775,-306.996 283.998,-280.827"/>
</g>
<!-- os&#45;&gt;daemonize -->
<g id="edge88" class="edge"><title>os&#45;&gt;daemonize</title>
<path fill="none" stroke="black" d="M1114.13,-1720.62C1146.87,-1714.84 1203.37,-1701.13 1242,-1671.35 1314.24,-1615.67 1398.77,-1581.27 1356,-1500.71"/>
<path fill="none" stroke="black" d="M1356,-1498.71C1338.79,-1464.76 1231.65,-1440.85 1169.15,-1429.58"/>
<polygon fill="black" stroke="black" points="1169.61,-1426.11 1159.15,-1427.82 1168.39,-1433 1169.61,-1426.11"/>
</g>
<!-- os&#45;&gt;configparser -->
<g id="edge86" class="edge"><title>os&#45;&gt;configparser</title>
<path fill="none" stroke="black" d="M1076.46,-1708.82C1069.98,-1700.09 1061.74,-1689.01 1054.39,-1679.11"/>
<polygon fill="black" stroke="black" points="1057,-1676.76 1048.23,-1670.82 1051.38,-1680.93 1057,-1676.76"/>
</g>
<!-- datacollector_vlab_monitoring -->
<g id="node31" class="node"><title>datacollector_vlab_monitoring</title>
<ellipse fill="#ce3b3b" stroke="black" cx="858.998" cy="-843.723" rx="53.066" ry="28.9828"/>
<text text-anchor="middle" x="858.998" y="-852.223" font-family="Helvetica,sans-Serif" font-size="10.00" fill="#ffffff">datacollector.</text>
<text text-anchor="middle" x="858.998" y="-841.223" font-family="Helvetica,sans-Serif" font-size="10.00" fill="#ffffff">vlab.</text>
<text text-anchor="middle" x="858.998" y="-830.223" font-family="Helvetica,sans-Serif" font-size="10.00" fill="#ffffff">monitoring</text>
</g>
<!-- datacollector_vlab_monitoring&#45;&gt;datacollector_scheduler_host_discovery_request -->
<g id="edge44" class="edge"><title>datacollector_vlab_monitoring&#45;&gt;datacollector_scheduler_host_discovery_request</title>
<path fill="none" stroke="black" d="M811.983,-830.079C793.871,-825.237 772.982,-819.688 753.998,-814.732 656.351,-789.242 589.153,-843.032 533.998,-758.519"/>
</g>
<!-- datacollector_vlab_monitoring&#45;&gt;datacollector_scheduler_port_scanning_request -->
<g id="edge36" class="edge"><title>datacollector_vlab_monitoring&#45;&gt;datacollector_scheduler_port_scanning_request</title>
<path fill="none" stroke="black" d="M892.752,-820.99C931.786,-794.963 996.84,-748.776 1045,-700.306 1095.37,-649.604 1103.51,-632.008 1140,-570.553"/>
<path fill="none" stroke="black" d="M1140,-568.553C1148.95,-552.936 1147.97,-547.013 1159,-532.784 1184.82,-499.465 1214.9,-508.516 1229,-468.792"/>
<path fill="none" stroke="black" d="M1229,-466.792C1243.21,-426.757 1288.29,-401.198 1255,-374.81"/>
<path fill="none" stroke="black" d="M1255,-372.81C1174.13,-308.713 874.447,-289.147 721.332,-283.278"/>
<polygon fill="black" stroke="black" points="721.137,-279.768 711.014,-282.895 720.877,-286.764 721.137,-279.768"/>
</g>
<!-- tcpclientserver_client&#45;&gt;datacollector_scheduler_host_discovery_request -->
<g id="edge46" class="edge"><title>tcpclientserver_client&#45;&gt;datacollector_scheduler_host_discovery_request</title>
<path fill="none" stroke="black" d="M495.998,-944.484C485.574,-886.772 507.572,-872.047 519.998,-814.732 525.453,-789.57 548.069,-780.08 533.998,-758.519"/>
<path fill="none" stroke="black" d="M533.998,-756.519C525.259,-743.216 523.954,-725.998 525.339,-710.601"/>
<polygon fill="black" stroke="black" points="528.859,-710.669 526.67,-700.303 521.917,-709.772 528.859,-710.669"/>
</g>
<!-- tcpclientserver_client&#45;&gt;datacollector_scheduler_ping_pong_test -->
<g id="edge56" class="edge"><title>tcpclientserver_client&#45;&gt;datacollector_scheduler_ping_pong_test</title>
<path fill="none" stroke="black" d="M819.607,-1330.63C806.741,-1327.68 792.849,-1324.52 779.998,-1321.65 643.666,-1291.21 495.998,-1326.69 495.998,-1187.01 495.998,-1187.01 495.998,-1187.01 495.998,-1127.79 495.998,-1047.21 507.509,-1026.24 495.998,-946.484"/>
<path fill="none" stroke="black" d="M495.998,-944.484C482.034,-856.296 376.639,-836.572 419.998,-758.519"/>
</g>
<!-- tcpclientserver_client&#45;&gt;datacollector_scheduler_port_scanning_request -->
<g id="edge37" class="edge"><title>tcpclientserver_client&#45;&gt;datacollector_scheduler_port_scanning_request</title>
<path fill="none" stroke="black" d="M902.275,-1325.52C998.816,-1279.25 1266,-1149.34 1266,-1128.79 1266,-1128.79 1266,-1128.79 1266,-1054.02 1266,-988.892 1282.63,-963.236 1247,-908.715 1216.89,-862.649 1138.3,-899.688 1141,-844.723"/>
</g>
<!-- tcpclientserver_client&#45;&gt;tcpclientserver_client -->
<g id="edge91" class="edge"><title>tcpclientserver_client&#45;&gt;tcpclientserver_client</title>
<path fill="none" stroke="black" d="M910.972,-1357.33C929.178,-1358.42 944.688,-1353.6 944.688,-1342.86 944.688,-1334.22 934.645,-1329.4 921.235,-1328.42"/>
<polygon fill="black" stroke="black" points="920.985,-1324.92 910.972,-1328.38 920.959,-1331.92 920.985,-1324.92"/>
</g>
<!-- tcpclientserver_server -->
<g id="node40" class="node"><title>tcpclientserver_server</title>
<ellipse fill="#c8bb23" stroke="black" cx="867.998" cy="-1264.43" rx="58.8803" ry="21.4286"/>
<text text-anchor="middle" x="867.998" y="-1267.43" font-family="Helvetica,sans-Serif" font-size="10.00" fill="#000000">tcpclientserver.</text>
<text text-anchor="middle" x="867.998" y="-1256.43" font-family="Helvetica,sans-Serif" font-size="10.00" fill="#000000">server</text>
</g>
<!-- tcpclientserver_client&#45;&gt;tcpclientserver_server -->
<g id="edge95" class="edge"><title>tcpclientserver_client&#45;&gt;tcpclientserver_server</title>
<path fill="none" stroke="black" d="M867.998,-1311.28C867.998,-1306.17 867.998,-1300.88 867.998,-1295.78"/>
<polygon fill="black" stroke="black" points="864.498,-1311.38 867.998,-1321.38 871.498,-1311.38 864.498,-1311.38"/>
<polygon fill="black" stroke="black" points="871.498,-1295.71 867.998,-1285.71 864.498,-1295.71 871.498,-1295.71"/>
</g>
<!-- tcpclientserver -->
<g id="node33" class="node"><title>tcpclientserver</title>
<ellipse fill="#f9e710" stroke="black" cx="669.998" cy="-1264.43" rx="47.1863" ry="18"/>
<text text-anchor="middle" x="669.998" y="-1261.93" font-family="Helvetica,sans-Serif" font-size="10.00" fill="#000000">tcpclientserver</text>
</g>
<!-- tcpclientserver&#45;&gt;datacollector_scheduler_host_discovery_request -->
<g id="edge47" class="edge"><title>tcpclientserver&#45;&gt;datacollector_scheduler_host_discovery_request</title>
<path fill="none" stroke="black" d="M533.998,-842.723C529.946,-805.519 554.451,-789.859 533.998,-758.519"/>
</g>
<!-- tcpclientserver&#45;&gt;datacollector_scheduler_ping_pong_test -->
<g id="edge59" class="edge"><title>tcpclientserver&#45;&gt;datacollector_scheduler_ping_pong_test</title>
<path fill="none" stroke="black" d="M671.263,-1246.41C673.445,-1210.52 676.095,-1124.74 657.998,-1056.02"/>
<path fill="none" stroke="black" d="M657.998,-1054.02C638.513,-1000.96 582.748,-1030.32 552.998,-982.254 520.522,-929.786 540.678,-906.066 533.998,-844.723"/>
<path fill="none" stroke="black" d="M533.998,-842.723C519.749,-752.972 435.789,-761.978 420.998,-672.314"/>
</g>
<!-- tcpclientserver&#45;&gt;datacollector_scheduler_port_scanning_request -->
<g id="edge38" class="edge"><title>tcpclientserver&#45;&gt;datacollector_scheduler_port_scanning_request</title>
<path fill="none" stroke="black" d="M702.147,-1251.19C709.614,-1248.46 717.555,-1245.66 724.998,-1243.22 810.291,-1215.23 862.828,-1257.03 918.998,-1187.01"/>
<path fill="none" stroke="black" d="M918.998,-1185.01C944.89,-1152.73 938.897,-850.903 958.998,-814.732 983.943,-769.842 1130.54,-722.593 1141,-672.314"/>
<path fill="none" stroke="black" d="M1141,-670.314C1152.76,-627.564 1117.95,-609.021 1140,-570.553"/>
</g>
<!-- tcpclientserver&#45;&gt;datacollector_vlab_monitoring_port_scan_response_parser -->
<g id="edge75" class="edge"><title>tcpclientserver&#45;&gt;datacollector_vlab_monitoring_port_scan_response_parser</title>
<path fill="none" stroke="black" d="M918.998,-1185.01C978.805,-1127.77 943.894,-1077.22 1002,-1018.25 1019.09,-1000.9 1041.27,-986.901 1062.87,-976.031"/>
<polygon fill="black" stroke="black" points="1064.61,-979.078 1072.08,-971.563 1061.55,-972.78 1064.61,-979.078"/>
</g>
<!-- tcpclientserver&#45;&gt;datacollector_vlab_monitoring_host_discovery_tool_parser -->
<g id="edge79" class="edge"><title>tcpclientserver&#45;&gt;datacollector_vlab_monitoring_host_discovery_tool_parser</title>
<path fill="none" stroke="black" d="M657.998,-1054.02C652.798,-1034.28 652.04,-1011.78 652.879,-992.488"/>
<polygon fill="black" stroke="black" points="656.377,-992.616 653.469,-982.428 649.389,-992.206 656.377,-992.616"/>
</g>
<!-- datacollector_vlab_monitoring_port_scan_book -->
<g id="node34" class="node"><title>datacollector_vlab_monitoring_port_scan_book</title>
<ellipse fill="#c24747" stroke="black" cx="1229" cy="-569.553" rx="60.623" ry="36.5405"/>
<text text-anchor="middle" x="1229" y="-583.553" font-family="Helvetica,sans-Serif" font-size="10.00" fill="#ffffff">datacollector.</text>
<text text-anchor="middle" x="1229" y="-572.553" font-family="Helvetica,sans-Serif" font-size="10.00" fill="#ffffff">vlab.</text>
<text text-anchor="middle" x="1229" y="-561.553" font-family="Helvetica,sans-Serif" font-size="10.00" fill="#ffffff">monitoring.</text>
<text text-anchor="middle" x="1229" y="-550.553" font-family="Helvetica,sans-Serif" font-size="10.00" fill="#ffffff">port_scan_book</text>
</g>
<!-- datacollector_vlab_monitoring_port_scan_book&#45;&gt;datacollector_scheduler_port_scanning_request -->
<g id="edge39" class="edge"><title>datacollector_vlab_monitoring_port_scan_book&#45;&gt;datacollector_scheduler_port_scanning_request</title>
<path fill="none" stroke="black" d="M1223.27,-532.478C1221.59,-513.07 1221.81,-489.032 1229,-468.792"/>
</g>
<!-- datacollector_vlab_monitoring_host_discovery_tool_parser&#45;&gt;datacollector_scheduler_host_discovery_request -->
<g id="edge43" class="edge"><title>datacollector_vlab_monitoring_host_discovery_tool_parser&#45;&gt;datacollector_scheduler_host_discovery_request</title>
<path fill="none" stroke="black" d="M708.57,-914.027C732.686,-895.371 753.614,-870.239 739.998,-844.723"/>
<path fill="none" stroke="black" d="M739.998,-842.723C693.431,-755.462 588.055,-841.349 533.998,-758.519"/>
</g>
<!-- schedule&#45;&gt;datacollector_scheduler_simple_scheduler -->
<g id="edge50" class="edge"><title>schedule&#45;&gt;datacollector_scheduler_simple_scheduler</title>
<path fill="none" stroke="black" d="M44.1382,-825.367C38.6498,-765.381 28.1097,-563.671 117.998,-438.801 137.518,-411.683 158.264,-424.114 183.998,-402.801 190.746,-397.212 277.179,-286.331 283.998,-280.827"/>
</g>
<!-- messageqclient -->
<g id="node37" class="node"><title>messageqclient</title>
<ellipse fill="#9053b6" stroke="black" cx="341.998" cy="-757.519" rx="50.0727" ry="18"/>
<text text-anchor="middle" x="341.998" y="-755.019" font-family="Helvetica,sans-Serif" font-size="10.00" fill="#ffffff">messageqclient</text>
</g>
<!-- messageqclient&#45;&gt;datacollector_scheduler_redis_communication_manager -->
<g id="edge66" class="edge"><title>messageqclient&#45;&gt;datacollector_scheduler_redis_communication_manager</title>
<path fill="none" stroke="black" d="M338.865,-739.233C336.429,-721.842 334.573,-694.495 341.998,-672.314"/>
</g>
<!-- messageqclient_constants -->
<g id="node38" class="node"><title>messageqclient_constants</title>
<ellipse fill="#9053b6" stroke="black" cx="211.998" cy="-757.519" rx="62.4516" ry="21.4286"/>
<text text-anchor="middle" x="211.998" y="-760.519" font-family="Helvetica,sans-Serif" font-size="10.00" fill="#ffffff">messageqclient.</text>
<text text-anchor="middle" x="211.998" y="-749.519" font-family="Helvetica,sans-Serif" font-size="10.00" fill="#ffffff">constants</text>
</g>
<!-- messageqclient_constants&#45;&gt;datacollector_scheduler_redis_communication_manager -->
<g id="edge68" class="edge"><title>messageqclient_constants&#45;&gt;datacollector_scheduler_redis_communication_manager</title>
<path fill="none" stroke="black" d="M258.152,-743.226C290.384,-730.933 329.748,-708.906 341.998,-672.314"/>
<path fill="none" stroke="black" d="M341.998,-670.314C360.223,-615.873 355.494,-548.425 349.75,-507.013"/>
<polygon fill="black" stroke="black" points="353.205,-506.451 348.282,-497.07 346.281,-507.474 353.205,-506.451"/>
</g>
<!-- re -->
<g id="node39" class="node"><title>re</title>
<ellipse fill="#db2f7e" stroke="black" cx="982.998" cy="-1725.35" rx="27" ry="18"/>
<text text-anchor="middle" x="982.998" y="-1722.85" font-family="Helvetica,sans-Serif" font-size="10.00" fill="#ffffff">re</text>
</g>
<!-- re&#45;&gt;logging_handlers -->
<g id="edge85" class="edge"><title>re&#45;&gt;logging_handlers</title>
<path fill="none" stroke="black" d="M980.06,-1707.18C977.678,-1688.67 976.136,-1658.71 985.998,-1635.35 991.272,-1622.86 1000.69,-1611.53 1010.2,-1602.37"/>
<polygon fill="black" stroke="black" points="1012.71,-1604.82 1017.77,-1595.51 1008.01,-1599.64 1012.71,-1604.82"/>
</g>
<!-- re&#45;&gt;configparser -->
<g id="edge87" class="edge"><title>re&#45;&gt;configparser</title>
<path fill="none" stroke="black" d="M994.76,-1708.82C1001.43,-1700.01 1009.93,-1688.78 1017.48,-1678.81"/>
<polygon fill="black" stroke="black" points="1020.28,-1680.9 1023.53,-1670.82 1014.7,-1676.68 1020.28,-1680.9"/>
</g>
<!-- re&#45;&gt;datacollector_vlab_monitoring_port_scan_response_parser -->
<g id="edge73" class="edge"><title>re&#45;&gt;datacollector_vlab_monitoring_port_scan_response_parser</title>
<path fill="none" stroke="black" d="M1007.44,-1717.51C1035.56,-1709.05 1082.52,-1693.06 1119,-1671.35 1173.52,-1638.9 1228,-1642.59 1228,-1579.14 1228,-1579.14 1228,-1579.14 1228,-1127.79 1228,-1076.62 1199.48,-1024.61 1175.09,-989.492"/>
<polygon fill="black" stroke="black" points="1177.66,-987.056 1169,-980.94 1171.95,-991.116 1177.66,-987.056"/>
</g>
<!-- re&#45;&gt;schedule -->
<g id="edge99" class="edge"><title>re&#45;&gt;schedule</title>
<path fill="none" stroke="black" d="M956.099,-1723.48C818.555,-1718.93 199.082,-1697.04 167.998,-1671.35 135.351,-1644.38 143.998,-1621.49 143.998,-1579.14 143.998,-1579.14 143.998,-1579.14 143.998,-1498.71 143.998,-1393.67 105.998,-1370.48 105.998,-1265.43 105.998,-1265.43 105.998,-1265.43 105.998,-1185.01 105.998,-1127.68 122.255,-1111 105.998,-1056.02"/>
<path fill="none" stroke="black" d="M105.998,-1054.02C86.0363,-988.645 64.336,-911.191 53.3145,-871.347"/>
<polygon fill="black" stroke="black" points="56.6592,-870.31 50.6245,-861.602 49.9115,-872.173 56.6592,-870.31"/>
</g>
<!-- tcpclientserver_server&#45;&gt;datacollector_vlab_monitoring_port_scan_response_parser -->
<g id="edge74" class="edge"><title>tcpclientserver_server&#45;&gt;datacollector_vlab_monitoring_port_scan_response_parser</title>
<path fill="none" stroke="black" d="M926.806,-1263.27C974.027,-1259.91 1038.72,-1247.47 1078,-1207.22 1134.18,-1149.64 1143.23,-1051.05 1143.17,-993.006"/>
<polygon fill="black" stroke="black" points="1146.67,-992.623 1143.06,-982.66 1139.67,-992.696 1146.67,-992.623"/>
</g>
<!-- tcpclientserver_server&#45;&gt;datacollector_vlab_monitoring_host_discovery_tool_parser -->
<g id="edge77" class="edge"><title>tcpclientserver_server&#45;&gt;datacollector_vlab_monitoring_host_discovery_tool_parser</title>
<path fill="none" stroke="black" d="M853.292,-1243.86C830.001,-1212.51 783.714,-1148.77 748.998,-1091.79 739.631,-1076.42 741.492,-1069.88 729.998,-1056.02"/>
<path fill="none" stroke="black" d="M729.998,-1054.02C711.694,-1035.08 695.053,-1010.93 682.392,-990.315"/>
<polygon fill="black" stroke="black" points="685.374,-988.482 677.216,-981.723 679.378,-992.095 685.374,-988.482"/>
</g>
<!-- tcpclientserver_server&#45;&gt;tcpclientserver_server -->
<g id="edge94" class="edge"><title>tcpclientserver_server&#45;&gt;tcpclientserver_server</title>
<path fill="none" stroke="black" d="M910.972,-1278.91C929.178,-1280 944.688,-1275.17 944.688,-1264.43 944.688,-1255.79 934.645,-1250.98 921.235,-1250"/>
<polygon fill="black" stroke="black" points="920.985,-1246.5 910.972,-1249.96 920.959,-1253.5 920.985,-1246.5"/>
</g>
</g>
</svg>
