{
  "project_info": {
    "project_number": "80374359571",
    "firebase_url": "https://simple-parking-fbc61-default-rtdb.firebaseio.com",
    "project_id": "simple-parking-fbc61",
    "storage_bucket": "simple-parking-fbc61.appspot.com"
  },
  "client": [
    {
      "client_info": {
        "mobilesdk_app_id": "1:80374359571:android:b7cb2702914a20e00d81e6",
        "android_client_info": {
          "package_name": "com.moonwalk"
        }
      },
      "oauth_client": [
        {
          "client_id": "80374359571-g0kbmgmlcbpgphjv9sdsi60h85sf6gaa.apps.googleusercontent.com",
          "client_type": 3
        }
      ],
      "api_key": [
        {
          "current_key": "AIzaSyBm_n48nP-urU0omGfR06Wq4Mt4rQwz1-w"
        },
        {
          "current_key": "AIzaSyAu0fYDVLK9XN8m8RgCTYeg85ynenJzmUE"
        }
      ],
      "services": {
        "appinvite_service": {
          "other_platform_oauth_client": [
            {
              "client_id": "80374359571-g0kbmgmlcbpgphjv9sdsi60h85sf6gaa.apps.googleusercontent.com",
              "client_type": 3
            },
            {
              "client_id": "80374359571-18qgeaqtsfuj1du9u852g9u3eso6iprh.apps.googleusercontent.com",
              "client_type": 2,
              "ios_info": {
                "bundle_id": "com.xheghun.simpleParking"
              }
            }
          ]
        }
      }
    },
    {
      "client_info": {
        "mobilesdk_app_id": "1:80374359571:android:4c648870b0aed8620d81e6",
        "android_client_info": {
          "package_name": "com.xheghun.simple_parking"
        }
      },
      "oauth_client": [
        {
          "client_id": "80374359571-c2spg24q41uqfa7ie515v52085odccct.apps.googleusercontent.com",
          "client_type": 1,
          "android_info": {
            "package_name": "com.xheghun.simple_parking",
            "certificate_hash": "7b4538f354dbcc3233de0018e50403e4292bdc54"
          }
        },
        {
          "client_id": "80374359571-qbbptr4a12tihelbh23tjl1j41btu9db.apps.googleusercontent.com",
          "client_type": 1,
          "android_info": {
            "package_name": "com.xheghun.simple_parking",
            "certificate_hash": "a2452a8fdb4579da96e15938fdb5364ad09accca"
          }
        },
        {
          "client_id": "80374359571-g0kbmgmlcbpgphjv9sdsi60h85sf6gaa.apps.googleusercontent.com",
          "client_type": 3
        }
      ],
      "api_key": [
        {
          "current_key": "AIzaSyBm_n48nP-urU0omGfR06Wq4Mt4rQwz1-w"
        },
        {
          "current_key": "AIzaSyAu0fYDVLK9XN8m8RgCTYeg85ynenJzmUE"
        }
      ],
      "services": {
        "appinvite_service": {
          "other_platform_oauth_client": [
            {
              "client_id": "80374359571-g0kbmgmlcbpgphjv9sdsi60h85sf6gaa.apps.googleusercontent.com",
              "client_type": 3
            },
            {
              "client_id": "80374359571-18qgeaqtsfuj1du9u852g9u3eso6iprh.apps.googleusercontent.com",
              "client_type": 2,
              "ios_info": {
                "bundle_id": "com.xheghun.simpleParking"
              }
            }
          ]
        }
      }
    }
  ],
  "configuration_version": "1"
}