{
  "ios": {
    "debug": {
      "codeSignIdentity": "iPhone Developer",
      "provisioningProfile": "466ce38b-8806-45bd-852b-fcd726f8cdb3",
      "developmentTeam": "5H9WFF9ZZY",
      "packageType": "development",
      "buildFlag": [
        "-UseModernBuildSystem=0"
      ]
    },
    "release": {
      "codeSignIdentity": "iPhone Distribution",
      "provisioningProfile": "466ce38b-8806-45bd-852b-fcd726f8cdb3",
      "developmentTeam": "5H9WFF9ZZY",
      "packageType": "app-store",
      "buildFlag": [
        "-UseModernBuildSystem=0"
      ]
    }
  }
}
