{
    "group": {
        "app_parameters": {
            "draw_debug": "1",
            "draw_devices": "1",
            "update_devices": "1"
        },
        "device_000327200312": {
            "center": "0, 0, 0",
            "draw_debug": "1",
            "draw_device": "1",
            "orientation": "0, 0, 0",
            "position": "0, 0, 0",
            "position_index": "5"
        },
        "device_000345200312": {
            "center": "0, 0, 0",
            "draw_debug": "1",
            "draw_device": "1",
            "orientation": "0, 0, 0",
            "position": "0, 0, 0",
            "position_index": "4"
        },
        "device_000391100312": {
            "center": "0, 0, 0",
            "draw_debug": "1",
            "draw_device": "1",
            "orientation": "0, 0, 0",
            "position": "0, 0, 0",
            "position_index": "1"
        },
        "device_000485400312": {
            "center": "0, -3.90462, 0",
            "draw_debug": "1",
            "draw_device": "1",
            "orientation": "0, 0, 0",
            "position": "0, 0, 0",
            "position_index": "2"
        },
        "device_000559200312": {
            "center": "0, 0, 0",
            "draw_debug": "1",
            "draw_device": "1",
            "orientation": "0, 0, 0",
            "position": "0, 0, 0",
            "position_index": "3"
        },
        "device_000629400312": {
            "center": "0, 0, 0",
            "draw_debug": "1",
            "draw_device": "1",
            "orientation": "0, 0, 0",
            "position": "0, 0, 0",
            "position_index": "0"
        }
    }
}